lucene-dev mailing list archives

Site index · List index
Message view « Date » · « Thread »
Top « Date » · « Thread »
From Policeman Jenkins Server <jenk...@thetaphi.de>
Subject [JENKINS] Lucene-Solr-trunk-Linux (32bit/jdk1.7.0_60-ea-b10) - Build # 9839 - Failure!
Date Wed, 19 Mar 2014 00:56:47 GMT
Build: http://jenkins.thetaphi.de/job/Lucene-Solr-trunk-Linux/9839/
Java: 32bit/jdk1.7.0_60-ea-b10 -client -XX:+UseSerialGC

1 tests failed.
REGRESSION:  org.apache.solr.client.solrj.impl.CloudSolrServerTest.testDistribSearch

Error Message:
java.util.concurrent.TimeoutException: Could not connect to ZooKeeper 127.0.0.1:53417 within
45000 ms

Stack Trace:
org.apache.solr.common.SolrException: java.util.concurrent.TimeoutException: Could not connect
to ZooKeeper 127.0.0.1:53417 within 45000 ms
	at __randomizedtesting.SeedInfo.seed([90544502E562967D:11B2CB1A923DF641]:0)
	at org.apache.solr.common.cloud.SolrZkClient.<init>(SolrZkClient.java:150)
	at org.apache.solr.common.cloud.SolrZkClient.<init>(SolrZkClient.java:101)
	at org.apache.solr.common.cloud.SolrZkClient.<init>(SolrZkClient.java:91)
	at org.apache.solr.cloud.AbstractZkTestCase.buildZooKeeper(AbstractZkTestCase.java:89)
	at org.apache.solr.cloud.AbstractZkTestCase.buildZooKeeper(AbstractZkTestCase.java:83)
	at org.apache.solr.cloud.AbstractDistribZkTestBase.setUp(AbstractDistribZkTestBase.java:70)
	at org.apache.solr.cloud.AbstractFullDistribZkTestBase.setUp(AbstractFullDistribZkTestBase.java:201)
	at org.apache.solr.client.solrj.impl.CloudSolrServerTest.setUp(CloudSolrServerTest.java:78)
	at sun.reflect.NativeMethodAccessorImpl.invoke0(Native Method)
	at sun.reflect.NativeMethodAccessorImpl.invoke(NativeMethodAccessorImpl.java:57)
	at sun.reflect.DelegatingMethodAccessorImpl.invoke(DelegatingMethodAccessorImpl.java:43)
	at java.lang.reflect.Method.invoke(Method.java:606)
	at com.carrotsearch.randomizedtesting.RandomizedRunner.invoke(RandomizedRunner.java:1617)
	at com.carrotsearch.randomizedtesting.RandomizedRunner$7.evaluate(RandomizedRunner.java:860)
	at com.carrotsearch.randomizedtesting.RandomizedRunner$8.evaluate(RandomizedRunner.java:876)
	at com.carrotsearch.randomizedtesting.rules.SystemPropertiesRestoreRule$1.evaluate(SystemPropertiesRestoreRule.java:53)
	at org.apache.lucene.util.TestRuleSetupTeardownChained$1.evaluate(TestRuleSetupTeardownChained.java:50)
	at org.apache.lucene.util.TestRuleFieldCacheSanity$1.evaluate(TestRuleFieldCacheSanity.java:51)
	at org.apache.lucene.util.AbstractBeforeAfterRule$1.evaluate(AbstractBeforeAfterRule.java:46)
	at com.carrotsearch.randomizedtesting.rules.SystemPropertiesInvariantRule$1.evaluate(SystemPropertiesInvariantRule.java:55)
	at org.apache.lucene.util.TestRuleThreadAndTestName$1.evaluate(TestRuleThreadAndTestName.java:49)
	at org.apache.lucene.util.TestRuleIgnoreAfterMaxFailures$1.evaluate(TestRuleIgnoreAfterMaxFailures.java:70)
	at org.apache.lucene.util.TestRuleMarkFailure$1.evaluate(TestRuleMarkFailure.java:48)
	at com.carrotsearch.randomizedtesting.rules.StatementAdapter.evaluate(StatementAdapter.java:36)
	at com.carrotsearch.randomizedtesting.ThreadLeakControl$StatementRunner.run(ThreadLeakControl.java:359)
	at com.carrotsearch.randomizedtesting.ThreadLeakControl.forkTimeoutingTask(ThreadLeakControl.java:783)
	at com.carrotsearch.randomizedtesting.ThreadLeakControl$3.evaluate(ThreadLeakControl.java:443)
	at com.carrotsearch.randomizedtesting.RandomizedRunner.runSingleTest(RandomizedRunner.java:835)
	at com.carrotsearch.randomizedtesting.RandomizedRunner$3.evaluate(RandomizedRunner.java:737)
	at com.carrotsearch.randomizedtesting.RandomizedRunner$4.evaluate(RandomizedRunner.java:771)
	at com.carrotsearch.randomizedtesting.RandomizedRunner$5.evaluate(RandomizedRunner.java:782)
	at com.carrotsearch.randomizedtesting.rules.StatementAdapter.evaluate(StatementAdapter.java:36)
	at com.carrotsearch.randomizedtesting.rules.SystemPropertiesRestoreRule$1.evaluate(SystemPropertiesRestoreRule.java:53)
	at org.apache.lucene.util.AbstractBeforeAfterRule$1.evaluate(AbstractBeforeAfterRule.java:46)
	at org.apache.lucene.util.TestRuleStoreClassName$1.evaluate(TestRuleStoreClassName.java:42)
	at com.carrotsearch.randomizedtesting.rules.SystemPropertiesInvariantRule$1.evaluate(SystemPropertiesInvariantRule.java:55)
	at com.carrotsearch.randomizedtesting.rules.NoShadowingOrOverridesOnMethodsRule$1.evaluate(NoShadowingOrOverridesOnMethodsRule.java:39)
	at com.carrotsearch.randomizedtesting.rules.NoShadowingOrOverridesOnMethodsRule$1.evaluate(NoShadowingOrOverridesOnMethodsRule.java:39)
	at com.carrotsearch.randomizedtesting.rules.StatementAdapter.evaluate(StatementAdapter.java:36)
	at org.apache.lucene.util.TestRuleAssertionsRequired$1.evaluate(TestRuleAssertionsRequired.java:43)
	at org.apache.lucene.util.TestRuleMarkFailure$1.evaluate(TestRuleMarkFailure.java:48)
	at org.apache.lucene.util.TestRuleIgnoreAfterMaxFailures$1.evaluate(TestRuleIgnoreAfterMaxFailures.java:70)
	at org.apache.lucene.util.TestRuleIgnoreTestSuites$1.evaluate(TestRuleIgnoreTestSuites.java:55)
	at com.carrotsearch.randomizedtesting.rules.StatementAdapter.evaluate(StatementAdapter.java:36)
	at com.carrotsearch.randomizedtesting.ThreadLeakControl$StatementRunner.run(ThreadLeakControl.java:359)
	at java.lang.Thread.run(Thread.java:744)
Caused by: java.util.concurrent.TimeoutException: Could not connect to ZooKeeper 127.0.0.1:53417
within 45000 ms
	at org.apache.solr.common.cloud.ConnectionManager.waitForConnected(ConnectionManager.java:223)
	at org.apache.solr.common.cloud.SolrZkClient.<init>(SolrZkClient.java:142)
	... 45 more




Build Log:
[...truncated 11656 lines...]
   [junit4] Suite: org.apache.solr.client.solrj.impl.CloudSolrServerTest
   [junit4]   2> 8980 T65 oas.SolrTestCaseJ4.buildSSLConfig Randomized ssl (false) and
clientAuth (false)
   [junit4]   2> 8980 T65 oas.BaseDistributedSearchTestCase.initHostContext Setting hostContext
system property: /wq/k
   [junit4]   2> 8982 T65 oasc.AbstractZkTestCase.<clinit> WARN TEST_HOME() does
not exist - solrj test?
   [junit4]   2> 8986 T65 oas.SolrTestCaseJ4.setUp ###Starting testDistribSearch
   [junit4]   2> Creating dataDir: /mnt/ssd/jenkins/workspace/Lucene-Solr-trunk-Linux/solr/build/solr-solrj/test/J0/./solrtest-CloudSolrServerTest-1395190459619
   [junit4]   2> 8988 T65 oasc.ZkTestServer.run STARTING ZK TEST SERVER
   [junit4]   2> 8990 T66 oasc.ZkTestServer$ZKServerMain.runFromConfig Starting server
   [junit4]   2> 9089 T65 oasc.ZkTestServer.run start zk server on port:53417
   [junit4]   2> 9129 T65 oascc.ConnectionManager.waitForConnected Waiting for client to
connect to ZooKeeper
   [junit4]   2> 85559 T69 oazsp.FileTxnLog.commit WARN fsync-ing the write ahead log in
SyncThread:0 took 76408ms which will adversely effect operation latency. See the ZooKeeper
troubleshooting guide
   [junit4]   2> 85561 T65 oas.SolrTestCaseJ4.tearDown ###Ending testDistribSearch
   [junit4]   2> 85578 T67 oazs.NIOServerCnxn.doIO WARN caught end of stream exception
EndOfStreamException: Unable to read additional data from client sessionid 0x144d7d4ed240000,
likely client has closed socket
   [junit4]   2> 	at org.apache.zookeeper.server.NIOServerCnxn.doIO(NIOServerCnxn.java:220)
   [junit4]   2> 	at org.apache.zookeeper.server.NIOServerCnxnFactory.run(NIOServerCnxnFactory.java:208)
   [junit4]   2> 	at java.lang.Thread.run(Thread.java:744)
   [junit4]   2> 
   [junit4]   2> 85579 T65 oasc.ZkTestServer.send4LetterWord connecting to 127.0.0.1:53417
53417
   [junit4]   1> client port:0.0.0.0/0.0.0.0:0
   [junit4]   2> NOTE: reproduce with: ant test  -Dtestcase=CloudSolrServerTest -Dtests.method=testDistribSearch
-Dtests.seed=90544502E562967D -Dtests.multiplier=3 -Dtests.slow=true -Dtests.locale=sr_CS
-Dtests.timezone=America/St_Barthelemy -Dtests.file.encoding=UTF-8
   [junit4] ERROR   77.1s J0 | CloudSolrServerTest.testDistribSearch <<<
   [junit4]    > Throwable #1: org.apache.solr.common.SolrException: java.util.concurrent.TimeoutException:
Could not connect to ZooKeeper 127.0.0.1:53417 within 45000 ms
   [junit4]    > 	at __randomizedtesting.SeedInfo.seed([90544502E562967D:11B2CB1A923DF641]:0)
   [junit4]    > 	at org.apache.solr.common.cloud.SolrZkClient.<init>(SolrZkClient.java:150)
   [junit4]    > 	at org.apache.solr.common.cloud.SolrZkClient.<init>(SolrZkClient.java:101)
   [junit4]    > 	at org.apache.solr.common.cloud.SolrZkClient.<init>(SolrZkClient.java:91)
   [junit4]    > 	at org.apache.solr.cloud.AbstractZkTestCase.buildZooKeeper(AbstractZkTestCase.java:89)
   [junit4]    > 	at org.apache.solr.cloud.AbstractZkTestCase.buildZooKeeper(AbstractZkTestCase.java:83)
   [junit4]    > 	at org.apache.solr.cloud.AbstractDistribZkTestBase.setUp(AbstractDistribZkTestBase.java:70)
   [junit4]    > 	at org.apache.solr.cloud.AbstractFullDistribZkTestBase.setUp(AbstractFullDistribZkTestBase.java:201)
   [junit4]    > 	at org.apache.solr.client.solrj.impl.CloudSolrServerTest.setUp(CloudSolrServerTest.java:78)
   [junit4]    > 	at java.lang.Thread.run(Thread.java:744)
   [junit4]    > Caused by: java.util.concurrent.TimeoutException: Could not connect to
ZooKeeper 127.0.0.1:53417 within 45000 ms
   [junit4]    > 	at org.apache.solr.common.cloud.ConnectionManager.waitForConnected(ConnectionManager.java:223)
   [junit4]    > 	at org.apache.solr.common.cloud.SolrZkClient.<init>(SolrZkClient.java:142)
   [junit4]    > 	... 45 more
   [junit4]   2> 86123 T65 oas.SolrTestCaseJ4.setUp ###Starting testShutdown
   [junit4]   2> Creating dataDir: /mnt/ssd/jenkins/workspace/Lucene-Solr-trunk-Linux/solr/build/solr-solrj/test/J0/./solrtest-CloudSolrServerTest-1395190536757
   [junit4]   2> 86124 T65 oasc.ZkTestServer.run STARTING ZK TEST SERVER
   [junit4]   2> 86124 T73 oasc.ZkTestServer$ZKServerMain.runFromConfig Starting server
   [junit4]   2> 86224 T65 oasc.ZkTestServer.run start zk server on port:43176
   [junit4]   2> 86226 T65 oascc.ConnectionManager.waitForConnected Waiting for client
to connect to ZooKeeper
   [junit4]   2> 86330 T79 oascc.ConnectionManager.process Watcher org.apache.solr.common.cloud.ConnectionManager@19294db
name:ZooKeeperConnection Watcher:127.0.0.1:43176 got event WatchedEvent state:SyncConnected
type:None path:null path:null type:None
   [junit4]   2> 86330 T65 oascc.ConnectionManager.waitForConnected Client is connected
to ZooKeeper
   [junit4]   2> 86332 T65 oascc.SolrZkClient.makePath makePath: /solr
   [junit4]   2> 86352 T65 oascc.ConnectionManager.waitForConnected Waiting for client
to connect to ZooKeeper
   [junit4]   2> 86354 T81 oascc.ConnectionManager.process Watcher org.apache.solr.common.cloud.ConnectionManager@1b4e9d
name:ZooKeeperConnection Watcher:127.0.0.1:43176/solr got event WatchedEvent state:SyncConnected
type:None path:null path:null type:None
   [junit4]   2> 86354 T65 oascc.ConnectionManager.waitForConnected Client is connected
to ZooKeeper
   [junit4]   2> 86359 T65 oascc.SolrZkClient.makePath makePath: /collections/collection1
   [junit4]   2> 86365 T65 oascc.SolrZkClient.makePath makePath: /collections/collection1/shards
   [junit4]   2> 86368 T65 oascc.SolrZkClient.makePath makePath: /collections/control_collection
   [junit4]   2> 86373 T65 oascc.SolrZkClient.makePath makePath: /collections/control_collection/shards
   [junit4]   2> 86378 T65 oasc.AbstractZkTestCase.putConfig put /mnt/ssd/jenkins/workspace/Lucene-Solr-trunk-Linux/solr/solrj/src/test-files/solrj/solr/collection1/conf/solrconfig.xml
to /configs/conf1/solrconfig.xml
   [junit4]   2> 86385 T65 oascc.SolrZkClient.makePath makePath: /configs/conf1/solrconfig.xml
   [junit4]   2> 86392 T65 oasc.AbstractZkTestCase.putConfig put /mnt/ssd/jenkins/workspace/Lucene-Solr-trunk-Linux/solr/solrj/src/test-files/solrj/solr/collection1/conf/schema.xml
to /configs/conf1/schema.xml
   [junit4]   2> 86393 T65 oascc.SolrZkClient.makePath makePath: /configs/conf1/schema.xml
   [junit4]   2> 86407 T65 oasc.AbstractZkTestCase.putConfig skipping /mnt/ssd/jenkins/workspace/Lucene-Solr-trunk-Linux/solr/solrj/src/test-files/solrj/solr/collection1/conf/solrconfig.snippet.randomindexconfig.xml
because it doesn't exist
   [junit4]   2> 86408 T65 oasc.AbstractZkTestCase.putConfig skipping /mnt/ssd/jenkins/workspace/Lucene-Solr-trunk-Linux/solr/solrj/src/test-files/solrj/solr/collection1/conf/stopwords.txt
because it doesn't exist
   [junit4]   2> 86408 T65 oasc.AbstractZkTestCase.putConfig skipping /mnt/ssd/jenkins/workspace/Lucene-Solr-trunk-Linux/solr/solrj/src/test-files/solrj/solr/collection1/conf/protwords.txt
because it doesn't exist
   [junit4]   2> 86408 T65 oasc.AbstractZkTestCase.putConfig skipping /mnt/ssd/jenkins/workspace/Lucene-Solr-trunk-Linux/solr/solrj/src/test-files/solrj/solr/collection1/conf/currency.xml
because it doesn't exist
   [junit4]   2> 86409 T65 oasc.AbstractZkTestCase.putConfig skipping /mnt/ssd/jenkins/workspace/Lucene-Solr-trunk-Linux/solr/solrj/src/test-files/solrj/solr/collection1/conf/enumsConfig.xml
because it doesn't exist
   [junit4]   2> 86409 T65 oasc.AbstractZkTestCase.putConfig skipping /mnt/ssd/jenkins/workspace/Lucene-Solr-trunk-Linux/solr/solrj/src/test-files/solrj/solr/collection1/conf/open-exchange-rates.json
because it doesn't exist
   [junit4]   2> 86410 T65 oasc.AbstractZkTestCase.putConfig skipping /mnt/ssd/jenkins/workspace/Lucene-Solr-trunk-Linux/solr/solrj/src/test-files/solrj/solr/collection1/conf/mapping-ISOLatin1Accent.txt
because it doesn't exist
   [junit4]   2> 86410 T65 oasc.AbstractZkTestCase.putConfig skipping /mnt/ssd/jenkins/workspace/Lucene-Solr-trunk-Linux/solr/solrj/src/test-files/solrj/solr/collection1/conf/old_synonyms.txt
because it doesn't exist
   [junit4]   2> 86410 T65 oasc.AbstractZkTestCase.putConfig skipping /mnt/ssd/jenkins/workspace/Lucene-Solr-trunk-Linux/solr/solrj/src/test-files/solrj/solr/collection1/conf/synonyms.txt
because it doesn't exist
   [junit4]   2> 86418 T65 oascc.ConnectionManager.waitForConnected Waiting for client
to connect to ZooKeeper
   [junit4]   2> 86420 T82 oaz.ClientCnxnSocketNIO.connect ERROR Unable to open socket
to ff01:0:0:0:0:0:0:114/ff01:0:0:0:0:0:0:114:33332
   [junit4]   2> 86420 T82 oaz.ClientCnxn$SendThread.run WARN Session 0x0 for server null,
unexpected error, closing socket connection and attempting reconnect java.net.SocketException:
Network is unreachable
   [junit4]   2> 	at sun.nio.ch.Net.connect0(Native Method)
   [junit4]   2> 	at sun.nio.ch.Net.connect(Net.java:465)
   [junit4]   2> 	at sun.nio.ch.Net.connect(Net.java:457)
   [junit4]   2> 	at sun.nio.ch.SocketChannelImpl.connect(SocketChannelImpl.java:670)
   [junit4]   2> 	at org.apache.zookeeper.ClientCnxnSocketNIO.registerAndConnect(ClientCnxnSocketNIO.java:266)
   [junit4]   2> 	at org.apache.zookeeper.ClientCnxnSocketNIO.connect(ClientCnxnSocketNIO.java:276)
   [junit4]   2> 	at org.apache.zookeeper.ClientCnxn$SendThread.startConnect(ClientCnxn.java:958)
   [junit4]   2> 	at org.apache.zookeeper.ClientCnxn$SendThread.run(ClientCnxn.java:993)
   [junit4]   2> 
   [junit4]   2> 87522 T82 oaz.ClientCnxnSocketNIO.connect ERROR Unable to open socket
to ff01:0:0:0:0:0:0:114/ff01:0:0:0:0:0:0:114:33332
   [junit4]   2> 87625 T65 oas.SolrTestCaseJ4.tearDown ###Ending testShutdown
   [junit4]   2> 87628 T65 oasc.ZkTestServer.send4LetterWord connecting to 127.0.0.1:43176
43176
   [junit4]   1> client port:0.0.0.0/0.0.0.0:0
   [junit4]   2> 87931 T65 oas.SolrTestCaseJ4.deleteCore ###deleteCore
   [junit4]   2> 78956 T64 ccr.ThreadLeakControl.checkThreadLeaks WARNING Will linger awaiting
termination of 1 leaked thread(s).
   [junit4]   2> NOTE: test params are: codec=Lucene46: {}, docValues:{}, sim=RandomSimilarityProvider(queryNorm=true,coord=no):
{}, locale=sr_CS, timezone=America/St_Barthelemy
   [junit4]   2> NOTE: Linux 3.8.0-37-generic i386/Oracle Corporation 1.7.0_60-ea (32-bit)/cpus=8,threads=1,free=14016584,total=35741696
   [junit4]   2> NOTE: All tests run in this JVM: [LargeVolumeEmbeddedTest, TestXMLEscaping,
TestJavaBinCodec, LargeVolumeBinaryJettyTest, JettyWebappTest, CloudSolrServerTest]
   [junit4] Completed on J0 in 79.52s, 2 tests, 1 error <<< FAILURES!

[...truncated 133 lines...]
BUILD FAILED
/mnt/ssd/jenkins/workspace/Lucene-Solr-trunk-Linux/build.xml:467: The following error occurred
while executing this line:
/mnt/ssd/jenkins/workspace/Lucene-Solr-trunk-Linux/build.xml:447: The following error occurred
while executing this line:
/mnt/ssd/jenkins/workspace/Lucene-Solr-trunk-Linux/build.xml:45: The following error occurred
while executing this line:
/mnt/ssd/jenkins/workspace/Lucene-Solr-trunk-Linux/extra-targets.xml:37: The following error
occurred while executing this line:
/mnt/ssd/jenkins/workspace/Lucene-Solr-trunk-Linux/solr/build.xml:202: The following error
occurred while executing this line:
/mnt/ssd/jenkins/workspace/Lucene-Solr-trunk-Linux/solr/common-build.xml:490: The following
error occurred while executing this line:
/mnt/ssd/jenkins/workspace/Lucene-Solr-trunk-Linux/lucene/common-build.xml:1275: The following
error occurred while executing this line:
/mnt/ssd/jenkins/workspace/Lucene-Solr-trunk-Linux/lucene/common-build.xml:907: There were
test failures: 49 suites, 283 tests, 1 error

Total time: 55 minutes 15 seconds
Build step 'Invoke Ant' marked build as failure
Description set: Java: 32bit/jdk1.7.0_60-ea-b10 -client -XX:+UseSerialGC
Archiving artifacts
Recording test results
Email was triggered for: Failure
Sending email for trigger: Failure



Mime
View raw message