lucene-dev mailing list archives

Site index · List index
Message view « Date » · « Thread »
Top « Date » · « Thread »
From Policeman Jenkins Server <jenk...@thetaphi.de>
Subject [JENKINS] Lucene-Solr-trunk-Linux (32bit/jdk1.8.0) - Build # 9845 - Still Failing!
Date Wed, 19 Mar 2014 11:04:29 GMT
Build: http://jenkins.thetaphi.de/job/Lucene-Solr-trunk-Linux/9845/
Java: 32bit/jdk1.8.0 -client -XX:+UseConcMarkSweepGC

33 tests failed.
FAILED:  junit.framework.TestSuite.org.apache.solr.SolrTestCaseJ4Test

Error Message:
org.apache.solr.common.SolrException: java.util.concurrent.TimeoutException: Could not connect to ZooKeeper 127.0.0.1:36628 within 30000 ms

Stack Trace:
java.lang.RuntimeException: org.apache.solr.common.SolrException: java.util.concurrent.TimeoutException: Could not connect to ZooKeeper 127.0.0.1:36628 within 30000 ms
	at __randomizedtesting.SeedInfo.seed([E368A8EA0D0F1923]:0)
	at org.apache.solr.util.TestHarness.<init>(TestHarness.java:142)
	at org.apache.solr.util.TestHarness.<init>(TestHarness.java:147)
	at org.apache.solr.util.TestHarness.<init>(TestHarness.java:98)
	at org.apache.solr.SolrTestCaseJ4.createCore(SolrTestCaseJ4.java:566)
	at org.apache.solr.SolrTestCaseJ4.initCore(SolrTestCaseJ4.java:556)
	at org.apache.solr.SolrTestCaseJ4.initCore(SolrTestCaseJ4.java:365)
	at org.apache.solr.SolrTestCaseJ4.initCore(SolrTestCaseJ4.java:372)
	at org.apache.solr.SolrTestCaseJ4Test.beforeClass(SolrTestCaseJ4Test.java:51)
	at sun.reflect.NativeMethodAccessorImpl.invoke0(Native Method)
	at sun.reflect.NativeMethodAccessorImpl.invoke(NativeMethodAccessorImpl.java:62)
	at sun.reflect.DelegatingMethodAccessorImpl.invoke(DelegatingMethodAccessorImpl.java:43)
	at java.lang.reflect.Method.invoke(Method.java:483)
	at com.carrotsearch.randomizedtesting.RandomizedRunner.invoke(RandomizedRunner.java:1617)
	at com.carrotsearch.randomizedtesting.RandomizedRunner$4.evaluate(RandomizedRunner.java:766)
	at com.carrotsearch.randomizedtesting.RandomizedRunner$5.evaluate(RandomizedRunner.java:782)
	at com.carrotsearch.randomizedtesting.rules.StatementAdapter.evaluate(StatementAdapter.java:36)
	at com.carrotsearch.randomizedtesting.rules.SystemPropertiesRestoreRule$1.evaluate(SystemPropertiesRestoreRule.java:53)
	at org.apache.lucene.util.AbstractBeforeAfterRule$1.evaluate(AbstractBeforeAfterRule.java:46)
	at org.apache.lucene.util.TestRuleStoreClassName$1.evaluate(TestRuleStoreClassName.java:42)
	at com.carrotsearch.randomizedtesting.rules.SystemPropertiesInvariantRule$1.evaluate(SystemPropertiesInvariantRule.java:55)
	at com.carrotsearch.randomizedtesting.rules.NoShadowingOrOverridesOnMethodsRule$1.evaluate(NoShadowingOrOverridesOnMethodsRule.java:39)
	at com.carrotsearch.randomizedtesting.rules.NoShadowingOrOverridesOnMethodsRule$1.evaluate(NoShadowingOrOverridesOnMethodsRule.java:39)
	at com.carrotsearch.randomizedtesting.rules.StatementAdapter.evaluate(StatementAdapter.java:36)
	at org.apache.lucene.util.TestRuleAssertionsRequired$1.evaluate(TestRuleAssertionsRequired.java:43)
	at org.apache.lucene.util.TestRuleMarkFailure$1.evaluate(TestRuleMarkFailure.java:48)
	at org.apache.lucene.util.TestRuleIgnoreAfterMaxFailures$1.evaluate(TestRuleIgnoreAfterMaxFailures.java:70)
	at org.apache.lucene.util.TestRuleIgnoreTestSuites$1.evaluate(TestRuleIgnoreTestSuites.java:55)
	at com.carrotsearch.randomizedtesting.rules.StatementAdapter.evaluate(StatementAdapter.java:36)
	at com.carrotsearch.randomizedtesting.ThreadLeakControl$StatementRunner.run(ThreadLeakControl.java:359)
	at java.lang.Thread.run(Thread.java:744)
Caused by: org.apache.solr.common.SolrException: java.util.concurrent.TimeoutException: Could not connect to ZooKeeper 127.0.0.1:36628 within 30000 ms
	at org.apache.solr.common.cloud.SolrZkClient.<init>(SolrZkClient.java:150)
	at org.apache.solr.common.cloud.SolrZkClient.<init>(SolrZkClient.java:101)
	at org.apache.solr.common.cloud.SolrZkClient.<init>(SolrZkClient.java:96)
	at org.apache.solr.common.cloud.SolrZkClient.<init>(SolrZkClient.java:83)
	at org.apache.solr.cloud.ZkController.checkChrootPath(ZkController.java:667)
	at org.apache.solr.core.ZkContainer.initZooKeeper(ZkContainer.java:133)
	at org.apache.solr.core.ZkContainer.initZooKeeper(ZkContainer.java:67)
	at org.apache.solr.core.CoreContainer.load(CoreContainer.java:230)
	at org.apache.solr.util.TestHarness.<init>(TestHarness.java:137)
	... 29 more
Caused by: java.util.concurrent.TimeoutException: Could not connect to ZooKeeper 127.0.0.1:36628 within 30000 ms
	at org.apache.solr.common.cloud.ConnectionManager.waitForConnected(ConnectionManager.java:223)
	at org.apache.solr.common.cloud.SolrZkClient.<init>(SolrZkClient.java:142)
	... 37 more


FAILED:  junit.framework.TestSuite.org.apache.solr.analysis.TestCharFilters

Error Message:
org.apache.solr.common.SolrException: java.util.concurrent.TimeoutException: Could not connect to ZooKeeper 127.0.0.1:36628 within 30000 ms

Stack Trace:
java.lang.RuntimeException: org.apache.solr.common.SolrException: java.util.concurrent.TimeoutException: Could not connect to ZooKeeper 127.0.0.1:36628 within 30000 ms
	at __randomizedtesting.SeedInfo.seed([E368A8EA0D0F1923]:0)
	at org.apache.solr.util.TestHarness.<init>(TestHarness.java:142)
	at org.apache.solr.util.TestHarness.<init>(TestHarness.java:147)
	at org.apache.solr.util.TestHarness.<init>(TestHarness.java:98)
	at org.apache.solr.SolrTestCaseJ4.createCore(SolrTestCaseJ4.java:566)
	at org.apache.solr.SolrTestCaseJ4.initCore(SolrTestCaseJ4.java:556)
	at org.apache.solr.SolrTestCaseJ4.initCore(SolrTestCaseJ4.java:365)
	at org.apache.solr.SolrTestCaseJ4.initCore(SolrTestCaseJ4.java:352)
	at org.apache.solr.analysis.TestCharFilters.beforeClass(TestCharFilters.java:31)
	at sun.reflect.NativeMethodAccessorImpl.invoke0(Native Method)
	at sun.reflect.NativeMethodAccessorImpl.invoke(NativeMethodAccessorImpl.java:62)
	at sun.reflect.DelegatingMethodAccessorImpl.invoke(DelegatingMethodAccessorImpl.java:43)
	at java.lang.reflect.Method.invoke(Method.java:483)
	at com.carrotsearch.randomizedtesting.RandomizedRunner.invoke(RandomizedRunner.java:1617)
	at com.carrotsearch.randomizedtesting.RandomizedRunner$4.evaluate(RandomizedRunner.java:766)
	at com.carrotsearch.randomizedtesting.RandomizedRunner$5.evaluate(RandomizedRunner.java:782)
	at com.carrotsearch.randomizedtesting.rules.StatementAdapter.evaluate(StatementAdapter.java:36)
	at com.carrotsearch.randomizedtesting.rules.SystemPropertiesRestoreRule$1.evaluate(SystemPropertiesRestoreRule.java:53)
	at org.apache.lucene.util.AbstractBeforeAfterRule$1.evaluate(AbstractBeforeAfterRule.java:46)
	at org.apache.lucene.util.TestRuleStoreClassName$1.evaluate(TestRuleStoreClassName.java:42)
	at com.carrotsearch.randomizedtesting.rules.SystemPropertiesInvariantRule$1.evaluate(SystemPropertiesInvariantRule.java:55)
	at com.carrotsearch.randomizedtesting.rules.NoShadowingOrOverridesOnMethodsRule$1.evaluate(NoShadowingOrOverridesOnMethodsRule.java:39)
	at com.carrotsearch.randomizedtesting.rules.NoShadowingOrOverridesOnMethodsRule$1.evaluate(NoShadowingOrOverridesOnMethodsRule.java:39)
	at com.carrotsearch.randomizedtesting.rules.StatementAdapter.evaluate(StatementAdapter.java:36)
	at org.apache.lucene.util.TestRuleAssertionsRequired$1.evaluate(TestRuleAssertionsRequired.java:43)
	at org.apache.lucene.util.TestRuleMarkFailure$1.evaluate(TestRuleMarkFailure.java:48)
	at org.apache.lucene.util.TestRuleIgnoreAfterMaxFailures$1.evaluate(TestRuleIgnoreAfterMaxFailures.java:70)
	at org.apache.lucene.util.TestRuleIgnoreTestSuites$1.evaluate(TestRuleIgnoreTestSuites.java:55)
	at com.carrotsearch.randomizedtesting.rules.StatementAdapter.evaluate(StatementAdapter.java:36)
	at com.carrotsearch.randomizedtesting.ThreadLeakControl$StatementRunner.run(ThreadLeakControl.java:359)
	at java.lang.Thread.run(Thread.java:744)
Caused by: org.apache.solr.common.SolrException: java.util.concurrent.TimeoutException: Could not connect to ZooKeeper 127.0.0.1:36628 within 30000 ms
	at org.apache.solr.common.cloud.SolrZkClient.<init>(SolrZkClient.java:150)
	at org.apache.solr.common.cloud.SolrZkClient.<init>(SolrZkClient.java:101)
	at org.apache.solr.common.cloud.SolrZkClient.<init>(SolrZkClient.java:96)
	at org.apache.solr.common.cloud.SolrZkClient.<init>(SolrZkClient.java:83)
	at org.apache.solr.cloud.ZkController.checkChrootPath(ZkController.java:667)
	at org.apache.solr.core.ZkContainer.initZooKeeper(ZkContainer.java:133)
	at org.apache.solr.core.ZkContainer.initZooKeeper(ZkContainer.java:67)
	at org.apache.solr.core.CoreContainer.load(CoreContainer.java:230)
	at org.apache.solr.util.TestHarness.<init>(TestHarness.java:137)
	... 29 more
Caused by: java.util.concurrent.TimeoutException: Could not connect to ZooKeeper 127.0.0.1:36628 within 30000 ms
	at org.apache.solr.common.cloud.ConnectionManager.waitForConnected(ConnectionManager.java:223)
	at org.apache.solr.common.cloud.SolrZkClient.<init>(SolrZkClient.java:142)
	... 37 more


FAILED:  junit.framework.TestSuite.org.apache.solr.analytics.NoFacetTest

Error Message:
org.apache.solr.common.SolrException: java.util.concurrent.TimeoutException: Could not connect to ZooKeeper 127.0.0.1:36628 within 30000 ms

Stack Trace:
java.lang.RuntimeException: org.apache.solr.common.SolrException: java.util.concurrent.TimeoutException: Could not connect to ZooKeeper 127.0.0.1:36628 within 30000 ms
	at __randomizedtesting.SeedInfo.seed([E368A8EA0D0F1923]:0)
	at org.apache.solr.util.TestHarness.<init>(TestHarness.java:142)
	at org.apache.solr.util.TestHarness.<init>(TestHarness.java:147)
	at org.apache.solr.util.TestHarness.<init>(TestHarness.java:98)
	at org.apache.solr.SolrTestCaseJ4.createCore(SolrTestCaseJ4.java:566)
	at org.apache.solr.SolrTestCaseJ4.initCore(SolrTestCaseJ4.java:556)
	at org.apache.solr.SolrTestCaseJ4.initCore(SolrTestCaseJ4.java:365)
	at org.apache.solr.SolrTestCaseJ4.initCore(SolrTestCaseJ4.java:352)
	at org.apache.solr.analytics.NoFacetTest.beforeClass(NoFacetTest.java:66)
	at sun.reflect.NativeMethodAccessorImpl.invoke0(Native Method)
	at sun.reflect.NativeMethodAccessorImpl.invoke(NativeMethodAccessorImpl.java:62)
	at sun.reflect.DelegatingMethodAccessorImpl.invoke(DelegatingMethodAccessorImpl.java:43)
	at java.lang.reflect.Method.invoke(Method.java:483)
	at com.carrotsearch.randomizedtesting.RandomizedRunner.invoke(RandomizedRunner.java:1617)
	at com.carrotsearch.randomizedtesting.RandomizedRunner$4.evaluate(RandomizedRunner.java:766)
	at com.carrotsearch.randomizedtesting.RandomizedRunner$5.evaluate(RandomizedRunner.java:782)
	at com.carrotsearch.randomizedtesting.rules.StatementAdapter.evaluate(StatementAdapter.java:36)
	at com.carrotsearch.randomizedtesting.rules.SystemPropertiesRestoreRule$1.evaluate(SystemPropertiesRestoreRule.java:53)
	at org.apache.lucene.util.AbstractBeforeAfterRule$1.evaluate(AbstractBeforeAfterRule.java:46)
	at org.apache.lucene.util.TestRuleStoreClassName$1.evaluate(TestRuleStoreClassName.java:42)
	at com.carrotsearch.randomizedtesting.rules.SystemPropertiesInvariantRule$1.evaluate(SystemPropertiesInvariantRule.java:55)
	at com.carrotsearch.randomizedtesting.rules.NoShadowingOrOverridesOnMethodsRule$1.evaluate(NoShadowingOrOverridesOnMethodsRule.java:39)
	at com.carrotsearch.randomizedtesting.rules.NoShadowingOrOverridesOnMethodsRule$1.evaluate(NoShadowingOrOverridesOnMethodsRule.java:39)
	at com.carrotsearch.randomizedtesting.rules.StatementAdapter.evaluate(StatementAdapter.java:36)
	at org.apache.lucene.util.TestRuleAssertionsRequired$1.evaluate(TestRuleAssertionsRequired.java:43)
	at org.apache.lucene.util.TestRuleMarkFailure$1.evaluate(TestRuleMarkFailure.java:48)
	at org.apache.lucene.util.TestRuleIgnoreAfterMaxFailures$1.evaluate(TestRuleIgnoreAfterMaxFailures.java:70)
	at org.apache.lucene.util.TestRuleIgnoreTestSuites$1.evaluate(TestRuleIgnoreTestSuites.java:55)
	at com.carrotsearch.randomizedtesting.rules.StatementAdapter.evaluate(StatementAdapter.java:36)
	at com.carrotsearch.randomizedtesting.ThreadLeakControl$StatementRunner.run(ThreadLeakControl.java:359)
	at java.lang.Thread.run(Thread.java:744)
Caused by: org.apache.solr.common.SolrException: java.util.concurrent.TimeoutException: Could not connect to ZooKeeper 127.0.0.1:36628 within 30000 ms
	at org.apache.solr.common.cloud.SolrZkClient.<init>(SolrZkClient.java:150)
	at org.apache.solr.common.cloud.SolrZkClient.<init>(SolrZkClient.java:101)
	at org.apache.solr.common.cloud.SolrZkClient.<init>(SolrZkClient.java:96)
	at org.apache.solr.common.cloud.SolrZkClient.<init>(SolrZkClient.java:83)
	at org.apache.solr.cloud.ZkController.checkChrootPath(ZkController.java:667)
	at org.apache.solr.core.ZkContainer.initZooKeeper(ZkContainer.java:133)
	at org.apache.solr.core.ZkContainer.initZooKeeper(ZkContainer.java:67)
	at org.apache.solr.core.CoreContainer.load(CoreContainer.java:230)
	at org.apache.solr.util.TestHarness.<init>(TestHarness.java:137)
	... 29 more
Caused by: java.util.concurrent.TimeoutException: Could not connect to ZooKeeper 127.0.0.1:36628 within 30000 ms
	at org.apache.solr.common.cloud.ConnectionManager.waitForConnected(ConnectionManager.java:223)
	at org.apache.solr.common.cloud.SolrZkClient.<init>(SolrZkClient.java:142)
	... 37 more


FAILED:  junit.framework.TestSuite.org.apache.solr.analytics.facet.FieldFacetExtrasTest

Error Message:
org.apache.solr.common.SolrException: java.util.concurrent.TimeoutException: Could not connect to ZooKeeper 127.0.0.1:36628 within 30000 ms

Stack Trace:
java.lang.RuntimeException: org.apache.solr.common.SolrException: java.util.concurrent.TimeoutException: Could not connect to ZooKeeper 127.0.0.1:36628 within 30000 ms
	at __randomizedtesting.SeedInfo.seed([E368A8EA0D0F1923]:0)
	at org.apache.solr.util.TestHarness.<init>(TestHarness.java:142)
	at org.apache.solr.util.TestHarness.<init>(TestHarness.java:147)
	at org.apache.solr.util.TestHarness.<init>(TestHarness.java:98)
	at org.apache.solr.SolrTestCaseJ4.createCore(SolrTestCaseJ4.java:566)
	at org.apache.solr.SolrTestCaseJ4.initCore(SolrTestCaseJ4.java:556)
	at org.apache.solr.SolrTestCaseJ4.initCore(SolrTestCaseJ4.java:365)
	at org.apache.solr.SolrTestCaseJ4.initCore(SolrTestCaseJ4.java:352)
	at org.apache.solr.analytics.facet.FieldFacetExtrasTest.beforeClass(FieldFacetExtrasTest.java:50)
	at sun.reflect.NativeMethodAccessorImpl.invoke0(Native Method)
	at sun.reflect.NativeMethodAccessorImpl.invoke(NativeMethodAccessorImpl.java:62)
	at sun.reflect.DelegatingMethodAccessorImpl.invoke(DelegatingMethodAccessorImpl.java:43)
	at java.lang.reflect.Method.invoke(Method.java:483)
	at com.carrotsearch.randomizedtesting.RandomizedRunner.invoke(RandomizedRunner.java:1617)
	at com.carrotsearch.randomizedtesting.RandomizedRunner$4.evaluate(RandomizedRunner.java:766)
	at com.carrotsearch.randomizedtesting.RandomizedRunner$5.evaluate(RandomizedRunner.java:782)
	at com.carrotsearch.randomizedtesting.rules.StatementAdapter.evaluate(StatementAdapter.java:36)
	at com.carrotsearch.randomizedtesting.rules.SystemPropertiesRestoreRule$1.evaluate(SystemPropertiesRestoreRule.java:53)
	at org.apache.lucene.util.AbstractBeforeAfterRule$1.evaluate(AbstractBeforeAfterRule.java:46)
	at org.apache.lucene.util.TestRuleStoreClassName$1.evaluate(TestRuleStoreClassName.java:42)
	at com.carrotsearch.randomizedtesting.rules.SystemPropertiesInvariantRule$1.evaluate(SystemPropertiesInvariantRule.java:55)
	at com.carrotsearch.randomizedtesting.rules.NoShadowingOrOverridesOnMethodsRule$1.evaluate(NoShadowingOrOverridesOnMethodsRule.java:39)
	at com.carrotsearch.randomizedtesting.rules.NoShadowingOrOverridesOnMethodsRule$1.evaluate(NoShadowingOrOverridesOnMethodsRule.java:39)
	at com.carrotsearch.randomizedtesting.rules.StatementAdapter.evaluate(StatementAdapter.java:36)
	at org.apache.lucene.util.TestRuleAssertionsRequired$1.evaluate(TestRuleAssertionsRequired.java:43)
	at org.apache.lucene.util.TestRuleMarkFailure$1.evaluate(TestRuleMarkFailure.java:48)
	at org.apache.lucene.util.TestRuleIgnoreAfterMaxFailures$1.evaluate(TestRuleIgnoreAfterMaxFailures.java:70)
	at org.apache.lucene.util.TestRuleIgnoreTestSuites$1.evaluate(TestRuleIgnoreTestSuites.java:55)
	at com.carrotsearch.randomizedtesting.rules.StatementAdapter.evaluate(StatementAdapter.java:36)
	at com.carrotsearch.randomizedtesting.ThreadLeakControl$StatementRunner.run(ThreadLeakControl.java:359)
	at java.lang.Thread.run(Thread.java:744)
Caused by: org.apache.solr.common.SolrException: java.util.concurrent.TimeoutException: Could not connect to ZooKeeper 127.0.0.1:36628 within 30000 ms
	at org.apache.solr.common.cloud.SolrZkClient.<init>(SolrZkClient.java:150)
	at org.apache.solr.common.cloud.SolrZkClient.<init>(SolrZkClient.java:101)
	at org.apache.solr.common.cloud.SolrZkClient.<init>(SolrZkClient.java:96)
	at org.apache.solr.common.cloud.SolrZkClient.<init>(SolrZkClient.java:83)
	at org.apache.solr.cloud.ZkController.checkChrootPath(ZkController.java:667)
	at org.apache.solr.core.ZkContainer.initZooKeeper(ZkContainer.java:133)
	at org.apache.solr.core.ZkContainer.initZooKeeper(ZkContainer.java:67)
	at org.apache.solr.core.CoreContainer.load(CoreContainer.java:230)
	at org.apache.solr.util.TestHarness.<init>(TestHarness.java:137)
	... 29 more
Caused by: java.util.concurrent.TimeoutException: Could not connect to ZooKeeper 127.0.0.1:36628 within 30000 ms
	at org.apache.solr.common.cloud.ConnectionManager.waitForConnected(ConnectionManager.java:223)
	at org.apache.solr.common.cloud.SolrZkClient.<init>(SolrZkClient.java:142)
	... 37 more


FAILED:  junit.framework.TestSuite.org.apache.solr.cloud.RecoveryZkTest

Error Message:
ERROR: SolrZkClient opens=4 closes=3

Stack Trace:
java.lang.AssertionError: ERROR: SolrZkClient opens=4 closes=3
	at __randomizedtesting.SeedInfo.seed([E368A8EA0D0F1923]:0)
	at org.junit.Assert.fail(Assert.java:93)
	at org.apache.solr.SolrTestCaseJ4.endTrackingZkClients(SolrTestCaseJ4.java:435)
	at org.apache.solr.SolrTestCaseJ4.afterClass(SolrTestCaseJ4.java:180)
	at sun.reflect.GeneratedMethodAccessor50.invoke(Unknown Source)
	at sun.reflect.DelegatingMethodAccessorImpl.invoke(DelegatingMethodAccessorImpl.java:43)
	at java.lang.reflect.Method.invoke(Method.java:483)
	at com.carrotsearch.randomizedtesting.RandomizedRunner.invoke(RandomizedRunner.java:1617)
	at com.carrotsearch.randomizedtesting.RandomizedRunner$5.evaluate(RandomizedRunner.java:789)
	at com.carrotsearch.randomizedtesting.rules.StatementAdapter.evaluate(StatementAdapter.java:36)
	at com.carrotsearch.randomizedtesting.rules.SystemPropertiesRestoreRule$1.evaluate(SystemPropertiesRestoreRule.java:53)
	at org.apache.lucene.util.AbstractBeforeAfterRule$1.evaluate(AbstractBeforeAfterRule.java:46)
	at org.apache.lucene.util.TestRuleStoreClassName$1.evaluate(TestRuleStoreClassName.java:42)
	at com.carrotsearch.randomizedtesting.rules.SystemPropertiesInvariantRule$1.evaluate(SystemPropertiesInvariantRule.java:55)
	at com.carrotsearch.randomizedtesting.rules.NoShadowingOrOverridesOnMethodsRule$1.evaluate(NoShadowingOrOverridesOnMethodsRule.java:39)
	at com.carrotsearch.randomizedtesting.rules.NoShadowingOrOverridesOnMethodsRule$1.evaluate(NoShadowingOrOverridesOnMethodsRule.java:39)
	at com.carrotsearch.randomizedtesting.rules.StatementAdapter.evaluate(StatementAdapter.java:36)
	at org.apache.lucene.util.TestRuleAssertionsRequired$1.evaluate(TestRuleAssertionsRequired.java:43)
	at org.apache.lucene.util.TestRuleMarkFailure$1.evaluate(TestRuleMarkFailure.java:48)
	at org.apache.lucene.util.TestRuleIgnoreAfterMaxFailures$1.evaluate(TestRuleIgnoreAfterMaxFailures.java:70)
	at org.apache.lucene.util.TestRuleIgnoreTestSuites$1.evaluate(TestRuleIgnoreTestSuites.java:55)
	at com.carrotsearch.randomizedtesting.rules.StatementAdapter.evaluate(StatementAdapter.java:36)
	at com.carrotsearch.randomizedtesting.ThreadLeakControl$StatementRunner.run(ThreadLeakControl.java:359)
	at java.lang.Thread.run(Thread.java:744)


FAILED:  junit.framework.TestSuite.org.apache.solr.cloud.RecoveryZkTest

Error Message:
15 threads leaked from SUITE scope at org.apache.solr.cloud.RecoveryZkTest:     1) Thread[id=1461, name=TEST-RecoveryZkTest.testDistribSearch-seed#[E368A8EA0D0F1923]-EventThread, state=WAITING, group=TGRP-RecoveryZkTest]         at sun.misc.Unsafe.park(Native Method)         at java.util.concurrent.locks.LockSupport.park(LockSupport.java:175)         at java.util.concurrent.locks.AbstractQueuedSynchronizer$ConditionObject.await(AbstractQueuedSynchronizer.java:2039)         at java.util.concurrent.LinkedBlockingQueue.take(LinkedBlockingQueue.java:442)         at org.apache.zookeeper.ClientCnxn$EventThread.run(ClientCnxn.java:491)    2) Thread[id=1441, name=NIOServerCxn.Factory:0.0.0.0/0.0.0.0:0, state=RUNNABLE, group=TGRP-RecoveryZkTest]         at sun.nio.ch.EPollArrayWrapper.epollWait(Native Method)         at sun.nio.ch.EPollArrayWrapper.poll(EPollArrayWrapper.java:269)         at sun.nio.ch.EPollSelectorImpl.doSelect(EPollSelectorImpl.java:79)         at sun.nio.ch.SelectorImpl.lockAndDoSelect(SelectorImpl.java:86)         at sun.nio.ch.SelectorImpl.select(SelectorImpl.java:97)         at org.apache.zookeeper.server.NIOServerCnxnFactory.run(NIOServerCnxnFactory.java:178)         at java.lang.Thread.run(Thread.java:744)    3) Thread[id=1449, name=HashSessionScavenger-42, state=TIMED_WAITING, group=TGRP-RecoveryZkTest]         at java.lang.Object.wait(Native Method)         at java.util.TimerThread.mainLoop(Timer.java:552)         at java.util.TimerThread.run(Timer.java:505)    4) Thread[id=1451, name=qtp25170843-1451 Selector1, state=RUNNABLE, group=TGRP-RecoveryZkTest]         at sun.nio.ch.EPollArrayWrapper.epollWait(Native Method)         at sun.nio.ch.EPollArrayWrapper.poll(EPollArrayWrapper.java:269)         at sun.nio.ch.EPollSelectorImpl.doSelect(EPollSelectorImpl.java:79)         at sun.nio.ch.SelectorImpl.lockAndDoSelect(SelectorImpl.java:86)         at sun.nio.ch.SelectorImpl.select(SelectorImpl.java:97)         at org.eclipse.jetty.io.nio.SelectorManager$SelectSet.doSelect(SelectorManager.java:569)         at org.eclipse.jetty.io.nio.SelectorManager$1.run(SelectorManager.java:290)         at org.eclipse.jetty.util.thread.QueuedThreadPool.runJob(QueuedThreadPool.java:608)         at org.eclipse.jetty.util.thread.QueuedThreadPool$3.run(QueuedThreadPool.java:543)         at java.lang.Thread.run(Thread.java:744)    5) Thread[id=1453, name=qtp25170843-1453 Acceptor1 SelectChannelConnector@127.0.0.1:51416, state=BLOCKED, group=TGRP-RecoveryZkTest]         at sun.nio.ch.ServerSocketChannelImpl.accept(ServerSocketChannelImpl.java:224)         at org.eclipse.jetty.server.nio.SelectChannelConnector.accept(SelectChannelConnector.java:109)         at org.eclipse.jetty.server.AbstractConnector$Acceptor.run(AbstractConnector.java:938)         at org.eclipse.jetty.util.thread.QueuedThreadPool.runJob(QueuedThreadPool.java:608)         at org.eclipse.jetty.util.thread.QueuedThreadPool$3.run(QueuedThreadPool.java:543)         at java.lang.Thread.run(Thread.java:744)    6) Thread[id=1456, name=qtp25170843-1456, state=TIMED_WAITING, group=TGRP-RecoveryZkTest]         at sun.misc.Unsafe.park(Native Method)         at java.util.concurrent.locks.LockSupport.parkNanos(LockSupport.java:215)         at java.util.concurrent.locks.AbstractQueuedSynchronizer$ConditionObject.awaitNanos(AbstractQueuedSynchronizer.java:2078)         at org.eclipse.jetty.util.BlockingArrayQueue.poll(BlockingArrayQueue.java:342)         at org.eclipse.jetty.util.thread.QueuedThreadPool.idleJobPoll(QueuedThreadPool.java:526)         at org.eclipse.jetty.util.thread.QueuedThreadPool.access$600(QueuedThreadPool.java:44)         at org.eclipse.jetty.util.thread.QueuedThreadPool$3.run(QueuedThreadPool.java:572)         at java.lang.Thread.run(Thread.java:744)    7) Thread[id=1457, name=qtp25170843-1457, state=TIMED_WAITING, group=TGRP-RecoveryZkTest]         at sun.misc.Unsafe.park(Native Method)         at java.util.concurrent.locks.LockSupport.parkNanos(LockSupport.java:215)         at java.util.concurrent.locks.AbstractQueuedSynchronizer$ConditionObject.awaitNanos(AbstractQueuedSynchronizer.java:2078)         at org.eclipse.jetty.util.BlockingArrayQueue.poll(BlockingArrayQueue.java:342)         at org.eclipse.jetty.util.thread.QueuedThreadPool.idleJobPoll(QueuedThreadPool.java:526)         at org.eclipse.jetty.util.thread.QueuedThreadPool.access$600(QueuedThreadPool.java:44)         at org.eclipse.jetty.util.thread.QueuedThreadPool$3.run(QueuedThreadPool.java:572)         at java.lang.Thread.run(Thread.java:744)    8) Thread[id=1455, name=qtp25170843-1455, state=TIMED_WAITING, group=TGRP-RecoveryZkTest]         at sun.misc.Unsafe.park(Native Method)         at java.util.concurrent.locks.LockSupport.parkNanos(LockSupport.java:215)         at java.util.concurrent.locks.AbstractQueuedSynchronizer$ConditionObject.awaitNanos(AbstractQueuedSynchronizer.java:2078)         at org.eclipse.jetty.util.BlockingArrayQueue.poll(BlockingArrayQueue.java:342)         at org.eclipse.jetty.util.thread.QueuedThreadPool.idleJobPoll(QueuedThreadPool.java:526)         at org.eclipse.jetty.util.thread.QueuedThreadPool.access$600(QueuedThreadPool.java:44)         at org.eclipse.jetty.util.thread.QueuedThreadPool$3.run(QueuedThreadPool.java:572)         at java.lang.Thread.run(Thread.java:744)    9) Thread[id=1442, name=SessionTracker, state=TIMED_WAITING, group=TGRP-RecoveryZkTest]         at java.lang.Object.wait(Native Method)         at org.apache.zookeeper.server.SessionTrackerImpl.run(SessionTrackerImpl.java:146)   10) Thread[id=1440, name=Thread-581, state=WAITING, group=TGRP-RecoveryZkTest]         at java.lang.Object.wait(Native Method)         at java.lang.Thread.join(Thread.java:1244)         at java.lang.Thread.join(Thread.java:1318)         at org.apache.zookeeper.server.NIOServerCnxnFactory.join(NIOServerCnxnFactory.java:302)         at org.apache.solr.cloud.ZkTestServer$ZKServerMain.runFromConfig(ZkTestServer.java:107)         at org.apache.solr.cloud.ZkTestServer$2.run(ZkTestServer.java:221)   11) Thread[id=1444, name=ProcessThread(sid:0 cport:-1):, state=WAITING, group=TGRP-RecoveryZkTest]         at sun.misc.Unsafe.park(Native Method)         at java.util.concurrent.locks.LockSupport.park(LockSupport.java:175)         at java.util.concurrent.locks.AbstractQueuedSynchronizer$ConditionObject.await(AbstractQueuedSynchronizer.java:2039)         at java.util.concurrent.LinkedBlockingQueue.take(LinkedBlockingQueue.java:442)         at org.apache.zookeeper.server.PrepRequestProcessor.run(PrepRequestProcessor.java:120)   12) Thread[id=1450, name=qtp25170843-1450 Selector0, state=RUNNABLE, group=TGRP-RecoveryZkTest]         at sun.nio.ch.EPollArrayWrapper.epollWait(Native Method)         at sun.nio.ch.EPollArrayWrapper.poll(EPollArrayWrapper.java:269)         at sun.nio.ch.EPollSelectorImpl.doSelect(EPollSelectorImpl.java:79)         at sun.nio.ch.SelectorImpl.lockAndDoSelect(SelectorImpl.java:86)         at sun.nio.ch.SelectorImpl.select(SelectorImpl.java:97)         at org.eclipse.jetty.io.nio.SelectorManager$SelectSet.doSelect(SelectorManager.java:569)         at org.eclipse.jetty.io.nio.SelectorManager$1.run(SelectorManager.java:290)         at org.eclipse.jetty.util.thread.QueuedThreadPool.runJob(QueuedThreadPool.java:608)         at org.eclipse.jetty.util.thread.QueuedThreadPool$3.run(QueuedThreadPool.java:543)         at java.lang.Thread.run(Thread.java:744)   13) Thread[id=1460, name=TEST-RecoveryZkTest.testDistribSearch-seed#[E368A8EA0D0F1923]-SendThread(localhost.localdomain:40005), state=RUNNABLE, group=TGRP-RecoveryZkTest]         at sun.nio.ch.EPollArrayWrapper.epollWait(Native Method)         at sun.nio.ch.EPollArrayWrapper.poll(EPollArrayWrapper.java:269)         at sun.nio.ch.EPollSelectorImpl.doSelect(EPollSelectorImpl.java:79)         at sun.nio.ch.SelectorImpl.lockAndDoSelect(SelectorImpl.java:86)         at sun.nio.ch.SelectorImpl.select(SelectorImpl.java:97)         at org.apache.zookeeper.ClientCnxnSocketNIO.doTransport(ClientCnxnSocketNIO.java:338)         at org.apache.zookeeper.ClientCnxn$SendThread.run(ClientCnxn.java:1068)   14) Thread[id=1452, name=qtp25170843-1452 Acceptor0 SelectChannelConnector@127.0.0.1:51416, state=RUNNABLE, group=TGRP-RecoveryZkTest]         at sun.nio.ch.ServerSocketChannelImpl.accept0(Native Method)         at sun.nio.ch.ServerSocketChannelImpl.accept(ServerSocketChannelImpl.java:241)         at org.eclipse.jetty.server.nio.SelectChannelConnector.accept(SelectChannelConnector.java:109)         at org.eclipse.jetty.server.AbstractConnector$Acceptor.run(AbstractConnector.java:938)         at org.eclipse.jetty.util.thread.QueuedThreadPool.runJob(QueuedThreadPool.java:608)         at org.eclipse.jetty.util.thread.QueuedThreadPool$3.run(QueuedThreadPool.java:543)         at java.lang.Thread.run(Thread.java:744)   15) Thread[id=1454, name=qtp25170843-1454, state=TIMED_WAITING, group=TGRP-RecoveryZkTest]         at sun.misc.Unsafe.park(Native Method)         at java.util.concurrent.locks.LockSupport.parkNanos(LockSupport.java:215)         at java.util.concurrent.locks.AbstractQueuedSynchronizer$ConditionObject.awaitNanos(AbstractQueuedSynchronizer.java:2078)         at org.eclipse.jetty.util.BlockingArrayQueue.poll(BlockingArrayQueue.java:342)         at org.eclipse.jetty.util.thread.QueuedThreadPool.idleJobPoll(QueuedThreadPool.java:526)         at org.eclipse.jetty.util.thread.QueuedThreadPool.access$600(QueuedThreadPool.java:44)         at org.eclipse.jetty.util.thread.QueuedThreadPool$3.run(QueuedThreadPool.java:572)         at java.lang.Thread.run(Thread.java:744)

Stack Trace:
com.carrotsearch.randomizedtesting.ThreadLeakError: 15 threads leaked from SUITE scope at org.apache.solr.cloud.RecoveryZkTest: 
   1) Thread[id=1461, name=TEST-RecoveryZkTest.testDistribSearch-seed#[E368A8EA0D0F1923]-EventThread, state=WAITING, group=TGRP-RecoveryZkTest]
        at sun.misc.Unsafe.park(Native Method)
        at java.util.concurrent.locks.LockSupport.park(LockSupport.java:175)
        at java.util.concurrent.locks.AbstractQueuedSynchronizer$ConditionObject.await(AbstractQueuedSynchronizer.java:2039)
        at java.util.concurrent.LinkedBlockingQueue.take(LinkedBlockingQueue.java:442)
        at org.apache.zookeeper.ClientCnxn$EventThread.run(ClientCnxn.java:491)
   2) Thread[id=1441, name=NIOServerCxn.Factory:0.0.0.0/0.0.0.0:0, state=RUNNABLE, group=TGRP-RecoveryZkTest]
        at sun.nio.ch.EPollArrayWrapper.epollWait(Native Method)
        at sun.nio.ch.EPollArrayWrapper.poll(EPollArrayWrapper.java:269)
        at sun.nio.ch.EPollSelectorImpl.doSelect(EPollSelectorImpl.java:79)
        at sun.nio.ch.SelectorImpl.lockAndDoSelect(SelectorImpl.java:86)
        at sun.nio.ch.SelectorImpl.select(SelectorImpl.java:97)
        at org.apache.zookeeper.server.NIOServerCnxnFactory.run(NIOServerCnxnFactory.java:178)
        at java.lang.Thread.run(Thread.java:744)
   3) Thread[id=1449, name=HashSessionScavenger-42, state=TIMED_WAITING, group=TGRP-RecoveryZkTest]
        at java.lang.Object.wait(Native Method)
        at java.util.TimerThread.mainLoop(Timer.java:552)
        at java.util.TimerThread.run(Timer.java:505)
   4) Thread[id=1451, name=qtp25170843-1451 Selector1, state=RUNNABLE, group=TGRP-RecoveryZkTest]
        at sun.nio.ch.EPollArrayWrapper.epollWait(Native Method)
        at sun.nio.ch.EPollArrayWrapper.poll(EPollArrayWrapper.java:269)
        at sun.nio.ch.EPollSelectorImpl.doSelect(EPollSelectorImpl.java:79)
        at sun.nio.ch.SelectorImpl.lockAndDoSelect(SelectorImpl.java:86)
        at sun.nio.ch.SelectorImpl.select(SelectorImpl.java:97)
        at org.eclipse.jetty.io.nio.SelectorManager$SelectSet.doSelect(SelectorManager.java:569)
        at org.eclipse.jetty.io.nio.SelectorManager$1.run(SelectorManager.java:290)
        at org.eclipse.jetty.util.thread.QueuedThreadPool.runJob(QueuedThreadPool.java:608)
        at org.eclipse.jetty.util.thread.QueuedThreadPool$3.run(QueuedThreadPool.java:543)
        at java.lang.Thread.run(Thread.java:744)
   5) Thread[id=1453, name=qtp25170843-1453 Acceptor1 SelectChannelConnector@127.0.0.1:51416, state=BLOCKED, group=TGRP-RecoveryZkTest]
        at sun.nio.ch.ServerSocketChannelImpl.accept(ServerSocketChannelImpl.java:224)
        at org.eclipse.jetty.server.nio.SelectChannelConnector.accept(SelectChannelConnector.java:109)
        at org.eclipse.jetty.server.AbstractConnector$Acceptor.run(AbstractConnector.java:938)
        at org.eclipse.jetty.util.thread.QueuedThreadPool.runJob(QueuedThreadPool.java:608)
        at org.eclipse.jetty.util.thread.QueuedThreadPool$3.run(QueuedThreadPool.java:543)
        at java.lang.Thread.run(Thread.java:744)
   6) Thread[id=1456, name=qtp25170843-1456, state=TIMED_WAITING, group=TGRP-RecoveryZkTest]
        at sun.misc.Unsafe.park(Native Method)
        at java.util.concurrent.locks.LockSupport.parkNanos(LockSupport.java:215)
        at java.util.concurrent.locks.AbstractQueuedSynchronizer$ConditionObject.awaitNanos(AbstractQueuedSynchronizer.java:2078)
        at org.eclipse.jetty.util.BlockingArrayQueue.poll(BlockingArrayQueue.java:342)
        at org.eclipse.jetty.util.thread.QueuedThreadPool.idleJobPoll(QueuedThreadPool.java:526)
        at org.eclipse.jetty.util.thread.QueuedThreadPool.access$600(QueuedThreadPool.java:44)
        at org.eclipse.jetty.util.thread.QueuedThreadPool$3.run(QueuedThreadPool.java:572)
        at java.lang.Thread.run(Thread.java:744)
   7) Thread[id=1457, name=qtp25170843-1457, state=TIMED_WAITING, group=TGRP-RecoveryZkTest]
        at sun.misc.Unsafe.park(Native Method)
        at java.util.concurrent.locks.LockSupport.parkNanos(LockSupport.java:215)
        at java.util.concurrent.locks.AbstractQueuedSynchronizer$ConditionObject.awaitNanos(AbstractQueuedSynchronizer.java:2078)
        at org.eclipse.jetty.util.BlockingArrayQueue.poll(BlockingArrayQueue.java:342)
        at org.eclipse.jetty.util.thread.QueuedThreadPool.idleJobPoll(QueuedThreadPool.java:526)
        at org.eclipse.jetty.util.thread.QueuedThreadPool.access$600(QueuedThreadPool.java:44)
        at org.eclipse.jetty.util.thread.QueuedThreadPool$3.run(QueuedThreadPool.java:572)
        at java.lang.Thread.run(Thread.java:744)
   8) Thread[id=1455, name=qtp25170843-1455, state=TIMED_WAITING, group=TGRP-RecoveryZkTest]
        at sun.misc.Unsafe.park(Native Method)
        at java.util.concurrent.locks.LockSupport.parkNanos(LockSupport.java:215)
        at java.util.concurrent.locks.AbstractQueuedSynchronizer$ConditionObject.awaitNanos(AbstractQueuedSynchronizer.java:2078)
        at org.eclipse.jetty.util.BlockingArrayQueue.poll(BlockingArrayQueue.java:342)
        at org.eclipse.jetty.util.thread.QueuedThreadPool.idleJobPoll(QueuedThreadPool.java:526)
        at org.eclipse.jetty.util.thread.QueuedThreadPool.access$600(QueuedThreadPool.java:44)
        at org.eclipse.jetty.util.thread.QueuedThreadPool$3.run(QueuedThreadPool.java:572)
        at java.lang.Thread.run(Thread.java:744)
   9) Thread[id=1442, name=SessionTracker, state=TIMED_WAITING, group=TGRP-RecoveryZkTest]
        at java.lang.Object.wait(Native Method)
        at org.apache.zookeeper.server.SessionTrackerImpl.run(SessionTrackerImpl.java:146)
  10) Thread[id=1440, name=Thread-581, state=WAITING, group=TGRP-RecoveryZkTest]
        at java.lang.Object.wait(Native Method)
        at java.lang.Thread.join(Thread.java:1244)
        at java.lang.Thread.join(Thread.java:1318)
        at org.apache.zookeeper.server.NIOServerCnxnFactory.join(NIOServerCnxnFactory.java:302)
        at org.apache.solr.cloud.ZkTestServer$ZKServerMain.runFromConfig(ZkTestServer.java:107)
        at org.apache.solr.cloud.ZkTestServer$2.run(ZkTestServer.java:221)
  11) Thread[id=1444, name=ProcessThread(sid:0 cport:-1):, state=WAITING, group=TGRP-RecoveryZkTest]
        at sun.misc.Unsafe.park(Native Method)
        at java.util.concurrent.locks.LockSupport.park(LockSupport.java:175)
        at java.util.concurrent.locks.AbstractQueuedSynchronizer$ConditionObject.await(AbstractQueuedSynchronizer.java:2039)
        at java.util.concurrent.LinkedBlockingQueue.take(LinkedBlockingQueue.java:442)
        at org.apache.zookeeper.server.PrepRequestProcessor.run(PrepRequestProcessor.java:120)
  12) Thread[id=1450, name=qtp25170843-1450 Selector0, state=RUNNABLE, group=TGRP-RecoveryZkTest]
        at sun.nio.ch.EPollArrayWrapper.epollWait(Native Method)
        at sun.nio.ch.EPollArrayWrapper.poll(EPollArrayWrapper.java:269)
        at sun.nio.ch.EPollSelectorImpl.doSelect(EPollSelectorImpl.java:79)
        at sun.nio.ch.SelectorImpl.lockAndDoSelect(SelectorImpl.java:86)
        at sun.nio.ch.SelectorImpl.select(SelectorImpl.java:97)
        at org.eclipse.jetty.io.nio.SelectorManager$SelectSet.doSelect(SelectorManager.java:569)
        at org.eclipse.jetty.io.nio.SelectorManager$1.run(SelectorManager.java:290)
        at org.eclipse.jetty.util.thread.QueuedThreadPool.runJob(QueuedThreadPool.java:608)
        at org.eclipse.jetty.util.thread.QueuedThreadPool$3.run(QueuedThreadPool.java:543)
        at java.lang.Thread.run(Thread.java:744)
  13) Thread[id=1460, name=TEST-RecoveryZkTest.testDistribSearch-seed#[E368A8EA0D0F1923]-SendThread(localhost.localdomain:40005), state=RUNNABLE, group=TGRP-RecoveryZkTest]
        at sun.nio.ch.EPollArrayWrapper.epollWait(Native Method)
        at sun.nio.ch.EPollArrayWrapper.poll(EPollArrayWrapper.java:269)
        at sun.nio.ch.EPollSelectorImpl.doSelect(EPollSelectorImpl.java:79)
        at sun.nio.ch.SelectorImpl.lockAndDoSelect(SelectorImpl.java:86)
        at sun.nio.ch.SelectorImpl.select(SelectorImpl.java:97)
        at org.apache.zookeeper.ClientCnxnSocketNIO.doTransport(ClientCnxnSocketNIO.java:338)
        at org.apache.zookeeper.ClientCnxn$SendThread.run(ClientCnxn.java:1068)
  14) Thread[id=1452, name=qtp25170843-1452 Acceptor0 SelectChannelConnector@127.0.0.1:51416, state=RUNNABLE, group=TGRP-RecoveryZkTest]
        at sun.nio.ch.ServerSocketChannelImpl.accept0(Native Method)
        at sun.nio.ch.ServerSocketChannelImpl.accept(ServerSocketChannelImpl.java:241)
        at org.eclipse.jetty.server.nio.SelectChannelConnector.accept(SelectChannelConnector.java:109)
        at org.eclipse.jetty.server.AbstractConnector$Acceptor.run(AbstractConnector.java:938)
        at org.eclipse.jetty.util.thread.QueuedThreadPool.runJob(QueuedThreadPool.java:608)
        at org.eclipse.jetty.util.thread.QueuedThreadPool$3.run(QueuedThreadPool.java:543)
        at java.lang.Thread.run(Thread.java:744)
  15) Thread[id=1454, name=qtp25170843-1454, state=TIMED_WAITING, group=TGRP-RecoveryZkTest]
        at sun.misc.Unsafe.park(Native Method)
        at java.util.concurrent.locks.LockSupport.parkNanos(LockSupport.java:215)
        at java.util.concurrent.locks.AbstractQueuedSynchronizer$ConditionObject.awaitNanos(AbstractQueuedSynchronizer.java:2078)
        at org.eclipse.jetty.util.BlockingArrayQueue.poll(BlockingArrayQueue.java:342)
        at org.eclipse.jetty.util.thread.QueuedThreadPool.idleJobPoll(QueuedThreadPool.java:526)
        at org.eclipse.jetty.util.thread.QueuedThreadPool.access$600(QueuedThreadPool.java:44)
        at org.eclipse.jetty.util.thread.QueuedThreadPool$3.run(QueuedThreadPool.java:572)
        at java.lang.Thread.run(Thread.java:744)
	at __randomizedtesting.SeedInfo.seed([E368A8EA0D0F1923]:0)


FAILED:  junit.framework.TestSuite.org.apache.solr.cloud.RecoveryZkTest

Error Message:
There are still zombie threads that couldn't be terminated:    1) Thread[id=1450, name=qtp25170843-1450 Selector0, state=RUNNABLE, group=TGRP-RecoveryZkTest]         at sun.nio.ch.EPollArrayWrapper.interrupt(Native Method)         at sun.nio.ch.EPollArrayWrapper.interrupt(EPollArrayWrapper.java:317)         at sun.nio.ch.EPollSelectorImpl.wakeup(EPollSelectorImpl.java:193)         at java.nio.channels.spi.AbstractSelector$1.interrupt(AbstractSelector.java:213)         at java.nio.channels.spi.AbstractSelector.begin(AbstractSelector.java:219)         at sun.nio.ch.EPollSelectorImpl.doSelect(EPollSelectorImpl.java:78)         at sun.nio.ch.SelectorImpl.lockAndDoSelect(SelectorImpl.java:86)         at sun.nio.ch.SelectorImpl.selectNow(SelectorImpl.java:105)         at org.eclipse.jetty.io.nio.SelectorManager$SelectSet.doSelect(SelectorManager.java:536)         at org.eclipse.jetty.io.nio.SelectorManager$1.run(SelectorManager.java:290)         at org.eclipse.jetty.util.thread.QueuedThreadPool.runJob(QueuedThreadPool.java:608)         at org.eclipse.jetty.util.thread.QueuedThreadPool$3.run(QueuedThreadPool.java:543)         at java.lang.Thread.run(Thread.java:744)    2) Thread[id=1460, name=TEST-RecoveryZkTest.testDistribSearch-seed#[E368A8EA0D0F1923]-SendThread(localhost.localdomain:40005), state=RUNNABLE, group=TGRP-RecoveryZkTest]         at java.security.AccessController.getStackAccessControlContext(Native Method)         at java.security.AccessController.checkPermission(AccessController.java:858)         at java.lang.SecurityManager.checkPermission(SecurityManager.java:549)         at javax.security.auth.login.Configuration.getConfiguration(Configuration.java:228)         at org.apache.zookeeper.client.ZooKeeperSaslClient.clientTunneledAuthenticationInProgress(ZooKeeperSaslClient.java:487)         at org.apache.zookeeper.ClientCnxn$SendThread.clientTunneledAuthenticationInProgress(ClientCnxn.java:1241)         at org.apache.zookeeper.ClientCnxnSocketNIO.doTransport(ClientCnxnSocketNIO.java:360)         at org.apache.zookeeper.ClientCnxn$SendThread.run(ClientCnxn.java:1068)    3) Thread[id=1452, name=qtp25170843-1452 Acceptor0 SelectChannelConnector@127.0.0.1:51416, state=RUNNABLE, group=TGRP-RecoveryZkTest]         at org.eclipse.jetty.server.nio.SelectChannelConnector.getConnection(SelectChannelConnector.java:160)         at org.eclipse.jetty.server.AbstractConnector$Acceptor.run(AbstractConnector.java:934)         at org.eclipse.jetty.util.thread.QueuedThreadPool.runJob(QueuedThreadPool.java:608)         at org.eclipse.jetty.util.thread.QueuedThreadPool$3.run(QueuedThreadPool.java:543)         at java.lang.Thread.run(Thread.java:744)    4) Thread[id=1441, name=NIOServerCxn.Factory:0.0.0.0/0.0.0.0:0, state=RUNNABLE, group=TGRP-RecoveryZkTest]         at java.lang.Thread.isInterrupted(Native Method)         at java.lang.Thread.isInterrupted(Thread.java:960)         at java.nio.channels.spi.AbstractSelector.begin(AbstractSelector.java:218)         at sun.nio.ch.EPollSelectorImpl.doSelect(EPollSelectorImpl.java:78)         at sun.nio.ch.SelectorImpl.lockAndDoSelect(SelectorImpl.java:86)         at sun.nio.ch.SelectorImpl.select(SelectorImpl.java:97)         at org.apache.zookeeper.server.NIOServerCnxnFactory.run(NIOServerCnxnFactory.java:178)         at java.lang.Thread.run(Thread.java:744)    5) Thread[id=1449, name=HashSessionScavenger-42, state=TIMED_WAITING, group=TGRP-RecoveryZkTest]         at java.lang.Object.wait(Native Method)         at java.util.TimerThread.mainLoop(Timer.java:552)         at java.util.TimerThread.run(Timer.java:505)    6) Thread[id=1451, name=qtp25170843-1451 Selector1, state=RUNNABLE, group=TGRP-RecoveryZkTest]         at sun.nio.ch.EPollArrayWrapper.interrupt(Native Method)         at sun.nio.ch.EPollArrayWrapper.interrupt(EPollArrayWrapper.java:317)         at sun.nio.ch.EPollSelectorImpl.wakeup(EPollSelectorImpl.java:193)         at java.nio.channels.spi.AbstractSelector$1.interrupt(AbstractSelector.java:213)         at java.nio.channels.spi.AbstractSelector.begin(AbstractSelector.java:219)         at sun.nio.ch.EPollSelectorImpl.doSelect(EPollSelectorImpl.java:78)         at sun.nio.ch.SelectorImpl.lockAndDoSelect(SelectorImpl.java:86)         at sun.nio.ch.SelectorImpl.select(SelectorImpl.java:97)         at org.eclipse.jetty.io.nio.SelectorManager$SelectSet.doSelect(SelectorManager.java:569)         at org.eclipse.jetty.io.nio.SelectorManager$1.run(SelectorManager.java:290)         at org.eclipse.jetty.util.thread.QueuedThreadPool.runJob(QueuedThreadPool.java:608)         at org.eclipse.jetty.util.thread.QueuedThreadPool$3.run(QueuedThreadPool.java:543)         at java.lang.Thread.run(Thread.java:744)    7) Thread[id=1453, name=qtp25170843-1453 Acceptor1 SelectChannelConnector@127.0.0.1:51416, state=RUNNABLE, group=TGRP-RecoveryZkTest]         at org.eclipse.jetty.server.nio.SelectChannelConnector.accept(SelectChannelConnector.java:102)         at org.eclipse.jetty.server.AbstractConnector$Acceptor.run(AbstractConnector.java:938)         at org.eclipse.jetty.util.thread.QueuedThreadPool.runJob(QueuedThreadPool.java:608)         at org.eclipse.jetty.util.thread.QueuedThreadPool$3.run(QueuedThreadPool.java:543)         at java.lang.Thread.run(Thread.java:744)

Stack Trace:
com.carrotsearch.randomizedtesting.ThreadLeakError: There are still zombie threads that couldn't be terminated:
   1) Thread[id=1450, name=qtp25170843-1450 Selector0, state=RUNNABLE, group=TGRP-RecoveryZkTest]
        at sun.nio.ch.EPollArrayWrapper.interrupt(Native Method)
        at sun.nio.ch.EPollArrayWrapper.interrupt(EPollArrayWrapper.java:317)
        at sun.nio.ch.EPollSelectorImpl.wakeup(EPollSelectorImpl.java:193)
        at java.nio.channels.spi.AbstractSelector$1.interrupt(AbstractSelector.java:213)
        at java.nio.channels.spi.AbstractSelector.begin(AbstractSelector.java:219)
        at sun.nio.ch.EPollSelectorImpl.doSelect(EPollSelectorImpl.java:78)
        at sun.nio.ch.SelectorImpl.lockAndDoSelect(SelectorImpl.java:86)
        at sun.nio.ch.SelectorImpl.selectNow(SelectorImpl.java:105)
        at org.eclipse.jetty.io.nio.SelectorManager$SelectSet.doSelect(SelectorManager.java:536)
        at org.eclipse.jetty.io.nio.SelectorManager$1.run(SelectorManager.java:290)
        at org.eclipse.jetty.util.thread.QueuedThreadPool.runJob(QueuedThreadPool.java:608)
        at org.eclipse.jetty.util.thread.QueuedThreadPool$3.run(QueuedThreadPool.java:543)
        at java.lang.Thread.run(Thread.java:744)
   2) Thread[id=1460, name=TEST-RecoveryZkTest.testDistribSearch-seed#[E368A8EA0D0F1923]-SendThread(localhost.localdomain:40005), state=RUNNABLE, group=TGRP-RecoveryZkTest]
        at java.security.AccessController.getStackAccessControlContext(Native Method)
        at java.security.AccessController.checkPermission(AccessController.java:858)
        at java.lang.SecurityManager.checkPermission(SecurityManager.java:549)
        at javax.security.auth.login.Configuration.getConfiguration(Configuration.java:228)
        at org.apache.zookeeper.client.ZooKeeperSaslClient.clientTunneledAuthenticationInProgress(ZooKeeperSaslClient.java:487)
        at org.apache.zookeeper.ClientCnxn$SendThread.clientTunneledAuthenticationInProgress(ClientCnxn.java:1241)
        at org.apache.zookeeper.ClientCnxnSocketNIO.doTransport(ClientCnxnSocketNIO.java:360)
        at org.apache.zookeeper.ClientCnxn$SendThread.run(ClientCnxn.java:1068)
   3) Thread[id=1452, name=qtp25170843-1452 Acceptor0 SelectChannelConnector@127.0.0.1:51416, state=RUNNABLE, group=TGRP-RecoveryZkTest]
        at org.eclipse.jetty.server.nio.SelectChannelConnector.getConnection(SelectChannelConnector.java:160)
        at org.eclipse.jetty.server.AbstractConnector$Acceptor.run(AbstractConnector.java:934)
        at org.eclipse.jetty.util.thread.QueuedThreadPool.runJob(QueuedThreadPool.java:608)
        at org.eclipse.jetty.util.thread.QueuedThreadPool$3.run(QueuedThreadPool.java:543)
        at java.lang.Thread.run(Thread.java:744)
   4) Thread[id=1441, name=NIOServerCxn.Factory:0.0.0.0/0.0.0.0:0, state=RUNNABLE, group=TGRP-RecoveryZkTest]
        at java.lang.Thread.isInterrupted(Native Method)
        at java.lang.Thread.isInterrupted(Thread.java:960)
        at java.nio.channels.spi.AbstractSelector.begin(AbstractSelector.java:218)
        at sun.nio.ch.EPollSelectorImpl.doSelect(EPollSelectorImpl.java:78)
        at sun.nio.ch.SelectorImpl.lockAndDoSelect(SelectorImpl.java:86)
        at sun.nio.ch.SelectorImpl.select(SelectorImpl.java:97)
        at org.apache.zookeeper.server.NIOServerCnxnFactory.run(NIOServerCnxnFactory.java:178)
        at java.lang.Thread.run(Thread.java:744)
   5) Thread[id=1449, name=HashSessionScavenger-42, state=TIMED_WAITING, group=TGRP-RecoveryZkTest]
        at java.lang.Object.wait(Native Method)
        at java.util.TimerThread.mainLoop(Timer.java:552)
        at java.util.TimerThread.run(Timer.java:505)
   6) Thread[id=1451, name=qtp25170843-1451 Selector1, state=RUNNABLE, group=TGRP-RecoveryZkTest]
        at sun.nio.ch.EPollArrayWrapper.interrupt(Native Method)
        at sun.nio.ch.EPollArrayWrapper.interrupt(EPollArrayWrapper.java:317)
        at sun.nio.ch.EPollSelectorImpl.wakeup(EPollSelectorImpl.java:193)
        at java.nio.channels.spi.AbstractSelector$1.interrupt(AbstractSelector.java:213)
        at java.nio.channels.spi.AbstractSelector.begin(AbstractSelector.java:219)
        at sun.nio.ch.EPollSelectorImpl.doSelect(EPollSelectorImpl.java:78)
        at sun.nio.ch.SelectorImpl.lockAndDoSelect(SelectorImpl.java:86)
        at sun.nio.ch.SelectorImpl.select(SelectorImpl.java:97)
        at org.eclipse.jetty.io.nio.SelectorManager$SelectSet.doSelect(SelectorManager.java:569)
        at org.eclipse.jetty.io.nio.SelectorManager$1.run(SelectorManager.java:290)
        at org.eclipse.jetty.util.thread.QueuedThreadPool.runJob(QueuedThreadPool.java:608)
        at org.eclipse.jetty.util.thread.QueuedThreadPool$3.run(QueuedThreadPool.java:543)
        at java.lang.Thread.run(Thread.java:744)
   7) Thread[id=1453, name=qtp25170843-1453 Acceptor1 SelectChannelConnector@127.0.0.1:51416, state=RUNNABLE, group=TGRP-RecoveryZkTest]
        at org.eclipse.jetty.server.nio.SelectChannelConnector.accept(SelectChannelConnector.java:102)
        at org.eclipse.jetty.server.AbstractConnector$Acceptor.run(AbstractConnector.java:938)
        at org.eclipse.jetty.util.thread.QueuedThreadPool.runJob(QueuedThreadPool.java:608)
        at org.eclipse.jetty.util.thread.QueuedThreadPool$3.run(QueuedThreadPool.java:543)
        at java.lang.Thread.run(Thread.java:744)
	at __randomizedtesting.SeedInfo.seed([E368A8EA0D0F1923]:0)


FAILED:  junit.framework.TestSuite.org.apache.solr.core.TestConfig

Error Message:
org.apache.solr.common.SolrException: java.util.concurrent.TimeoutException: Could not connect to ZooKeeper 127.0.0.1:36628 within 30000 ms

Stack Trace:
java.lang.RuntimeException: org.apache.solr.common.SolrException: java.util.concurrent.TimeoutException: Could not connect to ZooKeeper 127.0.0.1:36628 within 30000 ms
	at __randomizedtesting.SeedInfo.seed([E368A8EA0D0F1923]:0)
	at org.apache.solr.util.TestHarness.<init>(TestHarness.java:142)
	at org.apache.solr.util.TestHarness.<init>(TestHarness.java:147)
	at org.apache.solr.util.TestHarness.<init>(TestHarness.java:98)
	at org.apache.solr.SolrTestCaseJ4.createCore(SolrTestCaseJ4.java:566)
	at org.apache.solr.SolrTestCaseJ4.initCore(SolrTestCaseJ4.java:556)
	at org.apache.solr.SolrTestCaseJ4.initCore(SolrTestCaseJ4.java:365)
	at org.apache.solr.SolrTestCaseJ4.initCore(SolrTestCaseJ4.java:352)
	at org.apache.solr.core.TestConfig.beforeClass(TestConfig.java:45)
	at sun.reflect.NativeMethodAccessorImpl.invoke0(Native Method)
	at sun.reflect.NativeMethodAccessorImpl.invoke(NativeMethodAccessorImpl.java:62)
	at sun.reflect.DelegatingMethodAccessorImpl.invoke(DelegatingMethodAccessorImpl.java:43)
	at java.lang.reflect.Method.invoke(Method.java:483)
	at com.carrotsearch.randomizedtesting.RandomizedRunner.invoke(RandomizedRunner.java:1617)
	at com.carrotsearch.randomizedtesting.RandomizedRunner$4.evaluate(RandomizedRunner.java:766)
	at com.carrotsearch.randomizedtesting.RandomizedRunner$5.evaluate(RandomizedRunner.java:782)
	at com.carrotsearch.randomizedtesting.rules.StatementAdapter.evaluate(StatementAdapter.java:36)
	at com.carrotsearch.randomizedtesting.rules.SystemPropertiesRestoreRule$1.evaluate(SystemPropertiesRestoreRule.java:53)
	at org.apache.lucene.util.AbstractBeforeAfterRule$1.evaluate(AbstractBeforeAfterRule.java:46)
	at org.apache.lucene.util.TestRuleStoreClassName$1.evaluate(TestRuleStoreClassName.java:42)
	at com.carrotsearch.randomizedtesting.rules.SystemPropertiesInvariantRule$1.evaluate(SystemPropertiesInvariantRule.java:55)
	at com.carrotsearch.randomizedtesting.rules.NoShadowingOrOverridesOnMethodsRule$1.evaluate(NoShadowingOrOverridesOnMethodsRule.java:39)
	at com.carrotsearch.randomizedtesting.rules.NoShadowingOrOverridesOnMethodsRule$1.evaluate(NoShadowingOrOverridesOnMethodsRule.java:39)
	at com.carrotsearch.randomizedtesting.rules.StatementAdapter.evaluate(StatementAdapter.java:36)
	at org.apache.lucene.util.TestRuleAssertionsRequired$1.evaluate(TestRuleAssertionsRequired.java:43)
	at org.apache.lucene.util.TestRuleMarkFailure$1.evaluate(TestRuleMarkFailure.java:48)
	at org.apache.lucene.util.TestRuleIgnoreAfterMaxFailures$1.evaluate(TestRuleIgnoreAfterMaxFailures.java:70)
	at org.apache.lucene.util.TestRuleIgnoreTestSuites$1.evaluate(TestRuleIgnoreTestSuites.java:55)
	at com.carrotsearch.randomizedtesting.rules.StatementAdapter.evaluate(StatementAdapter.java:36)
	at com.carrotsearch.randomizedtesting.ThreadLeakControl$StatementRunner.run(ThreadLeakControl.java:359)
	at java.lang.Thread.run(Thread.java:744)
Caused by: org.apache.solr.common.SolrException: java.util.concurrent.TimeoutException: Could not connect to ZooKeeper 127.0.0.1:36628 within 30000 ms
	at org.apache.solr.common.cloud.SolrZkClient.<init>(SolrZkClient.java:150)
	at org.apache.solr.common.cloud.SolrZkClient.<init>(SolrZkClient.java:101)
	at org.apache.solr.common.cloud.SolrZkClient.<init>(SolrZkClient.java:96)
	at org.apache.solr.common.cloud.SolrZkClient.<init>(SolrZkClient.java:83)
	at org.apache.solr.cloud.ZkController.checkChrootPath(ZkController.java:667)
	at org.apache.solr.core.ZkContainer.initZooKeeper(ZkContainer.java:133)
	at org.apache.solr.core.ZkContainer.initZooKeeper(ZkContainer.java:67)
	at org.apache.solr.core.CoreContainer.load(CoreContainer.java:230)
	at org.apache.solr.util.TestHarness.<init>(TestHarness.java:137)
	... 29 more
Caused by: java.util.concurrent.TimeoutException: Could not connect to ZooKeeper 127.0.0.1:36628 within 30000 ms
	at org.apache.solr.common.cloud.ConnectionManager.waitForConnected(ConnectionManager.java:223)
	at org.apache.solr.common.cloud.SolrZkClient.<init>(SolrZkClient.java:142)
	... 37 more


FAILED:  junit.framework.TestSuite.org.apache.solr.core.TestCoreContainer

Error Message:
org.apache.solr.common.SolrException: java.util.concurrent.TimeoutException: Could not connect to ZooKeeper 127.0.0.1:36628 within 30000 ms

Stack Trace:
java.lang.RuntimeException: org.apache.solr.common.SolrException: java.util.concurrent.TimeoutException: Could not connect to ZooKeeper 127.0.0.1:36628 within 30000 ms
	at __randomizedtesting.SeedInfo.seed([E368A8EA0D0F1923]:0)
	at org.apache.solr.util.TestHarness.<init>(TestHarness.java:142)
	at org.apache.solr.util.TestHarness.<init>(TestHarness.java:147)
	at org.apache.solr.util.TestHarness.<init>(TestHarness.java:98)
	at org.apache.solr.SolrTestCaseJ4.createCore(SolrTestCaseJ4.java:566)
	at org.apache.solr.SolrTestCaseJ4.initCore(SolrTestCaseJ4.java:556)
	at org.apache.solr.SolrTestCaseJ4.initCore(SolrTestCaseJ4.java:365)
	at org.apache.solr.SolrTestCaseJ4.initCore(SolrTestCaseJ4.java:352)
	at org.apache.solr.core.TestCoreContainer.beforeClass(TestCoreContainer.java:54)
	at sun.reflect.NativeMethodAccessorImpl.invoke0(Native Method)
	at sun.reflect.NativeMethodAccessorImpl.invoke(NativeMethodAccessorImpl.java:62)
	at sun.reflect.DelegatingMethodAccessorImpl.invoke(DelegatingMethodAccessorImpl.java:43)
	at java.lang.reflect.Method.invoke(Method.java:483)
	at com.carrotsearch.randomizedtesting.RandomizedRunner.invoke(RandomizedRunner.java:1617)
	at com.carrotsearch.randomizedtesting.RandomizedRunner$4.evaluate(RandomizedRunner.java:766)
	at com.carrotsearch.randomizedtesting.RandomizedRunner$5.evaluate(RandomizedRunner.java:782)
	at com.carrotsearch.randomizedtesting.rules.StatementAdapter.evaluate(StatementAdapter.java:36)
	at com.carrotsearch.randomizedtesting.rules.SystemPropertiesRestoreRule$1.evaluate(SystemPropertiesRestoreRule.java:53)
	at org.apache.lucene.util.AbstractBeforeAfterRule$1.evaluate(AbstractBeforeAfterRule.java:46)
	at org.apache.lucene.util.TestRuleStoreClassName$1.evaluate(TestRuleStoreClassName.java:42)
	at com.carrotsearch.randomizedtesting.rules.SystemPropertiesInvariantRule$1.evaluate(SystemPropertiesInvariantRule.java:55)
	at com.carrotsearch.randomizedtesting.rules.NoShadowingOrOverridesOnMethodsRule$1.evaluate(NoShadowingOrOverridesOnMethodsRule.java:39)
	at com.carrotsearch.randomizedtesting.rules.NoShadowingOrOverridesOnMethodsRule$1.evaluate(NoShadowingOrOverridesOnMethodsRule.java:39)
	at com.carrotsearch.randomizedtesting.rules.StatementAdapter.evaluate(StatementAdapter.java:36)
	at org.apache.lucene.util.TestRuleAssertionsRequired$1.evaluate(TestRuleAssertionsRequired.java:43)
	at org.apache.lucene.util.TestRuleMarkFailure$1.evaluate(TestRuleMarkFailure.java:48)
	at org.apache.lucene.util.TestRuleIgnoreAfterMaxFailures$1.evaluate(TestRuleIgnoreAfterMaxFailures.java:70)
	at org.apache.lucene.util.TestRuleIgnoreTestSuites$1.evaluate(TestRuleIgnoreTestSuites.java:55)
	at com.carrotsearch.randomizedtesting.rules.StatementAdapter.evaluate(StatementAdapter.java:36)
	at com.carrotsearch.randomizedtesting.ThreadLeakControl$StatementRunner.run(ThreadLeakControl.java:359)
	at java.lang.Thread.run(Thread.java:744)
Caused by: org.apache.solr.common.SolrException: java.util.concurrent.TimeoutException: Could not connect to ZooKeeper 127.0.0.1:36628 within 30000 ms
	at org.apache.solr.common.cloud.SolrZkClient.<init>(SolrZkClient.java:150)
	at org.apache.solr.common.cloud.SolrZkClient.<init>(SolrZkClient.java:101)
	at org.apache.solr.common.cloud.SolrZkClient.<init>(SolrZkClient.java:96)
	at org.apache.solr.common.cloud.SolrZkClient.<init>(SolrZkClient.java:83)
	at org.apache.solr.cloud.ZkController.checkChrootPath(ZkController.java:667)
	at org.apache.solr.core.ZkContainer.initZooKeeper(ZkContainer.java:133)
	at org.apache.solr.core.ZkContainer.initZooKeeper(ZkContainer.java:67)
	at org.apache.solr.core.CoreContainer.load(CoreContainer.java:230)
	at org.apache.solr.util.TestHarness.<init>(TestHarness.java:137)
	... 29 more
Caused by: java.util.concurrent.TimeoutException: Could not connect to ZooKeeper 127.0.0.1:36628 within 30000 ms
	at org.apache.solr.common.cloud.ConnectionManager.waitForConnected(ConnectionManager.java:223)
	at org.apache.solr.common.cloud.SolrZkClient.<init>(SolrZkClient.java:142)
	... 37 more


FAILED:  junit.framework.TestSuite.org.apache.solr.handler.JsonLoaderTest

Error Message:
org.apache.solr.common.SolrException: java.util.concurrent.TimeoutException: Could not connect to ZooKeeper 127.0.0.1:36628 within 30000 ms

Stack Trace:
java.lang.RuntimeException: org.apache.solr.common.SolrException: java.util.concurrent.TimeoutException: Could not connect to ZooKeeper 127.0.0.1:36628 within 30000 ms
	at __randomizedtesting.SeedInfo.seed([E368A8EA0D0F1923]:0)
	at org.apache.solr.util.TestHarness.<init>(TestHarness.java:142)
	at org.apache.solr.util.TestHarness.<init>(TestHarness.java:147)
	at org.apache.solr.util.TestHarness.<init>(TestHarness.java:98)
	at org.apache.solr.SolrTestCaseJ4.createCore(SolrTestCaseJ4.java:566)
	at org.apache.solr.SolrTestCaseJ4.initCore(SolrTestCaseJ4.java:556)
	at org.apache.solr.SolrTestCaseJ4.initCore(SolrTestCaseJ4.java:365)
	at org.apache.solr.SolrTestCaseJ4.initCore(SolrTestCaseJ4.java:352)
	at org.apache.solr.handler.JsonLoaderTest.beforeTests(JsonLoaderTest.java:44)
	at sun.reflect.NativeMethodAccessorImpl.invoke0(Native Method)
	at sun.reflect.NativeMethodAccessorImpl.invoke(NativeMethodAccessorImpl.java:62)
	at sun.reflect.DelegatingMethodAccessorImpl.invoke(DelegatingMethodAccessorImpl.java:43)
	at java.lang.reflect.Method.invoke(Method.java:483)
	at com.carrotsearch.randomizedtesting.RandomizedRunner.invoke(RandomizedRunner.java:1617)
	at com.carrotsearch.randomizedtesting.RandomizedRunner$4.evaluate(RandomizedRunner.java:766)
	at com.carrotsearch.randomizedtesting.RandomizedRunner$5.evaluate(RandomizedRunner.java:782)
	at com.carrotsearch.randomizedtesting.rules.StatementAdapter.evaluate(StatementAdapter.java:36)
	at com.carrotsearch.randomizedtesting.rules.SystemPropertiesRestoreRule$1.evaluate(SystemPropertiesRestoreRule.java:53)
	at org.apache.lucene.util.AbstractBeforeAfterRule$1.evaluate(AbstractBeforeAfterRule.java:46)
	at org.apache.lucene.util.TestRuleStoreClassName$1.evaluate(TestRuleStoreClassName.java:42)
	at com.carrotsearch.randomizedtesting.rules.SystemPropertiesInvariantRule$1.evaluate(SystemPropertiesInvariantRule.java:55)
	at com.carrotsearch.randomizedtesting.rules.NoShadowingOrOverridesOnMethodsRule$1.evaluate(NoShadowingOrOverridesOnMethodsRule.java:39)
	at com.carrotsearch.randomizedtesting.rules.NoShadowingOrOverridesOnMethodsRule$1.evaluate(NoShadowingOrOverridesOnMethodsRule.java:39)
	at com.carrotsearch.randomizedtesting.rules.StatementAdapter.evaluate(StatementAdapter.java:36)
	at org.apache.lucene.util.TestRuleAssertionsRequired$1.evaluate(TestRuleAssertionsRequired.java:43)
	at org.apache.lucene.util.TestRuleMarkFailure$1.evaluate(TestRuleMarkFailure.java:48)
	at org.apache.lucene.util.TestRuleIgnoreAfterMaxFailures$1.evaluate(TestRuleIgnoreAfterMaxFailures.java:70)
	at org.apache.lucene.util.TestRuleIgnoreTestSuites$1.evaluate(TestRuleIgnoreTestSuites.java:55)
	at com.carrotsearch.randomizedtesting.rules.StatementAdapter.evaluate(StatementAdapter.java:36)
	at com.carrotsearch.randomizedtesting.ThreadLeakControl$StatementRunner.run(ThreadLeakControl.java:359)
	at java.lang.Thread.run(Thread.java:744)
Caused by: org.apache.solr.common.SolrException: java.util.concurrent.TimeoutException: Could not connect to ZooKeeper 127.0.0.1:36628 within 30000 ms
	at org.apache.solr.common.cloud.SolrZkClient.<init>(SolrZkClient.java:150)
	at org.apache.solr.common.cloud.SolrZkClient.<init>(SolrZkClient.java:101)
	at org.apache.solr.common.cloud.SolrZkClient.<init>(SolrZkClient.java:96)
	at org.apache.solr.common.cloud.SolrZkClient.<init>(SolrZkClient.java:83)
	at org.apache.solr.cloud.ZkController.checkChrootPath(ZkController.java:667)
	at org.apache.solr.core.ZkContainer.initZooKeeper(ZkContainer.java:133)
	at org.apache.solr.core.ZkContainer.initZooKeeper(ZkContainer.java:67)
	at org.apache.solr.core.CoreContainer.load(CoreContainer.java:230)
	at org.apache.solr.util.TestHarness.<init>(TestHarness.java:137)
	... 29 more
Caused by: java.util.concurrent.TimeoutException: Could not connect to ZooKeeper 127.0.0.1:36628 within 30000 ms
	at org.apache.solr.common.cloud.ConnectionManager.waitForConnected(ConnectionManager.java:223)
	at org.apache.solr.common.cloud.SolrZkClient.<init>(SolrZkClient.java:142)
	... 37 more


FAILED:  junit.framework.TestSuite.org.apache.solr.handler.admin.LoggingHandlerTest

Error Message:
org.apache.solr.common.SolrException: java.util.concurrent.TimeoutException: Could not connect to ZooKeeper 127.0.0.1:36628 within 30000 ms

Stack Trace:
java.lang.RuntimeException: org.apache.solr.common.SolrException: java.util.concurrent.TimeoutException: Could not connect to ZooKeeper 127.0.0.1:36628 within 30000 ms
	at __randomizedtesting.SeedInfo.seed([E368A8EA0D0F1923]:0)
	at org.apache.solr.util.TestHarness.<init>(TestHarness.java:142)
	at org.apache.solr.util.TestHarness.<init>(TestHarness.java:147)
	at org.apache.solr.util.TestHarness.<init>(TestHarness.java:98)
	at org.apache.solr.SolrTestCaseJ4.createCore(SolrTestCaseJ4.java:566)
	at org.apache.solr.SolrTestCaseJ4.initCore(SolrTestCaseJ4.java:556)
	at org.apache.solr.SolrTestCaseJ4.initCore(SolrTestCaseJ4.java:365)
	at org.apache.solr.SolrTestCaseJ4.initCore(SolrTestCaseJ4.java:352)
	at org.apache.solr.handler.admin.LoggingHandlerTest.beforeClass(LoggingHandlerTest.java:39)
	at sun.reflect.NativeMethodAccessorImpl.invoke0(Native Method)
	at sun.reflect.NativeMethodAccessorImpl.invoke(NativeMethodAccessorImpl.java:62)
	at sun.reflect.DelegatingMethodAccessorImpl.invoke(DelegatingMethodAccessorImpl.java:43)
	at java.lang.reflect.Method.invoke(Method.java:483)
	at com.carrotsearch.randomizedtesting.RandomizedRunner.invoke(RandomizedRunner.java:1617)
	at com.carrotsearch.randomizedtesting.RandomizedRunner$4.evaluate(RandomizedRunner.java:766)
	at com.carrotsearch.randomizedtesting.RandomizedRunner$5.evaluate(RandomizedRunner.java:782)
	at com.carrotsearch.randomizedtesting.rules.StatementAdapter.evaluate(StatementAdapter.java:36)
	at com.carrotsearch.randomizedtesting.rules.SystemPropertiesRestoreRule$1.evaluate(SystemPropertiesRestoreRule.java:53)
	at org.apache.lucene.util.AbstractBeforeAfterRule$1.evaluate(AbstractBeforeAfterRule.java:46)
	at org.apache.lucene.util.TestRuleStoreClassName$1.evaluate(TestRuleStoreClassName.java:42)
	at com.carrotsearch.randomizedtesting.rules.SystemPropertiesInvariantRule$1.evaluate(SystemPropertiesInvariantRule.java:55)
	at com.carrotsearch.randomizedtesting.rules.NoShadowingOrOverridesOnMethodsRule$1.evaluate(NoShadowingOrOverridesOnMethodsRule.java:39)
	at com.carrotsearch.randomizedtesting.rules.NoShadowingOrOverridesOnMethodsRule$1.evaluate(NoShadowingOrOverridesOnMethodsRule.java:39)
	at com.carrotsearch.randomizedtesting.rules.StatementAdapter.evaluate(StatementAdapter.java:36)
	at org.apache.lucene.util.TestRuleAssertionsRequired$1.evaluate(TestRuleAssertionsRequired.java:43)
	at org.apache.lucene.util.TestRuleMarkFailure$1.evaluate(TestRuleMarkFailure.java:48)
	at org.apache.lucene.util.TestRuleIgnoreAfterMaxFailures$1.evaluate(TestRuleIgnoreAfterMaxFailures.java:70)
	at org.apache.lucene.util.TestRuleIgnoreTestSuites$1.evaluate(TestRuleIgnoreTestSuites.java:55)
	at com.carrotsearch.randomizedtesting.rules.StatementAdapter.evaluate(StatementAdapter.java:36)
	at com.carrotsearch.randomizedtesting.ThreadLeakControl$StatementRunner.run(ThreadLeakControl.java:359)
	at java.lang.Thread.run(Thread.java:744)
Caused by: org.apache.solr.common.SolrException: java.util.concurrent.TimeoutException: Could not connect to ZooKeeper 127.0.0.1:36628 within 30000 ms
	at org.apache.solr.common.cloud.SolrZkClient.<init>(SolrZkClient.java:150)
	at org.apache.solr.common.cloud.SolrZkClient.<init>(SolrZkClient.java:101)
	at org.apache.solr.common.cloud.SolrZkClient.<init>(SolrZkClient.java:96)
	at org.apache.solr.common.cloud.SolrZkClient.<init>(SolrZkClient.java:83)
	at org.apache.solr.cloud.ZkController.checkChrootPath(ZkController.java:667)
	at org.apache.solr.core.ZkContainer.initZooKeeper(ZkContainer.java:133)
	at org.apache.solr.core.ZkContainer.initZooKeeper(ZkContainer.java:67)
	at org.apache.solr.core.CoreContainer.load(CoreContainer.java:230)
	at org.apache.solr.util.TestHarness.<init>(TestHarness.java:137)
	... 29 more
Caused by: java.util.concurrent.TimeoutException: Could not connect to ZooKeeper 127.0.0.1:36628 within 30000 ms
	at org.apache.solr.common.cloud.ConnectionManager.waitForConnected(ConnectionManager.java:223)
	at org.apache.solr.common.cloud.SolrZkClient.<init>(SolrZkClient.java:142)
	... 37 more


FAILED:  junit.framework.TestSuite.org.apache.solr.handler.component.SearchHandlerTest

Error Message:
org.apache.solr.common.SolrException: java.util.concurrent.TimeoutException: Could not connect to ZooKeeper 127.0.0.1:36628 within 30000 ms

Stack Trace:
java.lang.RuntimeException: org.apache.solr.common.SolrException: java.util.concurrent.TimeoutException: Could not connect to ZooKeeper 127.0.0.1:36628 within 30000 ms
	at __randomizedtesting.SeedInfo.seed([E368A8EA0D0F1923]:0)
	at org.apache.solr.util.TestHarness.<init>(TestHarness.java:142)
	at org.apache.solr.util.TestHarness.<init>(TestHarness.java:147)
	at org.apache.solr.util.TestHarness.<init>(TestHarness.java:98)
	at org.apache.solr.SolrTestCaseJ4.createCore(SolrTestCaseJ4.java:566)
	at org.apache.solr.SolrTestCaseJ4.initCore(SolrTestCaseJ4.java:556)
	at org.apache.solr.SolrTestCaseJ4.initCore(SolrTestCaseJ4.java:365)
	at org.apache.solr.SolrTestCaseJ4.initCore(SolrTestCaseJ4.java:352)
	at org.apache.solr.handler.component.SearchHandlerTest.beforeTests(SearchHandlerTest.java:34)
	at sun.reflect.NativeMethodAccessorImpl.invoke0(Native Method)
	at sun.reflect.NativeMethodAccessorImpl.invoke(NativeMethodAccessorImpl.java:62)
	at sun.reflect.DelegatingMethodAccessorImpl.invoke(DelegatingMethodAccessorImpl.java:43)
	at java.lang.reflect.Method.invoke(Method.java:483)
	at com.carrotsearch.randomizedtesting.RandomizedRunner.invoke(RandomizedRunner.java:1617)
	at com.carrotsearch.randomizedtesting.RandomizedRunner$4.evaluate(RandomizedRunner.java:766)
	at com.carrotsearch.randomizedtesting.RandomizedRunner$5.evaluate(RandomizedRunner.java:782)
	at com.carrotsearch.randomizedtesting.rules.StatementAdapter.evaluate(StatementAdapter.java:36)
	at com.carrotsearch.randomizedtesting.rules.SystemPropertiesRestoreRule$1.evaluate(SystemPropertiesRestoreRule.java:53)
	at org.apache.lucene.util.AbstractBeforeAfterRule$1.evaluate(AbstractBeforeAfterRule.java:46)
	at org.apache.lucene.util.TestRuleStoreClassName$1.evaluate(TestRuleStoreClassName.java:42)
	at com.carrotsearch.randomizedtesting.rules.SystemPropertiesInvariantRule$1.evaluate(SystemPropertiesInvariantRule.java:55)
	at com.carrotsearch.randomizedtesting.rules.NoShadowingOrOverridesOnMethodsRule$1.evaluate(NoShadowingOrOverridesOnMethodsRule.java:39)
	at com.carrotsearch.randomizedtesting.rules.NoShadowingOrOverridesOnMethodsRule$1.evaluate(NoShadowingOrOverridesOnMethodsRule.java:39)
	at com.carrotsearch.randomizedtesting.rules.StatementAdapter.evaluate(StatementAdapter.java:36)
	at org.apache.lucene.util.TestRuleAssertionsRequired$1.evaluate(TestRuleAssertionsRequired.java:43)
	at org.apache.lucene.util.TestRuleMarkFailure$1.evaluate(TestRuleMarkFailure.java:48)
	at org.apache.lucene.util.TestRuleIgnoreAfterMaxFailures$1.evaluate(TestRuleIgnoreAfterMaxFailures.java:70)
	at org.apache.lucene.util.TestRuleIgnoreTestSuites$1.evaluate(TestRuleIgnoreTestSuites.java:55)
	at com.carrotsearch.randomizedtesting.rules.StatementAdapter.evaluate(StatementAdapter.java:36)
	at com.carrotsearch.randomizedtesting.ThreadLeakControl$StatementRunner.run(ThreadLeakControl.java:359)
	at java.lang.Thread.run(Thread.java:744)
Caused by: org.apache.solr.common.SolrException: java.util.concurrent.TimeoutException: Could not connect to ZooKeeper 127.0.0.1:36628 within 30000 ms
	at org.apache.solr.common.cloud.SolrZkClient.<init>(SolrZkClient.java:150)
	at org.apache.solr.common.cloud.SolrZkClient.<init>(SolrZkClient.java:101)
	at org.apache.solr.common.cloud.SolrZkClient.<init>(SolrZkClient.java:96)
	at org.apache.solr.common.cloud.SolrZkClient.<init>(SolrZkClient.java:83)
	at org.apache.solr.cloud.ZkController.checkChrootPath(ZkController.java:667)
	at org.apache.solr.core.ZkContainer.initZooKeeper(ZkContainer.java:133)
	at org.apache.solr.core.ZkContainer.initZooKeeper(ZkContainer.java:67)
	at org.apache.solr.core.CoreContainer.load(CoreContainer.java:230)
	at org.apache.solr.util.TestHarness.<init>(TestHarness.java:137)
	... 29 more
Caused by: java.util.concurrent.TimeoutException: Could not connect to ZooKeeper 127.0.0.1:36628 within 30000 ms
	at org.apache.solr.common.cloud.ConnectionManager.waitForConnected(ConnectionManager.java:223)
	at org.apache.solr.common.cloud.SolrZkClient.<init>(SolrZkClient.java:142)
	... 37 more


FAILED:  junit.framework.TestSuite.org.apache.solr.handler.component.SuggestComponentTest

Error Message:
org.apache.solr.common.SolrException: java.util.concurrent.TimeoutException: Could not connect to ZooKeeper 127.0.0.1:36628 within 30000 ms

Stack Trace:
java.lang.RuntimeException: org.apache.solr.common.SolrException: java.util.concurrent.TimeoutException: Could not connect to ZooKeeper 127.0.0.1:36628 within 30000 ms
	at __randomizedtesting.SeedInfo.seed([E368A8EA0D0F1923]:0)
	at org.apache.solr.util.TestHarness.<init>(TestHarness.java:142)
	at org.apache.solr.util.TestHarness.<init>(TestHarness.java:147)
	at org.apache.solr.util.TestHarness.<init>(TestHarness.java:98)
	at org.apache.solr.SolrTestCaseJ4.createCore(SolrTestCaseJ4.java:566)
	at org.apache.solr.SolrTestCaseJ4.initCore(SolrTestCaseJ4.java:556)
	at org.apache.solr.SolrTestCaseJ4.initCore(SolrTestCaseJ4.java:365)
	at org.apache.solr.SolrTestCaseJ4.initCore(SolrTestCaseJ4.java:352)
	at org.apache.solr.handler.component.SuggestComponentTest.beforeClass(SuggestComponentTest.java:32)
	at sun.reflect.NativeMethodAccessorImpl.invoke0(Native Method)
	at sun.reflect.NativeMethodAccessorImpl.invoke(NativeMethodAccessorImpl.java:62)
	at sun.reflect.DelegatingMethodAccessorImpl.invoke(DelegatingMethodAccessorImpl.java:43)
	at java.lang.reflect.Method.invoke(Method.java:483)
	at com.carrotsearch.randomizedtesting.RandomizedRunner.invoke(RandomizedRunner.java:1617)
	at com.carrotsearch.randomizedtesting.RandomizedRunner$4.evaluate(RandomizedRunner.java:766)
	at com.carrotsearch.randomizedtesting.RandomizedRunner$5.evaluate(RandomizedRunner.java:782)
	at com.carrotsearch.randomizedtesting.rules.StatementAdapter.evaluate(StatementAdapter.java:36)
	at com.carrotsearch.randomizedtesting.rules.SystemPropertiesRestoreRule$1.evaluate(SystemPropertiesRestoreRule.java:53)
	at org.apache.lucene.util.AbstractBeforeAfterRule$1.evaluate(AbstractBeforeAfterRule.java:46)
	at org.apache.lucene.util.TestRuleStoreClassName$1.evaluate(TestRuleStoreClassName.java:42)
	at com.carrotsearch.randomizedtesting.rules.SystemPropertiesInvariantRule$1.evaluate(SystemPropertiesInvariantRule.java:55)
	at com.carrotsearch.randomizedtesting.rules.NoShadowingOrOverridesOnMethodsRule$1.evaluate(NoShadowingOrOverridesOnMethodsRule.java:39)
	at com.carrotsearch.randomizedtesting.rules.NoShadowingOrOverridesOnMethodsRule$1.evaluate(NoShadowingOrOverridesOnMethodsRule.java:39)
	at com.carrotsearch.randomizedtesting.rules.StatementAdapter.evaluate(StatementAdapter.java:36)
	at org.apache.lucene.util.TestRuleAssertionsRequired$1.evaluate(TestRuleAssertionsRequired.java:43)
	at org.apache.lucene.util.TestRuleMarkFailure$1.evaluate(TestRuleMarkFailure.java:48)
	at org.apache.lucene.util.TestRuleIgnoreAfterMaxFailures$1.evaluate(TestRuleIgnoreAfterMaxFailures.java:70)
	at org.apache.lucene.util.TestRuleIgnoreTestSuites$1.evaluate(TestRuleIgnoreTestSuites.java:55)
	at com.carrotsearch.randomizedtesting.rules.StatementAdapter.evaluate(StatementAdapter.java:36)
	at com.carrotsearch.randomizedtesting.ThreadLeakControl$StatementRunner.run(ThreadLeakControl.java:359)
	at java.lang.Thread.run(Thread.java:744)
Caused by: org.apache.solr.common.SolrException: java.util.concurrent.TimeoutException: Could not connect to ZooKeeper 127.0.0.1:36628 within 30000 ms
	at org.apache.solr.common.cloud.SolrZkClient.<init>(SolrZkClient.java:150)
	at org.apache.solr.common.cloud.SolrZkClient.<init>(SolrZkClient.java:101)
	at org.apache.solr.common.cloud.SolrZkClient.<init>(SolrZkClient.java:96)
	at org.apache.solr.common.cloud.SolrZkClient.<init>(SolrZkClient.java:83)
	at org.apache.solr.cloud.ZkController.checkChrootPath(ZkController.java:667)
	at org.apache.solr.core.ZkContainer.initZooKeeper(ZkContainer.java:133)
	at org.apache.solr.core.ZkContainer.initZooKeeper(ZkContainer.java:67)
	at org.apache.solr.core.CoreContainer.load(CoreContainer.java:230)
	at org.apache.solr.util.TestHarness.<init>(TestHarness.java:137)
	... 29 more
Caused by: java.util.concurrent.TimeoutException: Could not connect to ZooKeeper 127.0.0.1:36628 within 30000 ms
	at org.apache.solr.common.cloud.ConnectionManager.waitForConnected(ConnectionManager.java:223)
	at org.apache.solr.common.cloud.SolrZkClient.<init>(SolrZkClient.java:142)
	... 37 more


FAILED:  junit.framework.TestSuite.org.apache.solr.handler.component.TermsComponentTest

Error Message:
org.apache.solr.common.SolrException: java.util.concurrent.TimeoutException: Could not connect to ZooKeeper 127.0.0.1:36628 within 30000 ms

Stack Trace:
java.lang.RuntimeException: org.apache.solr.common.SolrException: java.util.concurrent.TimeoutException: Could not connect to ZooKeeper 127.0.0.1:36628 within 30000 ms
	at __randomizedtesting.SeedInfo.seed([E368A8EA0D0F1923]:0)
	at org.apache.solr.util.TestHarness.<init>(TestHarness.java:142)
	at org.apache.solr.util.TestHarness.<init>(TestHarness.java:147)
	at org.apache.solr.util.TestHarness.<init>(TestHarness.java:98)
	at org.apache.solr.SolrTestCaseJ4.createCore(SolrTestCaseJ4.java:566)
	at org.apache.solr.SolrTestCaseJ4.initCore(SolrTestCaseJ4.java:556)
	at org.apache.solr.SolrTestCaseJ4.initCore(SolrTestCaseJ4.java:365)
	at org.apache.solr.SolrTestCaseJ4.initCore(SolrTestCaseJ4.java:352)
	at org.apache.solr.handler.component.TermsComponentTest.beforeTest(TermsComponentTest.java:36)
	at sun.reflect.NativeMethodAccessorImpl.invoke0(Native Method)
	at sun.reflect.NativeMethodAccessorImpl.invoke(NativeMethodAccessorImpl.java:62)
	at sun.reflect.DelegatingMethodAccessorImpl.invoke(DelegatingMethodAccessorImpl.java:43)
	at java.lang.reflect.Method.invoke(Method.java:483)
	at com.carrotsearch.randomizedtesting.RandomizedRunner.invoke(RandomizedRunner.java:1617)
	at com.carrotsearch.randomizedtesting.RandomizedRunner$4.evaluate(RandomizedRunner.java:766)
	at com.carrotsearch.randomizedtesting.RandomizedRunner$5.evaluate(RandomizedRunner.java:782)
	at com.carrotsearch.randomizedtesting.rules.StatementAdapter.evaluate(StatementAdapter.java:36)
	at com.carrotsearch.randomizedtesting.rules.SystemPropertiesRestoreRule$1.evaluate(SystemPropertiesRestoreRule.java:53)
	at org.apache.lucene.util.AbstractBeforeAfterRule$1.evaluate(AbstractBeforeAfterRule.java:46)
	at org.apache.lucene.util.TestRuleStoreClassName$1.evaluate(TestRuleStoreClassName.java:42)
	at com.carrotsearch.randomizedtesting.rules.SystemPropertiesInvariantRule$1.evaluate(SystemPropertiesInvariantRule.java:55)
	at com.carrotsearch.randomizedtesting.rules.NoShadowingOrOverridesOnMethodsRule$1.evaluate(NoShadowingOrOverridesOnMethodsRule.java:39)
	at com.carrotsearch.randomizedtesting.rules.NoShadowingOrOverridesOnMethodsRule$1.evaluate(NoShadowingOrOverridesOnMethodsRule.java:39)
	at com.carrotsearch.randomizedtesting.rules.StatementAdapter.evaluate(StatementAdapter.java:36)
	at org.apache.lucene.util.TestRuleAssertionsRequired$1.evaluate(TestRuleAssertionsRequired.java:43)
	at org.apache.lucene.util.TestRuleMarkFailure$1.evaluate(TestRuleMarkFailure.java:48)
	at org.apache.lucene.util.TestRuleIgnoreAfterMaxFailures$1.evaluate(TestRuleIgnoreAfterMaxFailures.java:70)
	at org.apache.lucene.util.TestRuleIgnoreTestSuites$1.evaluate(TestRuleIgnoreTestSuites.java:55)
	at com.carrotsearch.randomizedtesting.rules.StatementAdapter.evaluate(StatementAdapter.java:36)
	at com.carrotsearch.randomizedtesting.ThreadLeakControl$StatementRunner.run(ThreadLeakControl.java:359)
	at java.lang.Thread.run(Thread.java:744)
Caused by: org.apache.solr.common.SolrException: java.util.concurrent.TimeoutException: Could not connect to ZooKeeper 127.0.0.1:36628 within 30000 ms
	at org.apache.solr.common.cloud.SolrZkClient.<init>(SolrZkClient.java:150)
	at org.apache.solr.common.cloud.SolrZkClient.<init>(SolrZkClient.java:101)
	at org.apache.solr.common.cloud.SolrZkClient.<init>(SolrZkClient.java:96)
	at org.apache.solr.common.cloud.SolrZkClient.<init>(SolrZkClient.java:83)
	at org.apache.solr.cloud.ZkController.checkChrootPath(ZkController.java:667)
	at org.apache.solr.core.ZkContainer.initZooKeeper(ZkContainer.java:133)
	at org.apache.solr.core.ZkContainer.initZooKeeper(ZkContainer.java:67)
	at org.apache.solr.core.CoreContainer.load(CoreContainer.java:230)
	at org.apache.solr.util.TestHarness.<init>(TestHarness.java:137)
	... 29 more
Caused by: java.util.concurrent.TimeoutException: Could not connect to ZooKeeper 127.0.0.1:36628 within 30000 ms
	at org.apache.solr.common.cloud.ConnectionManager.waitForConnected(ConnectionManager.java:223)
	at org.apache.solr.common.cloud.SolrZkClient.<init>(SolrZkClient.java:142)
	... 37 more


FAILED:  junit.framework.TestSuite.org.apache.solr.request.TestWriterPerf

Error Message:
org.apache.solr.common.SolrException: java.util.concurrent.TimeoutException: Could not connect to ZooKeeper 127.0.0.1:36628 within 30000 ms

Stack Trace:
java.lang.RuntimeException: org.apache.solr.common.SolrException: java.util.concurrent.TimeoutException: Could not connect to ZooKeeper 127.0.0.1:36628 within 30000 ms
	at __randomizedtesting.SeedInfo.seed([E368A8EA0D0F1923]:0)
	at org.apache.solr.util.TestHarness.<init>(TestHarness.java:142)
	at org.apache.solr.util.TestHarness.<init>(TestHarness.java:147)
	at org.apache.solr.util.TestHarness.<init>(TestHarness.java:98)
	at org.apache.solr.SolrTestCaseJ4.createCore(SolrTestCaseJ4.java:566)
	at org.apache.solr.SolrTestCaseJ4.initCore(SolrTestCaseJ4.java:556)
	at org.apache.solr.SolrTestCaseJ4.initCore(SolrTestCaseJ4.java:365)
	at org.apache.solr.SolrTestCaseJ4.initCore(SolrTestCaseJ4.java:352)
	at org.apache.solr.request.TestWriterPerf.beforeClass(TestWriterPerf.java:45)
	at sun.reflect.NativeMethodAccessorImpl.invoke0(Native Method)
	at sun.reflect.NativeMethodAccessorImpl.invoke(NativeMethodAccessorImpl.java:62)
	at sun.reflect.DelegatingMethodAccessorImpl.invoke(DelegatingMethodAccessorImpl.java:43)
	at java.lang.reflect.Method.invoke(Method.java:483)
	at com.carrotsearch.randomizedtesting.RandomizedRunner.invoke(RandomizedRunner.java:1617)
	at com.carrotsearch.randomizedtesting.RandomizedRunner$4.evaluate(RandomizedRunner.java:766)
	at com.carrotsearch.randomizedtesting.RandomizedRunner$5.evaluate(RandomizedRunner.java:782)
	at com.carrotsearch.randomizedtesting.rules.StatementAdapter.evaluate(StatementAdapter.java:36)
	at com.carrotsearch.randomizedtesting.rules.SystemPropertiesRestoreRule$1.evaluate(SystemPropertiesRestoreRule.java:53)
	at org.apache.lucene.util.AbstractBeforeAfterRule$1.evaluate(AbstractBeforeAfterRule.java:46)
	at org.apache.lucene.util.TestRuleStoreClassName$1.evaluate(TestRuleStoreClassName.java:42)
	at com.carrotsearch.randomizedtesting.rules.SystemPropertiesInvariantRule$1.evaluate(SystemPropertiesInvariantRule.java:55)
	at com.carrotsearch.randomizedtesting.rules.NoShadowingOrOverridesOnMethodsRule$1.evaluate(NoShadowingOrOverridesOnMethodsRule.java:39)
	at com.carrotsearch.randomizedtesting.rules.NoShadowingOrOverridesOnMethodsRule$1.evaluate(NoShadowingOrOverridesOnMethodsRule.java:39)
	at com.carrotsearch.randomizedtesting.rules.StatementAdapter.evaluate(StatementAdapter.java:36)
	at org.apache.lucene.util.TestRuleAssertionsRequired$1.evaluate(TestRuleAssertionsRequired.java:43)
	at org.apache.lucene.util.TestRuleMarkFailure$1.evaluate(TestRuleMarkFailure.java:48)
	at org.apache.lucene.util.TestRuleIgnoreAfterMaxFailures$1.evaluate(TestRuleIgnoreAfterMaxFailures.java:70)
	at org.apache.lucene.util.TestRuleIgnoreTestSuites$1.evaluate(TestRuleIgnoreTestSuites.java:55)
	at com.carrotsearch.randomizedtesting.rules.StatementAdapter.evaluate(StatementAdapter.java:36)
	at com.carrotsearch.randomizedtesting.ThreadLeakControl$StatementRunner.run(ThreadLeakControl.java:359)
	at java.lang.Thread.run(Thread.java:744)
Caused by: org.apache.solr.common.SolrException: java.util.concurrent.TimeoutException: Could not connect to ZooKeeper 127.0.0.1:36628 within 30000 ms
	at org.apache.solr.common.cloud.SolrZkClient.<init>(SolrZkClient.java:150)
	at org.apache.solr.common.cloud.SolrZkClient.<init>(SolrZkClient.java:101)
	at org.apache.solr.common.cloud.SolrZkClient.<init>(SolrZkClient.java:96)
	at org.apache.solr.common.cloud.SolrZkClient.<init>(SolrZkClient.java:83)
	at org.apache.solr.cloud.ZkController.checkChrootPath(ZkController.java:667)
	at org.apache.solr.core.ZkContainer.initZooKeeper(ZkContainer.java:133)
	at org.apache.solr.core.ZkContainer.initZooKeeper(ZkContainer.java:67)
	at org.apache.solr.core.CoreContainer.load(CoreContainer.java:230)
	at org.apache.solr.util.TestHarness.<init>(TestHarness.java:137)
	... 29 more
Caused by: java.util.concurrent.TimeoutException: Could not connect to ZooKeeper 127.0.0.1:36628 within 30000 ms
	at org.apache.solr.common.cloud.ConnectionManager.waitForConnected(ConnectionManager.java:223)
	at org.apache.solr.common.cloud.SolrZkClient.<init>(SolrZkClient.java:142)
	... 37 more


FAILED:  junit.framework.TestSuite.org.apache.solr.schema.DocValuesTest

Error Message:
org.apache.solr.common.SolrException: java.util.concurrent.TimeoutException: Could not connect to ZooKeeper 127.0.0.1:36628 within 30000 ms

Stack Trace:
java.lang.RuntimeException: org.apache.solr.common.SolrException: java.util.concurrent.TimeoutException: Could not connect to ZooKeeper 127.0.0.1:36628 within 30000 ms
	at __randomizedtesting.SeedInfo.seed([E368A8EA0D0F1923]:0)
	at org.apache.solr.util.TestHarness.<init>(TestHarness.java:142)
	at org.apache.solr.util.TestHarness.<init>(TestHarness.java:147)
	at org.apache.solr.util.TestHarness.<init>(TestHarness.java:98)
	at org.apache.solr.SolrTestCaseJ4.createCore(SolrTestCaseJ4.java:566)
	at org.apache.solr.SolrTestCaseJ4.initCore(SolrTestCaseJ4.java:556)
	at org.apache.solr.SolrTestCaseJ4.initCore(SolrTestCaseJ4.java:365)
	at org.apache.solr.SolrTestCaseJ4.initCore(SolrTestCaseJ4.java:352)
	at org.apache.solr.schema.DocValuesTest.beforeTests(DocValuesTest.java:36)
	at sun.reflect.NativeMethodAccessorImpl.invoke0(Native Method)
	at sun.reflect.NativeMethodAccessorImpl.invoke(NativeMethodAccessorImpl.java:62)
	at sun.reflect.DelegatingMethodAccessorImpl.invoke(DelegatingMethodAccessorImpl.java:43)
	at java.lang.reflect.Method.invoke(Method.java:483)
	at com.carrotsearch.randomizedtesting.RandomizedRunner.invoke(RandomizedRunner.java:1617)
	at com.carrotsearch.randomizedtesting.RandomizedRunner$4.evaluate(RandomizedRunner.java:766)
	at com.carrotsearch.randomizedtesting.RandomizedRunner$5.evaluate(RandomizedRunner.java:782)
	at com.carrotsearch.randomizedtesting.rules.StatementAdapter.evaluate(StatementAdapter.java:36)
	at com.carrotsearch.randomizedtesting.rules.SystemPropertiesRestoreRule$1.evaluate(SystemPropertiesRestoreRule.java:53)
	at org.apache.lucene.util.AbstractBeforeAfterRule$1.evaluate(AbstractBeforeAfterRule.java:46)
	at org.apache.lucene.util.TestRuleStoreClassName$1.evaluate(TestRuleStoreClassName.java:42)
	at com.carrotsearch.randomizedtesting.rules.SystemPropertiesInvariantRule$1.evaluate(SystemPropertiesInvariantRule.java:55)
	at com.carrotsearch.randomizedtesting.rules.NoShadowingOrOverridesOnMethodsRule$1.evaluate(NoShadowingOrOverridesOnMethodsRule.java:39)
	at com.carrotsearch.randomizedtesting.rules.NoShadowingOrOverridesOnMethodsRule$1.evaluate(NoShadowingOrOverridesOnMethodsRule.java:39)
	at com.carrotsearch.randomizedtesting.rules.StatementAdapter.evaluate(StatementAdapter.java:36)
	at org.apache.lucene.util.TestRuleAssertionsRequired$1.evaluate(TestRuleAssertionsRequired.java:43)
	at org.apache.lucene.util.TestRuleMarkFailure$1.evaluate(TestRuleMarkFailure.java:48)
	at org.apache.lucene.util.TestRuleIgnoreAfterMaxFailures$1.evaluate(TestRuleIgnoreAfterMaxFailures.java:70)
	at org.apache.lucene.util.TestRuleIgnoreTestSuites$1.evaluate(TestRuleIgnoreTestSuites.java:55)
	at com.carrotsearch.randomizedtesting.rules.StatementAdapter.evaluate(StatementAdapter.java:36)
	at com.carrotsearch.randomizedtesting.ThreadLeakControl$StatementRunner.run(ThreadLeakControl.java:359)
	at java.lang.Thread.run(Thread.java:744)
Caused by: org.apache.solr.common.SolrException: java.util.concurrent.TimeoutException: Could not connect to ZooKeeper 127.0.0.1:36628 within 30000 ms
	at org.apache.solr.common.cloud.SolrZkClient.<init>(SolrZkClient.java:150)
	at org.apache.solr.common.cloud.SolrZkClient.<init>(SolrZkClient.java:101)
	at org.apache.solr.common.cloud.SolrZkClient.<init>(SolrZkClient.java:96)
	at org.apache.solr.common.cloud.SolrZkClient.<init>(SolrZkClient.java:83)
	at org.apache.solr.cloud.ZkController.checkChrootPath(ZkController.java:667)
	at org.apache.solr.core.ZkContainer.initZooKeeper(ZkContainer.java:133)
	at org.apache.solr.core.ZkContainer.initZooKeeper(ZkContainer.java:67)
	at org.apache.solr.core.CoreContainer.load(CoreContainer.java:230)
	at org.apache.solr.util.TestHarness.<init>(TestHarness.java:137)
	... 29 more
Caused by: java.util.concurrent.TimeoutException: Could not connect to ZooKeeper 127.0.0.1:36628 within 30000 ms
	at org.apache.solr.common.cloud.ConnectionManager.waitForConnected(ConnectionManager.java:223)
	at org.apache.solr.common.cloud.SolrZkClient.<init>(SolrZkClient.java:142)
	... 37 more


FAILED:  junit.framework.TestSuite.org.apache.solr.schema.SynonymTokenizerTest

Error Message:
org.apache.solr.common.SolrException: java.util.concurrent.TimeoutException: Could not connect to ZooKeeper 127.0.0.1:36628 within 30000 ms

Stack Trace:
java.lang.RuntimeException: org.apache.solr.common.SolrException: java.util.concurrent.TimeoutException: Could not connect to ZooKeeper 127.0.0.1:36628 within 30000 ms
	at __randomizedtesting.SeedInfo.seed([E368A8EA0D0F1923]:0)
	at org.apache.solr.util.TestHarness.<init>(TestHarness.java:142)
	at org.apache.solr.util.TestHarness.<init>(TestHarness.java:147)
	at org.apache.solr.util.TestHarness.<init>(TestHarness.java:98)
	at org.apache.solr.SolrTestCaseJ4.createCore(SolrTestCaseJ4.java:566)
	at org.apache.solr.SolrTestCaseJ4.initCore(SolrTestCaseJ4.java:556)
	at org.apache.solr.SolrTestCaseJ4.initCore(SolrTestCaseJ4.java:365)
	at org.apache.solr.SolrTestCaseJ4.initCore(SolrTestCaseJ4.java:352)
	at org.apache.solr.schema.SynonymTokenizerTest.beforeTests(SynonymTokenizerTest.java:35)
	at sun.reflect.NativeMethodAccessorImpl.invoke0(Native Method)
	at sun.reflect.NativeMethodAccessorImpl.invoke(NativeMethodAccessorImpl.java:62)
	at sun.reflect.DelegatingMethodAccessorImpl.invoke(DelegatingMethodAccessorImpl.java:43)
	at java.lang.reflect.Method.invoke(Method.java:483)
	at com.carrotsearch.randomizedtesting.RandomizedRunner.invoke(RandomizedRunner.java:1617)
	at com.carrotsearch.randomizedtesting.RandomizedRunner$4.evaluate(RandomizedRunner.java:766)
	at com.carrotsearch.randomizedtesting.RandomizedRunner$5.evaluate(RandomizedRunner.java:782)
	at com.carrotsearch.randomizedtesting.rules.StatementAdapter.evaluate(StatementAdapte

[...truncated too long message...]

at org.apache.zookeeper.ClientCnxnSocketNIO.doTransport(ClientCnxnSocketNIO.java:338)
   [junit4]    >         at org.apache.zookeeper.ClientCnxn$SendThread.run(ClientCnxn.java:1068)
   [junit4]    >   14) Thread[id=1452, name=qtp25170843-1452 Acceptor0 SelectChannelConnector@127.0.0.1:51416, state=RUNNABLE, group=TGRP-RecoveryZkTest]
   [junit4]    >         at sun.nio.ch.ServerSocketChannelImpl.accept0(Native Method)
   [junit4]    >         at sun.nio.ch.ServerSocketChannelImpl.accept(ServerSocketChannelImpl.java:241)
   [junit4]    >         at org.eclipse.jetty.server.nio.SelectChannelConnector.accept(SelectChannelConnector.java:109)
   [junit4]    >         at org.eclipse.jetty.server.AbstractConnector$Acceptor.run(AbstractConnector.java:938)
   [junit4]    >         at org.eclipse.jetty.util.thread.QueuedThreadPool.runJob(QueuedThreadPool.java:608)
   [junit4]    >         at org.eclipse.jetty.util.thread.QueuedThreadPool$3.run(QueuedThreadPool.java:543)
   [junit4]    >         at java.lang.Thread.run(Thread.java:744)
   [junit4]    >   15) Thread[id=1454, name=qtp25170843-1454, state=TIMED_WAITING, group=TGRP-RecoveryZkTest]
   [junit4]    >         at sun.misc.Unsafe.park(Native Method)
   [junit4]    >         at java.util.concurrent.locks.LockSupport.parkNanos(LockSupport.java:215)
   [junit4]    >         at java.util.concurrent.locks.AbstractQueuedSynchronizer$ConditionObject.awaitNanos(AbstractQueuedSynchronizer.java:2078)
   [junit4]    >         at org.eclipse.jetty.util.BlockingArrayQueue.poll(BlockingArrayQueue.java:342)
   [junit4]    >         at org.eclipse.jetty.util.thread.QueuedThreadPool.idleJobPoll(QueuedThreadPool.java:526)
   [junit4]    >         at org.eclipse.jetty.util.thread.QueuedThreadPool.access$600(QueuedThreadPool.java:44)
   [junit4]    >         at org.eclipse.jetty.util.thread.QueuedThreadPool$3.run(QueuedThreadPool.java:572)
   [junit4]    >         at java.lang.Thread.run(Thread.java:744)
   [junit4]    > 	at __randomizedtesting.SeedInfo.seed([E368A8EA0D0F1923]:0)Throwable #3: com.carrotsearch.randomizedtesting.ThreadLeakError: There are still zombie threads that couldn't be terminated:
   [junit4]    >    1) Thread[id=1450, name=qtp25170843-1450 Selector0, state=RUNNABLE, group=TGRP-RecoveryZkTest]
   [junit4]    >         at sun.nio.ch.EPollArrayWrapper.interrupt(Native Method)
   [junit4]    >         at sun.nio.ch.EPollArrayWrapper.interrupt(EPollArrayWrapper.java:317)
   [junit4]    >         at sun.nio.ch.EPollSelectorImpl.wakeup(EPollSelectorImpl.java:193)
   [junit4]    >         at java.nio.channels.spi.AbstractSelector$1.interrupt(AbstractSelector.java:213)
   [junit4]    >         at java.nio.channels.spi.AbstractSelector.begin(AbstractSelector.java:219)
   [junit4]    >         at sun.nio.ch.EPollSelectorImpl.doSelect(EPollSelectorImpl.java:78)
   [junit4]    >         at sun.nio.ch.SelectorImpl.lockAndDoSelect(SelectorImpl.java:86)
   [junit4]    >         at sun.nio.ch.SelectorImpl.selectNow(SelectorImpl.java:105)
   [junit4]    >         at org.eclipse.jetty.io.nio.SelectorManager$SelectSet.doSelect(SelectorManager.java:536)
   [junit4]    >         at org.eclipse.jetty.io.nio.SelectorManager$1.run(SelectorManager.java:290)
   [junit4]    >         at org.eclipse.jetty.util.thread.QueuedThreadPool.runJob(QueuedThreadPool.java:608)
   [junit4]    >         at org.eclipse.jetty.util.thread.QueuedThreadPool$3.run(QueuedThreadPool.java:543)
   [junit4]    >         at java.lang.Thread.run(Thread.java:744)
   [junit4]    >    2) Thread[id=1460, name=TEST-RecoveryZkTest.testDistribSearch-seed#[E368A8EA0D0F1923]-SendThread(localhost.localdomain:40005), state=RUNNABLE, group=TGRP-RecoveryZkTest]
   [junit4]    >         at java.security.AccessController.getStackAccessControlContext(Native Method)
   [junit4]    >         at java.security.AccessController.checkPermission(AccessController.java:858)
   [junit4]    >         at java.lang.SecurityManager.checkPermission(SecurityManager.java:549)
   [junit4]    >         at javax.security.auth.login.Configuration.getConfiguration(Configuration.java:228)
   [junit4]    >         at org.apache.zookeeper.client.ZooKeeperSaslClient.clientTunneledAuthenticationInProgress(ZooKeeperSaslClient.java:487)
   [junit4]    >         at org.apache.zookeeper.ClientCnxn$SendThread.clientTunneledAuthenticationInProgress(ClientCnxn.java:1241)
   [junit4]    >         at org.apache.zookeeper.ClientCnxnSocketNIO.doTransport(ClientCnxnSocketNIO.java:360)
   [junit4]    >         at org.apache.zookeeper.ClientCnxn$SendThread.run(ClientCnxn.java:1068)
   [junit4]    >    3) Thread[id=1452, name=qtp25170843-1452 Acceptor0 SelectChannelConnector@127.0.0.1:51416, state=RUNNABLE, group=TGRP-RecoveryZkTest]
   [junit4]    >         at org.eclipse.jetty.server.nio.SelectChannelConnector.getConnection(SelectChannelConnector.java:160)
   [junit4]    >         at org.eclipse.jetty.server.AbstractConnector$Acceptor.run(AbstractConnector.java:934)
   [junit4]    >         at org.eclipse.jetty.util.thread.QueuedThreadPool.runJob(QueuedThreadPool.java:608)
   [junit4]    >         at org.eclipse.jetty.util.thread.QueuedThreadPool$3.run(QueuedThreadPool.java:543)
   [junit4]    >         at java.lang.Thread.run(Thread.java:744)
   [junit4]    >    4) Thread[id=1441, name=NIOServerCxn.Factory:0.0.0.0/0.0.0.0:0, state=RUNNABLE, group=TGRP-RecoveryZkTest]
   [junit4]    >         at java.lang.Thread.isInterrupted(Native Method)
   [junit4]    >         at java.lang.Thread.isInterrupted(Thread.java:960)
   [junit4]    >         at java.nio.channels.spi.AbstractSelector.begin(AbstractSelector.java:218)
   [junit4]    >         at sun.nio.ch.EPollSelectorImpl.doSelect(EPollSelectorImpl.java:78)
   [junit4]    >         at sun.nio.ch.SelectorImpl.lockAndDoSelect(SelectorImpl.java:86)
   [junit4]    >         at sun.nio.ch.SelectorImpl.select(SelectorImpl.java:97)
   [junit4]    >         at org.apache.zookeeper.server.NIOServerCnxnFactory.run(NIOServerCnxnFactory.java:178)
   [junit4]    >         at java.lang.Thread.run(Thread.java:744)
   [junit4]    >    5) Thread[id=1449, name=HashSessionScavenger-42, state=TIMED_WAITING, group=TGRP-RecoveryZkTest]
   [junit4]    >         at java.lang.Object.wait(Native Method)
   [junit4]    >         at java.util.TimerThread.mainLoop(Timer.java:552)
   [junit4]    >         at java.util.TimerThread.run(Timer.java:505)
   [junit4]    >    6) Thread[id=1451, name=qtp25170843-1451 Selector1, state=RUNNABLE, group=TGRP-RecoveryZkTest]
   [junit4]    >         at sun.nio.ch.EPollArrayWrapper.interrupt(Native Method)
   [junit4]    >         at sun.nio.ch.EPollArrayWrapper.interrupt(EPollArrayWrapper.java:317)
   [junit4]    >         at sun.nio.ch.EPollSelectorImpl.wakeup(EPollSelectorImpl.java:193)
   [junit4]    >         at java.nio.channels.spi.AbstractSelector$1.interrupt(AbstractSelector.java:213)
   [junit4]    >         at java.nio.channels.spi.AbstractSelector.begin(AbstractSelector.java:219)
   [junit4]    >         at sun.nio.ch.EPollSelectorImpl.doSelect(EPollSelectorImpl.java:78)
   [junit4]    >         at sun.nio.ch.SelectorImpl.lockAndDoSelect(SelectorImpl.java:86)
   [junit4]    >         at sun.nio.ch.SelectorImpl.select(SelectorImpl.java:97)
   [junit4]    >         at org.eclipse.jetty.io.nio.SelectorManager$SelectSet.doSelect(SelectorManager.java:569)
   [junit4]    >         at org.eclipse.jetty.io.nio.SelectorManager$1.run(SelectorManager.java:290)
   [junit4]    >         at org.eclipse.jetty.util.thread.QueuedThreadPool.runJob(QueuedThreadPool.java:608)
   [junit4]    >         at org.eclipse.jetty.util.thread.QueuedThreadPool$3.run(QueuedThreadPool.java:543)
   [junit4]    >         at java.lang.Thread.run(Thread.java:744)
   [junit4]    >    7) Thread[id=1453, name=qtp25170843-1453 Acceptor1 SelectChannelConnector@127.0.0.1:51416, state=RUNNABLE, group=TGRP-RecoveryZkTest]
   [junit4]    >         at org.eclipse.jetty.server.nio.SelectChannelConnector.accept(SelectChannelConnector.java:102)
   [junit4]    >         at org.eclipse.jetty.server.AbstractConnector$Acceptor.run(AbstractConnector.java:938)
   [junit4]    >         at org.eclipse.jetty.util.thread.QueuedThreadPool.runJob(QueuedThreadPool.java:608)
   [junit4]    >         at org.eclipse.jetty.util.thread.QueuedThreadPool$3.run(QueuedThreadPool.java:543)
   [junit4]    >         at java.lang.Thread.run(Thread.java:744)
   [junit4]    > 	at __randomizedtesting.SeedInfo.seed([E368A8EA0D0F1923]:0)
   [junit4] Completed on J0 in 23.70s, 1 test, 1 failure, 3 errors <<< FAILURES!

[...truncated 637 lines...]
BUILD FAILED
/mnt/ssd/jenkins/workspace/Lucene-Solr-trunk-Linux/build.xml:467: The following error occurred while executing this line:
/mnt/ssd/jenkins/workspace/Lucene-Solr-trunk-Linux/build.xml:447: The following error occurred while executing this line:
/mnt/ssd/jenkins/workspace/Lucene-Solr-trunk-Linux/build.xml:45: The following error occurred while executing this line:
/mnt/ssd/jenkins/workspace/Lucene-Solr-trunk-Linux/extra-targets.xml:37: The following error occurred while executing this line:
/mnt/ssd/jenkins/workspace/Lucene-Solr-trunk-Linux/solr/build.xml:189: The following error occurred while executing this line:
/mnt/ssd/jenkins/workspace/Lucene-Solr-trunk-Linux/solr/common-build.xml:490: The following error occurred while executing this line:
/mnt/ssd/jenkins/workspace/Lucene-Solr-trunk-Linux/lucene/common-build.xml:1275: The following error occurred while executing this line:
/mnt/ssd/jenkins/workspace/Lucene-Solr-trunk-Linux/lucene/common-build.xml:907: There were test failures: 391 suites, 1515 tests, 25 suite-level errors, 8 errors, 802 ignored (27 assumptions)

Total time: 60 minutes 3 seconds
Build step 'Invoke Ant' marked build as failure
Description set: Java: 32bit/jdk1.8.0 -client -XX:+UseConcMarkSweepGC
Archiving artifacts
Recording test results
Email was triggered for: Failure
Sending email for trigger: Failure



Mime
View raw message