lucene-dev mailing list archives

Site index · List index
Message view « Date » · « Thread »
Top « Date » · « Thread »
From Policeman Jenkins Server <jenk...@thetaphi.de>
Subject [JENKINS] Lucene-Solr-4.x-Linux (32bit/jdk1.6.0_45) - Build # 9530 - Failure!
Date Sat, 01 Mar 2014 15:24:27 GMT
Build: http://jenkins.thetaphi.de/job/Lucene-Solr-4.x-Linux/9530/
Java: 32bit/jdk1.6.0_45 -client -XX:+UseSerialGC

1 tests failed.
REGRESSION:  org.apache.solr.client.solrj.impl.CloudSolrServerTest.testDistribSearch

Error Message:
java.util.concurrent.TimeoutException: Could not connect to ZooKeeper 127.0.0.1:42897 within
30000 ms

Stack Trace:
org.apache.solr.common.SolrException: java.util.concurrent.TimeoutException: Could not connect
to ZooKeeper 127.0.0.1:42897 within 30000 ms
	at __randomizedtesting.SeedInfo.seed([F8C5C942F0FF80CC:7923475A87A0E0F0]:0)
	at org.apache.solr.common.cloud.SolrZkClient.<init>(SolrZkClient.java:148)
	at org.apache.solr.common.cloud.SolrZkClient.<init>(SolrZkClient.java:99)
	at org.apache.solr.common.cloud.SolrZkClient.<init>(SolrZkClient.java:94)
	at org.apache.solr.common.cloud.SolrZkClient.<init>(SolrZkClient.java:85)
	at org.apache.solr.cloud.AbstractZkTestCase.buildZooKeeper(AbstractZkTestCase.java:89)
	at org.apache.solr.cloud.AbstractZkTestCase.buildZooKeeper(AbstractZkTestCase.java:83)
	at org.apache.solr.cloud.AbstractDistribZkTestBase.setUp(AbstractDistribZkTestBase.java:70)
	at org.apache.solr.cloud.AbstractFullDistribZkTestBase.setUp(AbstractFullDistribZkTestBase.java:200)
	at org.apache.solr.client.solrj.impl.CloudSolrServerTest.setUp(CloudSolrServerTest.java:78)
	at sun.reflect.NativeMethodAccessorImpl.invoke0(Native Method)
	at sun.reflect.NativeMethodAccessorImpl.invoke(NativeMethodAccessorImpl.java:39)
	at sun.reflect.DelegatingMethodAccessorImpl.invoke(DelegatingMethodAccessorImpl.java:25)
	at java.lang.reflect.Method.invoke(Method.java:597)
	at com.carrotsearch.randomizedtesting.RandomizedRunner.invoke(RandomizedRunner.java:1559)
	at com.carrotsearch.randomizedtesting.RandomizedRunner.access$600(RandomizedRunner.java:79)
	at com.carrotsearch.randomizedtesting.RandomizedRunner$7.evaluate(RandomizedRunner.java:771)
	at com.carrotsearch.randomizedtesting.RandomizedRunner$8.evaluate(RandomizedRunner.java:787)
	at com.carrotsearch.randomizedtesting.rules.SystemPropertiesRestoreRule$1.evaluate(SystemPropertiesRestoreRule.java:53)
	at org.apache.lucene.util.TestRuleSetupTeardownChained$1.evaluate(TestRuleSetupTeardownChained.java:50)
	at org.apache.lucene.util.TestRuleFieldCacheSanity$1.evaluate(TestRuleFieldCacheSanity.java:51)
	at org.apache.lucene.util.AbstractBeforeAfterRule$1.evaluate(AbstractBeforeAfterRule.java:46)
	at com.carrotsearch.randomizedtesting.rules.SystemPropertiesInvariantRule$1.evaluate(SystemPropertiesInvariantRule.java:55)
	at org.apache.lucene.util.TestRuleThreadAndTestName$1.evaluate(TestRuleThreadAndTestName.java:49)
	at org.apache.lucene.util.TestRuleIgnoreAfterMaxFailures$1.evaluate(TestRuleIgnoreAfterMaxFailures.java:70)
	at org.apache.lucene.util.TestRuleMarkFailure$1.evaluate(TestRuleMarkFailure.java:48)
	at com.carrotsearch.randomizedtesting.rules.StatementAdapter.evaluate(StatementAdapter.java:36)
	at com.carrotsearch.randomizedtesting.ThreadLeakControl$StatementRunner.run(ThreadLeakControl.java:358)
	at com.carrotsearch.randomizedtesting.ThreadLeakControl.forkTimeoutingTask(ThreadLeakControl.java:782)
	at com.carrotsearch.randomizedtesting.ThreadLeakControl$3.evaluate(ThreadLeakControl.java:442)
	at com.carrotsearch.randomizedtesting.RandomizedRunner.runSingleTest(RandomizedRunner.java:746)
	at com.carrotsearch.randomizedtesting.RandomizedRunner$3.evaluate(RandomizedRunner.java:648)
	at com.carrotsearch.randomizedtesting.RandomizedRunner$4.evaluate(RandomizedRunner.java:682)
	at com.carrotsearch.randomizedtesting.RandomizedRunner$5.evaluate(RandomizedRunner.java:693)
	at com.carrotsearch.randomizedtesting.rules.StatementAdapter.evaluate(StatementAdapter.java:36)
	at com.carrotsearch.randomizedtesting.rules.SystemPropertiesRestoreRule$1.evaluate(SystemPropertiesRestoreRule.java:53)
	at org.apache.lucene.util.AbstractBeforeAfterRule$1.evaluate(AbstractBeforeAfterRule.java:46)
	at org.apache.lucene.util.TestRuleStoreClassName$1.evaluate(TestRuleStoreClassName.java:42)
	at com.carrotsearch.randomizedtesting.rules.SystemPropertiesInvariantRule$1.evaluate(SystemPropertiesInvariantRule.java:55)
	at com.carrotsearch.randomizedtesting.rules.NoShadowingOrOverridesOnMethodsRule$1.evaluate(NoShadowingOrOverridesOnMethodsRule.java:39)
	at com.carrotsearch.randomizedtesting.rules.NoShadowingOrOverridesOnMethodsRule$1.evaluate(NoShadowingOrOverridesOnMethodsRule.java:39)
	at com.carrotsearch.randomizedtesting.rules.StatementAdapter.evaluate(StatementAdapter.java:36)
	at org.apache.lucene.util.TestRuleAssertionsRequired$1.evaluate(TestRuleAssertionsRequired.java:43)
	at org.apache.lucene.util.TestRuleMarkFailure$1.evaluate(TestRuleMarkFailure.java:48)
	at org.apache.lucene.util.TestRuleIgnoreAfterMaxFailures$1.evaluate(TestRuleIgnoreAfterMaxFailures.java:70)
	at org.apache.lucene.util.TestRuleIgnoreTestSuites$1.evaluate(TestRuleIgnoreTestSuites.java:55)
	at com.carrotsearch.randomizedtesting.rules.StatementAdapter.evaluate(StatementAdapter.java:36)
	at com.carrotsearch.randomizedtesting.ThreadLeakControl$StatementRunner.run(ThreadLeakControl.java:358)
	at java.lang.Thread.run(Thread.java:662)
Caused by: java.util.concurrent.TimeoutException: Could not connect to ZooKeeper 127.0.0.1:42897
within 30000 ms
	at org.apache.solr.common.cloud.ConnectionManager.waitForConnected(ConnectionManager.java:222)
	at org.apache.solr.common.cloud.SolrZkClient.<init>(SolrZkClient.java:140)
	... 47 more




Build Log:
[...truncated 10995 lines...]
   [junit4] Suite: org.apache.solr.client.solrj.impl.CloudSolrServerTest
   [junit4]   2> 21171 T64 oas.SolrTestCaseJ4.buildSSLConfig Randomized ssl (false) and
clientAuth (true)
   [junit4]   2> 21171 T64 oas.BaseDistributedSearchTestCase.initHostContext Setting hostContext
system property: /oso/r
   [junit4]   2> 21174 T64 oasc.AbstractZkTestCase.<clinit> WARN TEST_HOME() does
not exist - solrj test?
   [junit4]   2> 21177 T64 oas.SolrTestCaseJ4.setUp ###Starting testDistribSearch
   [junit4]   2> Creating dataDir: /mnt/ssd/jenkins/workspace/Lucene-Solr-4.x-Linux/solr/build/solr-solrj/test/J0/./solrtest-CloudSolrServerTest-1393687346505
   [junit4]   2> 21180 T64 oasc.ZkTestServer.run STARTING ZK TEST SERVER
   [junit4]   2> 21181 T65 oasc.ZkTestServer$ZKServerMain.runFromConfig Starting server
   [junit4]   2> 21281 T64 oasc.ZkTestServer.run start zk server on port:42897
   [junit4]   2> 21321 T64 oascc.ConnectionManager.waitForConnected Waiting for client
to connect to ZooKeeper
   [junit4]   2> 78028 T68 oazsp.FileTxnLog.commit WARN fsync-ing the write ahead log in
SyncThread:0 took 56687ms which will adversely effect operation latency. See the ZooKeeper
troubleshooting guide
   [junit4]   2> 78029 T64 oas.SolrTestCaseJ4.tearDown ###Ending testDistribSearch
   [junit4]   2> 78036 T66 oazs.NIOServerCnxn.doIO WARN caught end of stream exception
EndOfStreamException: Unable to read additional data from client sessionid 0x1447e3d3d920000,
likely client has closed socket
   [junit4]   2> 	at org.apache.zookeeper.server.NIOServerCnxn.doIO(NIOServerCnxn.java:220)
   [junit4]   2> 	at org.apache.zookeeper.server.NIOServerCnxnFactory.run(NIOServerCnxnFactory.java:208)
   [junit4]   2> 	at java.lang.Thread.run(Thread.java:662)
   [junit4]   2> 
   [junit4]   2> 78037 T64 oasc.ZkTestServer.send4LetterWord connecting to 127.0.0.1:42897
42897
   [junit4]   1> client port:0.0.0.0/0.0.0.0:0
   [junit4]   2> NOTE: reproduce with: ant test  -Dtestcase=CloudSolrServerTest -Dtests.method=testDistribSearch
-Dtests.seed=F8C5C942F0FF80CC -Dtests.multiplier=3 -Dtests.slow=true -Dtests.locale=ms_MY
-Dtests.timezone=America/Montserrat -Dtests.file.encoding=ISO-8859-1
   [junit4] ERROR   62.2s J0 | CloudSolrServerTest.testDistribSearch <<<
   [junit4]    > Throwable #1: org.apache.solr.common.SolrException: java.util.concurrent.TimeoutException:
Could not connect to ZooKeeper 127.0.0.1:42897 within 30000 ms
   [junit4]    > 	at __randomizedtesting.SeedInfo.seed([F8C5C942F0FF80CC:7923475A87A0E0F0]:0)
   [junit4]    > 	at org.apache.solr.common.cloud.SolrZkClient.<init>(SolrZkClient.java:148)
   [junit4]    > 	at org.apache.solr.common.cloud.SolrZkClient.<init>(SolrZkClient.java:99)
   [junit4]    > 	at org.apache.solr.common.cloud.SolrZkClient.<init>(SolrZkClient.java:94)
   [junit4]    > 	at org.apache.solr.common.cloud.SolrZkClient.<init>(SolrZkClient.java:85)
   [junit4]    > 	at org.apache.solr.cloud.AbstractZkTestCase.buildZooKeeper(AbstractZkTestCase.java:89)
   [junit4]    > 	at org.apache.solr.cloud.AbstractZkTestCase.buildZooKeeper(AbstractZkTestCase.java:83)
   [junit4]    > 	at org.apache.solr.cloud.AbstractDistribZkTestBase.setUp(AbstractDistribZkTestBase.java:70)
   [junit4]    > 	at org.apache.solr.cloud.AbstractFullDistribZkTestBase.setUp(AbstractFullDistribZkTestBase.java:200)
   [junit4]    > 	at org.apache.solr.client.solrj.impl.CloudSolrServerTest.setUp(CloudSolrServerTest.java:78)
   [junit4]    > 	at java.lang.Thread.run(Thread.java:662)
   [junit4]    > Caused by: java.util.concurrent.TimeoutException: Could not connect to
ZooKeeper 127.0.0.1:42897 within 30000 ms
   [junit4]    > 	at org.apache.solr.common.cloud.ConnectionManager.waitForConnected(ConnectionManager.java:222)
   [junit4]    > 	at org.apache.solr.common.cloud.SolrZkClient.<init>(SolrZkClient.java:140)
   [junit4]    > 	... 47 more
   [junit4]   2> 83410 T64 oas.SolrTestCaseJ4.setUp ###Starting testShutdown
   [junit4]   2> Creating dataDir: /mnt/ssd/jenkins/workspace/Lucene-Solr-4.x-Linux/solr/build/solr-solrj/test/J0/./solrtest-CloudSolrServerTest-1393687408738
   [junit4]   2> 83411 T64 oasc.ZkTestServer.run STARTING ZK TEST SERVER
   [junit4]   2> 83411 T72 oasc.ZkTestServer$ZKServerMain.runFromConfig Starting server
   [junit4]   2> 83512 T64 oasc.ZkTestServer.run start zk server on port:59344
   [junit4]   2> 83513 T64 oascc.ConnectionManager.waitForConnected Waiting for client
to connect to ZooKeeper
   [junit4]   2> 83590 T78 oascc.ConnectionManager.process Watcher org.apache.solr.common.cloud.ConnectionManager@10585c7
name:ZooKeeperConnection Watcher:127.0.0.1:59344 got event WatchedEvent state:SyncConnected
type:None path:null path:null type:None
   [junit4]   2> 83591 T64 oascc.ConnectionManager.waitForConnected Client is connected
to ZooKeeper
   [junit4]   2> 83592 T64 oascc.SolrZkClient.makePath makePath: /solr
   [junit4]   2> 83619 T64 oascc.ConnectionManager.waitForConnected Waiting for client
to connect to ZooKeeper
   [junit4]   2> 83620 T80 oascc.ConnectionManager.process Watcher org.apache.solr.common.cloud.ConnectionManager@1c94e11
name:ZooKeeperConnection Watcher:127.0.0.1:59344/solr got event WatchedEvent state:SyncConnected
type:None path:null path:null type:None
   [junit4]   2> 83621 T64 oascc.ConnectionManager.waitForConnected Client is connected
to ZooKeeper
   [junit4]   2> 83626 T64 oascc.SolrZkClient.makePath makePath: /collections/collection1
   [junit4]   2> 83634 T64 oascc.SolrZkClient.makePath makePath: /collections/collection1/shards
   [junit4]   2> 83643 T64 oascc.SolrZkClient.makePath makePath: /collections/control_collection
   [junit4]   2> 83648 T64 oascc.SolrZkClient.makePath makePath: /collections/control_collection/shards
   [junit4]   2> 83656 T64 oasc.AbstractZkTestCase.putConfig put /mnt/ssd/jenkins/workspace/Lucene-Solr-4.x-Linux/solr/solrj/src/test-files/solrj/solr/collection1/conf/solrconfig.xml
to /configs/conf1/solrconfig.xml
   [junit4]   2> 83656 T64 oascc.SolrZkClient.makePath makePath: /configs/conf1/solrconfig.xml
   [junit4]   2> 83669 T64 oasc.AbstractZkTestCase.putConfig put /mnt/ssd/jenkins/workspace/Lucene-Solr-4.x-Linux/solr/solrj/src/test-files/solrj/solr/collection1/conf/schema.xml
to /configs/conf1/schema.xml
   [junit4]   2> 83670 T64 oascc.SolrZkClient.makePath makePath: /configs/conf1/schema.xml
   [junit4]   2> 83677 T64 oasc.AbstractZkTestCase.putConfig skipping /mnt/ssd/jenkins/workspace/Lucene-Solr-4.x-Linux/solr/solrj/src/test-files/solrj/solr/collection1/conf/solrconfig.snippet.randomindexconfig.xml
because it doesn't exist
   [junit4]   2> 83677 T64 oasc.AbstractZkTestCase.putConfig skipping /mnt/ssd/jenkins/workspace/Lucene-Solr-4.x-Linux/solr/solrj/src/test-files/solrj/solr/collection1/conf/stopwords.txt
because it doesn't exist
   [junit4]   2> 83678 T64 oasc.AbstractZkTestCase.putConfig skipping /mnt/ssd/jenkins/workspace/Lucene-Solr-4.x-Linux/solr/solrj/src/test-files/solrj/solr/collection1/conf/protwords.txt
because it doesn't exist
   [junit4]   2> 83678 T64 oasc.AbstractZkTestCase.putConfig skipping /mnt/ssd/jenkins/workspace/Lucene-Solr-4.x-Linux/solr/solrj/src/test-files/solrj/solr/collection1/conf/currency.xml
because it doesn't exist
   [junit4]   2> 83678 T64 oasc.AbstractZkTestCase.putConfig skipping /mnt/ssd/jenkins/workspace/Lucene-Solr-4.x-Linux/solr/solrj/src/test-files/solrj/solr/collection1/conf/enumsConfig.xml
because it doesn't exist
   [junit4]   2> 83679 T64 oasc.AbstractZkTestCase.putConfig skipping /mnt/ssd/jenkins/workspace/Lucene-Solr-4.x-Linux/solr/solrj/src/test-files/solrj/solr/collection1/conf/open-exchange-rates.json
because it doesn't exist
   [junit4]   2> 83679 T64 oasc.AbstractZkTestCase.putConfig skipping /mnt/ssd/jenkins/workspace/Lucene-Solr-4.x-Linux/solr/solrj/src/test-files/solrj/solr/collection1/conf/mapping-ISOLatin1Accent.txt
because it doesn't exist
   [junit4]   2> 83680 T64 oasc.AbstractZkTestCase.putConfig skipping /mnt/ssd/jenkins/workspace/Lucene-Solr-4.x-Linux/solr/solrj/src/test-files/solrj/solr/collection1/conf/old_synonyms.txt
because it doesn't exist
   [junit4]   2> 83680 T64 oasc.AbstractZkTestCase.putConfig skipping /mnt/ssd/jenkins/workspace/Lucene-Solr-4.x-Linux/solr/solrj/src/test-files/solrj/solr/collection1/conf/synonyms.txt
because it doesn't exist
   [junit4]   2> 83688 T64 oascc.ConnectionManager.waitForConnected Waiting for client
to connect to ZooKeeper
   [junit4]   2> 83690 T81 oaz.ClientCnxnSocketNIO.connect ERROR Unable to open socket
to ff01:0:0:0:0:0:0:114/ff01:0:0:0:0:0:0:114:33332
   [junit4]   2> 83690 T81 oaz.ClientCnxn$SendThread.run WARN Session 0x0 for server null,
unexpected error, closing socket connection and attempting reconnect java.net.SocketException:
Network is unreachable
   [junit4]   2> 	at sun.nio.ch.Net.connect(Native Method)
   [junit4]   2> 	at sun.nio.ch.SocketChannelImpl.connect(SocketChannelImpl.java:532)
   [junit4]   2> 	at org.apache.zookeeper.ClientCnxnSocketNIO.registerAndConnect(ClientCnxnSocketNIO.java:266)
   [junit4]   2> 	at org.apache.zookeeper.ClientCnxnSocketNIO.connect(ClientCnxnSocketNIO.java:276)
   [junit4]   2> 	at org.apache.zookeeper.ClientCnxn$SendThread.startConnect(ClientCnxn.java:958)
   [junit4]   2> 	at org.apache.zookeeper.ClientCnxn$SendThread.run(ClientCnxn.java:993)
   [junit4]   2> 
   [junit4]   2> 84792 T81 oaz.ClientCnxnSocketNIO.connect ERROR Unable to open socket
to ff01:0:0:0:0:0:0:114/ff01:0:0:0:0:0:0:114:33332
   [junit4]   2> 84894 T64 oas.SolrTestCaseJ4.tearDown ###Ending testShutdown
   [junit4]   2> 84896 T64 oasc.ZkTestServer.send4LetterWord connecting to 127.0.0.1:59344
59344
   [junit4]   1> client port:0.0.0.0/0.0.0.0:0
   [junit4]   2> 90188 T64 oas.SolrTestCaseJ4.deleteCore ###deleteCore
   [junit4]   2> NOTE: test params are: codec=Asserting, sim=DefaultSimilarity, locale=ms_MY,
timezone=America/Montserrat
   [junit4]   2> NOTE: Linux 3.8.0-36-generic i386/Sun Microsystems Inc. 1.6.0_45 (32-bit)/cpus=8,threads=1,free=10854208,total=35860480
   [junit4]   2> NOTE: All tests run in this JVM: [SolrExampleXMLTest, TestXMLEscaping,
SolrExceptionTest, ContentStreamTest, SolrParamTest, TestCoreAdmin, SolrExampleEmbeddedTest,
CloudSolrServerTest]
   [junit4] Completed on J0 in 69.07s, 2 tests, 1 error <<< FAILURES!

[...truncated 88 lines...]
BUILD FAILED
/mnt/ssd/jenkins/workspace/Lucene-Solr-4.x-Linux/build.xml:471: The following error occurred
while executing this line:
/mnt/ssd/jenkins/workspace/Lucene-Solr-4.x-Linux/build.xml:451: The following error occurred
while executing this line:
/mnt/ssd/jenkins/workspace/Lucene-Solr-4.x-Linux/build.xml:39: The following error occurred
while executing this line:
/mnt/ssd/jenkins/workspace/Lucene-Solr-4.x-Linux/extra-targets.xml:37: The following error
occurred while executing this line:
/mnt/ssd/jenkins/workspace/Lucene-Solr-4.x-Linux/solr/build.xml:202: The following error occurred
while executing this line:
/mnt/ssd/jenkins/workspace/Lucene-Solr-4.x-Linux/solr/common-build.xml:490: The following
error occurred while executing this line:
/mnt/ssd/jenkins/workspace/Lucene-Solr-4.x-Linux/lucene/common-build.xml:1278: The following
error occurred while executing this line:
/mnt/ssd/jenkins/workspace/Lucene-Solr-4.x-Linux/lucene/common-build.xml:911: There were test
failures: 48 suites, 280 tests, 1 error

Total time: 55 minutes 0 seconds
Build step 'Invoke Ant' marked build as failure
Description set: Java: 32bit/jdk1.6.0_45 -client -XX:+UseSerialGC
Archiving artifacts
Recording test results
Email was triggered for: Failure
Sending email for trigger: Failure



Mime
View raw message