lucene-dev mailing list archives

Site index · List index
Message view « Date » · « Thread »
Top « Date » · « Thread »
From Policeman Jenkins Server <jenk...@thetaphi.de>
Subject [JENKINS] Lucene-Solr-4.x-Windows (32bit/jdk1.8.0) - Build # 3796 - Failure!
Date Wed, 19 Mar 2014 09:56:51 GMT
Build: http://jenkins.thetaphi.de/job/Lucene-Solr-4.x-Windows/3796/
Java: 32bit/jdk1.8.0 -client -XX:+UseSerialGC

5 tests failed.
REGRESSION:  org.apache.solr.cloud.DistribCursorPagingTest.testDistribSearch

Error Message:


Stack Trace:
org.apache.solr.common.cloud.ZooKeeperException: 
	at __randomizedtesting.SeedInfo.seed([5A9179BE0A4E8A74:DB77F7A67D11EA48]:0)
	at org.apache.solr.client.solrj.impl.CloudSolrServer.connect(CloudSolrServer.java:249)
	at org.apache.solr.cloud.AbstractFullDistribZkTestBase.initCloud(AbstractFullDistribZkTestBase.java:256)
	at org.apache.solr.cloud.AbstractFullDistribZkTestBase.createServers(AbstractFullDistribZkTestBase.java:312)
	at org.apache.solr.BaseDistributedSearchTestCase.testDistribSearch(BaseDistributedSearchTestCase.java:868)
	at sun.reflect.NativeMethodAccessorImpl.invoke0(Native Method)
	at sun.reflect.NativeMethodAccessorImpl.invoke(NativeMethodAccessorImpl.java:62)
	at sun.reflect.DelegatingMethodAccessorImpl.invoke(DelegatingMethodAccessorImpl.java:43)
	at java.lang.reflect.Method.invoke(Method.java:483)
	at com.carrotsearch.randomizedtesting.RandomizedRunner.invoke(RandomizedRunner.java:1617)
	at com.carrotsearch.randomizedtesting.RandomizedRunner$6.evaluate(RandomizedRunner.java:826)
	at com.carrotsearch.randomizedtesting.RandomizedRunner$7.evaluate(RandomizedRunner.java:862)
	at com.carrotsearch.randomizedtesting.RandomizedRunner$8.evaluate(RandomizedRunner.java:876)
	at com.carrotsearch.randomizedtesting.rules.SystemPropertiesRestoreRule$1.evaluate(SystemPropertiesRestoreRule.java:53)
	at org.apache.lucene.util.TestRuleSetupTeardownChained$1.evaluate(TestRuleSetupTeardownChained.java:50)
	at org.apache.lucene.util.TestRuleFieldCacheSanity$1.evaluate(TestRuleFieldCacheSanity.java:51)
	at org.apache.lucene.util.AbstractBeforeAfterRule$1.evaluate(AbstractBeforeAfterRule.java:46)
	at com.carrotsearch.randomizedtesting.rules.SystemPropertiesInvariantRule$1.evaluate(SystemPropertiesInvariantRule.java:55)
	at org.apache.lucene.util.TestRuleThreadAndTestName$1.evaluate(TestRuleThreadAndTestName.java:49)
	at org.apache.lucene.util.TestRuleIgnoreAfterMaxFailures$1.evaluate(TestRuleIgnoreAfterMaxFailures.java:70)
	at org.apache.lucene.util.TestRuleMarkFailure$1.evaluate(TestRuleMarkFailure.java:48)
	at com.carrotsearch.randomizedtesting.rules.StatementAdapter.evaluate(StatementAdapter.java:36)
	at com.carrotsearch.randomizedtesting.ThreadLeakControl$StatementRunner.run(ThreadLeakControl.java:359)
	at com.carrotsearch.randomizedtesting.ThreadLeakControl.forkTimeoutingTask(ThreadLeakControl.java:783)
	at com.carrotsearch.randomizedtesting.ThreadLeakControl$3.evaluate(ThreadLeakControl.java:443)
	at com.carrotsearch.randomizedtesting.RandomizedRunner.runSingleTest(RandomizedRunner.java:835)
	at com.carrotsearch.randomizedtesting.RandomizedRunner$3.evaluate(RandomizedRunner.java:737)
	at com.carrotsearch.randomizedtesting.RandomizedRunner$4.evaluate(RandomizedRunner.java:771)
	at com.carrotsearch.randomizedtesting.RandomizedRunner$5.evaluate(RandomizedRunner.java:782)
	at com.carrotsearch.randomizedtesting.rules.StatementAdapter.evaluate(StatementAdapter.java:36)
	at com.carrotsearch.randomizedtesting.rules.SystemPropertiesRestoreRule$1.evaluate(SystemPropertiesRestoreRule.java:53)
	at org.apache.lucene.util.AbstractBeforeAfterRule$1.evaluate(AbstractBeforeAfterRule.java:46)
	at org.apache.lucene.util.TestRuleStoreClassName$1.evaluate(TestRuleStoreClassName.java:42)
	at com.carrotsearch.randomizedtesting.rules.SystemPropertiesInvariantRule$1.evaluate(SystemPropertiesInvariantRule.java:55)
	at com.carrotsearch.randomizedtesting.rules.NoShadowingOrOverridesOnMethodsRule$1.evaluate(NoShadowingOrOverridesOnMethodsRule.java:39)
	at com.carrotsearch.randomizedtesting.rules.NoShadowingOrOverridesOnMethodsRule$1.evaluate(NoShadowingOrOverridesOnMethodsRule.java:39)
	at com.carrotsearch.randomizedtesting.rules.StatementAdapter.evaluate(StatementAdapter.java:36)
	at org.apache.lucene.util.TestRuleAssertionsRequired$1.evaluate(TestRuleAssertionsRequired.java:43)
	at org.apache.lucene.util.TestRuleMarkFailure$1.evaluate(TestRuleMarkFailure.java:48)
	at org.apache.lucene.util.TestRuleIgnoreAfterMaxFailures$1.evaluate(TestRuleIgnoreAfterMaxFailures.java:70)
	at org.apache.lucene.util.TestRuleIgnoreTestSuites$1.evaluate(TestRuleIgnoreTestSuites.java:55)
	at com.carrotsearch.randomizedtesting.rules.StatementAdapter.evaluate(StatementAdapter.java:36)
	at com.carrotsearch.randomizedtesting.ThreadLeakControl$StatementRunner.run(ThreadLeakControl.java:359)
	at java.lang.Thread.run(Thread.java:744)
Caused by: org.apache.zookeeper.KeeperException$NoNodeException: KeeperErrorCode = NoNode for /live_nodes
	at org.apache.zookeeper.KeeperException.create(KeeperException.java:111)
	at org.apache.zookeeper.KeeperException.create(KeeperException.java:51)
	at org.apache.zookeeper.ZooKeeper.getChildren(ZooKeeper.java:1468)
	at org.apache.solr.common.cloud.SolrZkClient$6.execute(SolrZkClient.java:259)
	at org.apache.solr.common.cloud.SolrZkClient$6.execute(SolrZkClient.java:256)
	at org.apache.solr.common.cloud.ZkCmdExecutor.retryOperation(ZkCmdExecutor.java:73)
	at org.apache.solr.common.cloud.SolrZkClient.getChildren(SolrZkClient.java:256)
	at org.apache.solr.common.cloud.ZkStateReader.createClusterStateWatchersAndUpdate(ZkStateReader.java:299)
	at org.apache.solr.client.solrj.impl.CloudSolrServer.connect(CloudSolrServer.java:242)
	... 42 more


FAILED:  junit.framework.TestSuite.org.apache.solr.cloud.DistribCursorPagingTest

Error Message:
ERROR: SolrZkClient opens=5 closes=4

Stack Trace:
java.lang.AssertionError: ERROR: SolrZkClient opens=5 closes=4
	at __randomizedtesting.SeedInfo.seed([5A9179BE0A4E8A74]:0)
	at org.junit.Assert.fail(Assert.java:93)
	at org.apache.solr.SolrTestCaseJ4.endTrackingZkClients(SolrTestCaseJ4.java:420)
	at org.apache.solr.SolrTestCaseJ4.afterClass(SolrTestCaseJ4.java:177)
	at sun.reflect.GeneratedMethodAccessor63.invoke(Unknown Source)
	at sun.reflect.DelegatingMethodAccessorImpl.invoke(DelegatingMethodAccessorImpl.java:43)
	at java.lang.reflect.Method.invoke(Method.java:483)
	at com.carrotsearch.randomizedtesting.RandomizedRunner.invoke(RandomizedRunner.java:1617)
	at com.carrotsearch.randomizedtesting.RandomizedRunner$5.evaluate(RandomizedRunner.java:789)
	at com.carrotsearch.randomizedtesting.rules.StatementAdapter.evaluate(StatementAdapter.java:36)
	at com.carrotsearch.randomizedtesting.rules.SystemPropertiesRestoreRule$1.evaluate(SystemPropertiesRestoreRule.java:53)
	at org.apache.lucene.util.AbstractBeforeAfterRule$1.evaluate(AbstractBeforeAfterRule.java:46)
	at org.apache.lucene.util.TestRuleStoreClassName$1.evaluate(TestRuleStoreClassName.java:42)
	at com.carrotsearch.randomizedtesting.rules.SystemPropertiesInvariantRule$1.evaluate(SystemPropertiesInvariantRule.java:55)
	at com.carrotsearch.randomizedtesting.rules.NoShadowingOrOverridesOnMethodsRule$1.evaluate(NoShadowingOrOverridesOnMethodsRule.java:39)
	at com.carrotsearch.randomizedtesting.rules.NoShadowingOrOverridesOnMethodsRule$1.evaluate(NoShadowingOrOverridesOnMethodsRule.java:39)
	at com.carrotsearch.randomizedtesting.rules.StatementAdapter.evaluate(StatementAdapter.java:36)
	at org.apache.lucene.util.TestRuleAssertionsRequired$1.evaluate(TestRuleAssertionsRequired.java:43)
	at org.apache.lucene.util.TestRuleMarkFailure$1.evaluate(TestRuleMarkFailure.java:48)
	at org.apache.lucene.util.TestRuleIgnoreAfterMaxFailures$1.evaluate(TestRuleIgnoreAfterMaxFailures.java:70)
	at org.apache.lucene.util.TestRuleIgnoreTestSuites$1.evaluate(TestRuleIgnoreTestSuites.java:55)
	at com.carrotsearch.randomizedtesting.rules.StatementAdapter.evaluate(StatementAdapter.java:36)
	at com.carrotsearch.randomizedtesting.ThreadLeakControl$StatementRunner.run(ThreadLeakControl.java:359)
	at java.lang.Thread.run(Thread.java:744)


FAILED:  junit.framework.TestSuite.org.apache.solr.cloud.DistribCursorPagingTest

Error Message:
2 threads leaked from SUITE scope at org.apache.solr.cloud.DistribCursorPagingTest:     1) Thread[id=3064, name=TEST-DistribCursorPagingTest.testDistribSearch-seed#[5A9179BE0A4E8A74]-EventThread, state=WAITING, group=TGRP-DistribCursorPagingTest]         at sun.misc.Unsafe.park(Native Method)         at java.util.concurrent.locks.LockSupport.park(LockSupport.java:175)         at java.util.concurrent.locks.AbstractQueuedSynchronizer$ConditionObject.await(AbstractQueuedSynchronizer.java:2039)         at java.util.concurrent.LinkedBlockingQueue.take(LinkedBlockingQueue.java:442)         at org.apache.zookeeper.ClientCnxn$EventThread.run(ClientCnxn.java:491)    2) Thread[id=3063, name=TEST-DistribCursorPagingTest.testDistribSearch-seed#[5A9179BE0A4E8A74]-SendThread(127.0.0.1:54115), state=TIMED_WAITING, group=TGRP-DistribCursorPagingTest]         at java.lang.Thread.sleep(Native Method)         at org.apache.zookeeper.client.StaticHostProvider.next(StaticHostProvider.java:86)         at org.apache.zookeeper.ClientCnxn$SendThread.startConnect(ClientCnxn.java:937)         at org.apache.zookeeper.ClientCnxn$SendThread.run(ClientCnxn.java:993)

Stack Trace:
com.carrotsearch.randomizedtesting.ThreadLeakError: 2 threads leaked from SUITE scope at org.apache.solr.cloud.DistribCursorPagingTest: 
   1) Thread[id=3064, name=TEST-DistribCursorPagingTest.testDistribSearch-seed#[5A9179BE0A4E8A74]-EventThread, state=WAITING, group=TGRP-DistribCursorPagingTest]
        at sun.misc.Unsafe.park(Native Method)
        at java.util.concurrent.locks.LockSupport.park(LockSupport.java:175)
        at java.util.concurrent.locks.AbstractQueuedSynchronizer$ConditionObject.await(AbstractQueuedSynchronizer.java:2039)
        at java.util.concurrent.LinkedBlockingQueue.take(LinkedBlockingQueue.java:442)
        at org.apache.zookeeper.ClientCnxn$EventThread.run(ClientCnxn.java:491)
   2) Thread[id=3063, name=TEST-DistribCursorPagingTest.testDistribSearch-seed#[5A9179BE0A4E8A74]-SendThread(127.0.0.1:54115), state=TIMED_WAITING, group=TGRP-DistribCursorPagingTest]
        at java.lang.Thread.sleep(Native Method)
        at org.apache.zookeeper.client.StaticHostProvider.next(StaticHostProvider.java:86)
        at org.apache.zookeeper.ClientCnxn$SendThread.startConnect(ClientCnxn.java:937)
        at org.apache.zookeeper.ClientCnxn$SendThread.run(ClientCnxn.java:993)
	at __randomizedtesting.SeedInfo.seed([5A9179BE0A4E8A74]:0)


FAILED:  junit.framework.TestSuite.org.apache.solr.cloud.DistribCursorPagingTest

Error Message:
There are still zombie threads that couldn't be terminated:    1) Thread[id=3063, name=TEST-DistribCursorPagingTest.testDistribSearch-seed#[5A9179BE0A4E8A74]-SendThread(127.0.0.1:54115), state=TIMED_WAITING, group=TGRP-DistribCursorPagingTest]         at java.lang.Thread.sleep(Native Method)         at org.apache.zookeeper.client.StaticHostProvider.next(StaticHostProvider.java:86)         at org.apache.zookeeper.ClientCnxn$SendThread.startConnect(ClientCnxn.java:937)         at org.apache.zookeeper.ClientCnxn$SendThread.run(ClientCnxn.java:993)

Stack Trace:
com.carrotsearch.randomizedtesting.ThreadLeakError: There are still zombie threads that couldn't be terminated:
   1) Thread[id=3063, name=TEST-DistribCursorPagingTest.testDistribSearch-seed#[5A9179BE0A4E8A74]-SendThread(127.0.0.1:54115), state=TIMED_WAITING, group=TGRP-DistribCursorPagingTest]
        at java.lang.Thread.sleep(Native Method)
        at org.apache.zookeeper.client.StaticHostProvider.next(StaticHostProvider.java:86)
        at org.apache.zookeeper.ClientCnxn$SendThread.startConnect(ClientCnxn.java:937)
        at org.apache.zookeeper.ClientCnxn$SendThread.run(ClientCnxn.java:993)
	at __randomizedtesting.SeedInfo.seed([5A9179BE0A4E8A74]:0)


REGRESSION:  org.apache.solr.handler.component.DistributedSpellCheckComponentTest.testDistribSearch

Error Message:
Expected mime type application/octet-stream but got text/html. <html> <head> <meta http-equiv="Content-Type" content="text/html;charset=ISO-8859-1"/> <title>Error 503 Server is shutting down or failed to initialize</title> </head> <body> <h2>HTTP ERROR: 503</h2> <p>Problem accessing /ve/lp/update. Reason: <pre>    Server is shutting down or failed to initialize</pre></p> <hr /><i><small>Powered by Jetty://</small></i>                                                                                                                                                                                                                                                                                                                                                                                                                                                                                                                                                                                                                                                                                                                                                                                                                                                                                                                                                                                                                     </body> </html> 

Stack Trace:
org.apache.solr.client.solrj.impl.HttpSolrServer$RemoteSolrException: Expected mime type application/octet-stream but got text/html. <html>
<head>
<meta http-equiv="Content-Type" content="text/html;charset=ISO-8859-1"/>
<title>Error 503 Server is shutting down or failed to initialize</title>
</head>
<body>
<h2>HTTP ERROR: 503</h2>
<p>Problem accessing /ve/lp/update. Reason:
<pre>    Server is shutting down or failed to initialize</pre></p>
<hr /><i><small>Powered by Jetty://</small></i>
                                                
                                                
                                                
                                                
                                                
                                                
                                                
                                                
                                                
                                                
                                                
                                                
                                                
                                                
                                                
                                                
                                                
                                                
                                                
                                                
</body>
</html>

	at __randomizedtesting.SeedInfo.seed([5A9179BE0A4E8A74:DB77F7A67D11EA48]:0)
	at org.apache.solr.client.solrj.impl.HttpSolrServer.executeMethod(HttpSolrServer.java:466)
	at org.apache.solr.client.solrj.impl.HttpSolrServer.request(HttpSolrServer.java:203)
	at org.apache.solr.client.solrj.impl.HttpSolrServer.request(HttpSolrServer.java:199)
	at org.apache.solr.client.solrj.request.AbstractUpdateRequest.process(AbstractUpdateRequest.java:118)
	at org.apache.solr.client.solrj.SolrServer.deleteByQuery(SolrServer.java:285)
	at org.apache.solr.client.solrj.SolrServer.deleteByQuery(SolrServer.java:271)
	at org.apache.solr.BaseDistributedSearchTestCase.del(BaseDistributedSearchTestCase.java:498)
	at org.apache.solr.handler.component.DistributedSpellCheckComponentTest.doTest(DistributedSpellCheckComponentTest.java:99)
	at org.apache.solr.BaseDistributedSearchTestCase.testDistribSearch(BaseDistributedSearchTestCase.java:876)
	at sun.reflect.NativeMethodAccessorImpl.invoke0(Native Method)
	at sun.reflect.NativeMethodAccessorImpl.invoke(NativeMethodAccessorImpl.java:62)
	at sun.reflect.DelegatingMethodAccessorImpl.invoke(DelegatingMethodAccessorImpl.java:43)
	at java.lang.reflect.Method.invoke(Method.java:483)
	at com.carrotsearch.randomizedtesting.RandomizedRunner.invoke(RandomizedRunner.java:1617)
	at com.carrotsearch.randomizedtesting.RandomizedRunner$6.evaluate(RandomizedRunner.java:826)
	at com.carrotsearch.randomizedtesting.RandomizedRunner$7.evaluate(RandomizedRunner.java:862)
	at com.carrotsearch.randomizedtesting.RandomizedRunner$8.evaluate(RandomizedRunner.java:876)
	at com.carrotsearch.randomizedtesting.rules.SystemPropertiesRestoreRule$1.evaluate(SystemPropertiesRestoreRule.java:53)
	at org.apache.lucene.util.TestRuleSetupTeardownChained$1.evaluate(TestRuleSetupTeardownChained.java:50)
	at org.apache.lucene.util.TestRuleFieldCacheSanity$1.evaluate(TestRuleFieldCacheSanity.java:51)
	at org.apache.lucene.util.AbstractBeforeAfterRule$1.evaluate(AbstractBeforeAfterRule.java:46)
	at com.carrotsearch.randomizedtesting.rules.SystemPropertiesInvariantRule$1.evaluate(SystemPropertiesInvariantRule.java:55)
	at org.apache.lucene.util.TestRuleThreadAndTestName$1.evaluate(TestRuleThreadAndTestName.java:49)
	at org.apache.lucene.util.TestRuleIgnoreAfterMaxFailures$1.evaluate(TestRuleIgnoreAfterMaxFailures.java:70)
	at org.apache.lucene.util.TestRuleMarkFailure$1.evaluate(TestRuleMarkFailure.java:48)
	at com.carrotsearch.randomizedtesting.rules.StatementAdapter.evaluate(StatementAdapter.java:36)
	at com.carrotsearch.randomizedtesting.ThreadLeakControl$StatementRunner.run(ThreadLeakControl.java:359)
	at com.carrotsearch.randomizedtesting.ThreadLeakControl.forkTimeoutingTask(ThreadLeakControl.java:783)
	at com.carrotsearch.randomizedtesting.ThreadLeakControl$3.evaluate(ThreadLeakControl.java:443)
	at com.carrotsearch.randomizedtesting.RandomizedRunner.runSingleTest(RandomizedRunner.java:835)
	at com.carrotsearch.randomizedtesting.RandomizedRunner$3.evaluate(RandomizedRunner.java:737)
	at com.carrotsearch.randomizedtesting.RandomizedRunner$4.evaluate(RandomizedRunner.java:771)
	at com.carrotsearch.randomizedtesting.RandomizedRunner$5.evaluate(RandomizedRunner.java:782)
	at com.carrotsearch.randomizedtesting.rules.StatementAdapter.evaluate(StatementAdapter.java:36)
	at com.carrotsearch.randomizedtesting.rules.SystemPropertiesRestoreRule$1.evaluate(SystemPropertiesRestoreRule.java:53)
	at org.apache.lucene.util.AbstractBeforeAfterRule$1.evaluate(AbstractBeforeAfterRule.java:46)
	at org.apache.lucene.util.TestRuleStoreClassName$1.evaluate(TestRuleStoreClassName.java:42)
	at com.carrotsearch.randomizedtesting.rules.SystemPropertiesInvariantRule$1.evaluate(SystemPropertiesInvariantRule.java:55)
	at com.carrotsearch.randomizedtesting.rules.NoShadowingOrOverridesOnMethodsRule$1.evaluate(NoShadowingOrOverridesOnMethodsRule.java:39)
	at com.carrotsearch.randomizedtesting.rules.NoShadowingOrOverridesOnMethodsRule$1.evaluate(NoShadowingOrOverridesOnMethodsRule.java:39)
	at com.carrotsearch.randomizedtesting.rules.StatementAdapter.evaluate(StatementAdapter.java:36)
	at org.apache.lucene.util.TestRuleAssertionsRequired$1.evaluate(TestRuleAssertionsRequired.java:43)
	at org.apache.lucene.util.TestRuleMarkFailure$1.evaluate(TestRuleMarkFailure.java:48)
	at org.apache.lucene.util.TestRuleIgnoreAfterMaxFailures$1.evaluate(TestRuleIgnoreAfterMaxFailures.java:70)
	at org.apache.lucene.util.TestRuleIgnoreTestSuites$1.evaluate(TestRuleIgnoreTestSuites.java:55)
	at com.carrotsearch.randomizedtesting.rules.StatementAdapter.evaluate(StatementAdapter.java:36)
	at com.carrotsearch.randomizedtesting.ThreadLeakControl$StatementRunner.run(ThreadLeakControl.java:359)
	at java.lang.Thread.run(Thread.java:744)




Build Log:
[...truncated 10614 lines...]
   [junit4] Suite: org.apache.solr.handler.component.DistributedSpellCheckComponentTest
   [junit4]   2> 847679 T3016 oas.SolrTestCaseJ4.startTrackingSearchers WARN startTrackingSearchers: numOpens=7 numCloses=7
   [junit4]   2> 847682 T3016 oas.SolrTestCaseJ4.buildSSLConfig Randomized ssl (false) and clientAuth (true)
   [junit4]   2> 847682 T3016 oas.BaseDistributedSearchTestCase.initHostContext Setting hostContext system property: /ve/lp
   [junit4]   2> 847683 T3016 oas.SolrTestCaseJ4.setUp ###Starting testDistribSearch
   [junit4]   2> 847687 T3016 oejs.Server.doStart jetty-8.1.10.v20130312
   [junit4]   2> 847732 T3016 oejs.AbstractConnector.doStart Started SelectChannelConnector@127.0.0.1:54072
   [junit4]   2> 847733 T3016 oass.SolrDispatchFilter.init SolrDispatchFilter.init()
   [junit4]   2> 847734 T3016 oasc.SolrResourceLoader.locateSolrHome JNDI not configured for solr (NoInitialContextEx)
   [junit4]   2> 847734 T3016 oasc.SolrResourceLoader.locateSolrHome using system property solr.solr.home: C:\Users\JenkinsSlave\workspace\Lucene-Solr-4.x-Windows\solr\core\src\test-files\solr
   [junit4]   2> 847734 T3016 oasc.SolrResourceLoader.<init> new SolrResourceLoader for directory: 'C:\Users\JenkinsSlave\workspace\Lucene-Solr-4.x-Windows\solr\core\src\test-files\solr\'
   [junit4]   2> 847767 T3016 oass.SolrDispatchFilter.loadConfigSolr Trying to read solr.xml from 127.0.0.1:53964/solr
   [junit4]   2> 847769 T3016 oascc.ConnectionManager.waitForConnected Waiting for client to connect to ZooKeeper
   [junit4]   2> 848711 T3026 oaz.ClientCnxn$SendThread.run WARN Session 0x0 for server null, unexpected error, closing socket connection and attempting reconnect java.net.ConnectException: Connection refused: no further information
   [junit4]   2> 	at sun.nio.ch.SocketChannelImpl.checkConnect(Native Method)
   [junit4]   2> 	at sun.nio.ch.SocketChannelImpl.finishConnect(SocketChannelImpl.java:712)
   [junit4]   2> 	at org.apache.zookeeper.ClientCnxnSocketNIO.doTransport(ClientCnxnSocketNIO.java:350)
   [junit4]   2> 	at org.apache.zookeeper.ClientCnxn$SendThread.run(ClientCnxn.java:1068)
   [junit4]   2> 
   [junit4]   2> 850589 T3026 oaz.ClientCnxn$SendThread.run WARN Session 0x0 for server null, unexpected error, closing socket connection and attempting reconnect java.net.ConnectException: Connection refused: no further information
   [junit4]   2> 	at sun.nio.ch.SocketChannelImpl.checkConnect(Native Method)
   [junit4]   2> 	at sun.nio.ch.SocketChannelImpl.finishConnect(SocketChannelImpl.java:712)
   [junit4]   2> 	at org.apache.zookeeper.ClientCnxnSocketNIO.doTransport(ClientCnxnSocketNIO.java:350)
   [junit4]   2> 	at org.apache.zookeeper.ClientCnxn$SendThread.run(ClientCnxn.java:1068)
   [junit4]   2> 
   [junit4]   2> 852465 T3026 oaz.ClientCnxn$SendThread.run WARN Session 0x0 for server null, unexpected error, closing socket connection and attempting reconnect java.net.ConnectException: Connection refused: no further information
   [junit4]   2> 	at sun.nio.ch.SocketChannelImpl.checkConnect(Native Method)
   [junit4]   2> 	at sun.nio.ch.SocketChannelImpl.finishConnect(SocketChannelImpl.java:712)
   [junit4]   2> 	at org.apache.zookeeper.ClientCnxnSocketNIO.doTransport(ClientCnxnSocketNIO.java:350)
   [junit4]   2> 	at org.apache.zookeeper.ClientCnxn$SendThread.run(ClientCnxn.java:1068)
   [junit4]   2> 
   [junit4]   2> 854333 T3026 oaz.ClientCnxn$SendThread.run WARN Session 0x0 for server null, unexpected error, closing socket connection and attempting reconnect java.net.ConnectException: Connection refused: no further information
   [junit4]   2> 	at sun.nio.ch.SocketChannelImpl.checkConnect(Native Method)
   [junit4]   2> 	at sun.nio.ch.SocketChannelImpl.finishConnect(SocketChannelImpl.java:712)
   [junit4]   2> 	at org.apache.zookeeper.ClientCnxnSocketNIO.doTransport(ClientCnxnSocketNIO.java:350)
   [junit4]   2> 	at org.apache.zookeeper.ClientCnxn$SendThread.run(ClientCnxn.java:1068)
   [junit4]   2> 
   [junit4]   2> 856209 T3026 oaz.ClientCnxn$SendThread.run WARN Session 0x0 for server null, unexpected error, closing socket connection and attempting reconnect java.net.ConnectException: Connection refused: no further information
   [junit4]   2> 	at sun.nio.ch.SocketChannelImpl.checkConnect(Native Method)
   [junit4]   2> 	at sun.nio.ch.SocketChannelImpl.finishConnect(SocketChannelImpl.java:712)
   [junit4]   2> 	at org.apache.zookeeper.ClientCnxnSocketNIO.doTransport(ClientCnxnSocketNIO.java:350)
   [junit4]   2> 	at org.apache.zookeeper.ClientCnxn$SendThread.run(ClientCnxn.java:1068)
   [junit4]   2> 
   [junit4]   2> 858176 T3026 oaz.ClientCnxn$SendThread.run WARN Session 0x0 for server null, unexpected error, closing socket connection and attempting reconnect java.net.ConnectException: Connection refused: no further information
   [junit4]   2> 	at sun.nio.ch.SocketChannelImpl.checkConnect(Native Method)
   [junit4]   2> 	at sun.nio.ch.SocketChannelImpl.finishConnect(SocketChannelImpl.java:712)
   [junit4]   2> 	at org.apache.zookeeper.ClientCnxnSocketNIO.doTransport(ClientCnxnSocketNIO.java:350)
   [junit4]   2> 	at org.apache.zookeeper.ClientCnxn$SendThread.run(ClientCnxn.java:1068)
   [junit4]   2> 
   [junit4]   2> 860245 T3026 oaz.ClientCnxn$SendThread.run WARN Session 0x0 for server null, unexpected error, closing socket connection and attempting reconnect java.net.ConnectException: Connection refused: no further information
   [junit4]   2> 	at sun.nio.ch.SocketChannelImpl.checkConnect(Native Method)
   [junit4]   2> 	at sun.nio.ch.SocketChannelImpl.finishConnect(SocketChannelImpl.java:712)
   [junit4]   2> 	at org.apache.zookeeper.ClientCnxnSocketNIO.doTransport(ClientCnxnSocketNIO.java:350)
   [junit4]   2> 	at org.apache.zookeeper.ClientCnxn$SendThread.run(ClientCnxn.java:1068)
   [junit4]   2> 
   [junit4]   2> 862297 T3026 oaz.ClientCnxn$SendThread.run WARN Session 0x0 for server null, unexpected error, closing socket connection and attempting reconnect java.net.ConnectException: Connection refused: no further information
   [junit4]   2> 	at sun.nio.ch.SocketChannelImpl.checkConnect(Native Method)
   [junit4]   2> 	at sun.nio.ch.SocketChannelImpl.finishConnect(SocketChannelImpl.java:712)
   [junit4]   2> 	at org.apache.zookeeper.ClientCnxnSocketNIO.doTransport(ClientCnxnSocketNIO.java:350)
   [junit4]   2> 	at org.apache.zookeeper.ClientCnxn$SendThread.run(ClientCnxn.java:1068)
   [junit4]   2> 
   [junit4]   2> 864361 T3026 oaz.ClientCnxn$SendThread.run WARN Session 0x0 for server null, unexpected error, closing socket connection and attempting reconnect java.net.ConnectException: Connection refused: no further information
   [junit4]   2> 	at sun.nio.ch.SocketChannelImpl.checkConnect(Native Method)
   [junit4]   2> 	at sun.nio.ch.SocketChannelImpl.finishConnect(SocketChannelImpl.java:712)
   [junit4]   2> 	at org.apache.zookeeper.ClientCnxnSocketNIO.doTransport(ClientCnxnSocketNIO.java:350)
   [junit4]   2> 	at org.apache.zookeeper.ClientCnxn$SendThread.run(ClientCnxn.java:1068)
   [junit4]   2> 
   [junit4]   2> 866414 T3026 oaz.ClientCnxn$SendThread.run WARN Session 0x0 for server null, unexpected error, closing socket connection and attempting reconnect java.net.ConnectException: Connection refused: no further information
   [junit4]   2> 	at sun.nio.ch.SocketChannelImpl.checkConnect(Native Method)
   [junit4]   2> 	at sun.nio.ch.SocketChannelImpl.finishConnect(SocketChannelImpl.java:712)
   [junit4]   2> 	at org.apache.zookeeper.ClientCnxnSocketNIO.doTransport(ClientCnxnSocketNIO.java:350)
   [junit4]   2> 	at org.apache.zookeeper.ClientCnxn$SendThread.run(ClientCnxn.java:1068)
   [junit4]   2> 
   [junit4]   2> 868626 T3026 oaz.ClientCnxn$SendThread.run WARN Session 0x0 for server null, unexpected error, closing socket connection and attempting reconnect java.net.ConnectException: Connection refused: no further information
   [junit4]   2> 	at sun.nio.ch.SocketChannelImpl.checkConnect(Native Method)
   [junit4]   2> 	at sun.nio.ch.SocketChannelImpl.finishConnect(SocketChannelImpl.java:712)
   [junit4]   2> 	at org.apache.zookeeper.ClientCnxnSocketNIO.doTransport(ClientCnxnSocketNIO.java:350)
   [junit4]   2> 	at org.apache.zookeeper.ClientCnxn$SendThread.run(ClientCnxn.java:1068)
   [junit4]   2> 
   [junit4]   2> 870893 T3026 oaz.ClientCnxn$SendThread.run WARN Session 0x0 for server null, unexpected error, closing socket connection and attempting reconnect java.net.ConnectException: Connection refused: no further information
   [junit4]   2> 	at sun.nio.ch.SocketChannelImpl.checkConnect(Native Method)
   [junit4]   2> 	at sun.nio.ch.SocketChannelImpl.finishConnect(SocketChannelImpl.java:712)
   [junit4]   2> 	at org.apache.zookeeper.ClientCnxnSocketNIO.doTransport(ClientCnxnSocketNIO.java:350)
   [junit4]   2> 	at org.apache.zookeeper.ClientCnxn$SendThread.run(ClientCnxn.java:1068)
   [junit4]   2> 
   [junit4]   2> 873163 T3026 oaz.ClientCnxn$SendThread.run WARN Session 0x0 for server null, unexpected error, closing socket connection and attempting reconnect java.net.ConnectException: Connection refused: no further information
   [junit4]   2> 	at sun.nio.ch.SocketChannelImpl.checkConnect(Native Method)
   [junit4]   2> 	at sun.nio.ch.SocketChannelImpl.finishConnect(SocketChannelImpl.java:712)
   [junit4]   2> 	at org.apache.zookeeper.ClientCnxnSocketNIO.doTransport(ClientCnxnSocketNIO.java:350)
   [junit4]   2> 	at org.apache.zookeeper.ClientCnxn$SendThread.run(ClientCnxn.java:1068)
   [junit4]   2> 
   [junit4]   2> 875419 T3026 oaz.ClientCnxn$SendThread.run WARN Session 0x0 for server null, unexpected error, closing socket connection and attempting reconnect java.net.ConnectException: Connection refused: no further information
   [junit4]   2> 	at sun.nio.ch.SocketChannelImpl.checkConnect(Native Method)
   [junit4]   2> 	at sun.nio.ch.SocketChannelImpl.finishConnect(SocketChannelImpl.java:712)
   [junit4]   2> 	at org.apache.zookeeper.ClientCnxnSocketNIO.doTransport(ClientCnxnSocketNIO.java:350)
   [junit4]   2> 	at org.apache.zookeeper.ClientCnxn$SendThread.run(ClientCnxn.java:1068)
   [junit4]   2> 
   [junit4]   2> 877775 T3016 oass.SolrDispatchFilter.init ERROR Could not start Solr. Check solr/home property and the logs
   [junit4]   2> 877778 T3016 oasc.SolrException.log ERROR null:org.apache.solr.common.SolrException: java.util.concurrent.TimeoutException: Could not connect to ZooKeeper 127.0.0.1:53964/solr within 30000 ms
   [junit4]   2> 		at org.apache.solr.common.cloud.SolrZkClient.<init>(SolrZkClient.java:150)
   [junit4]   2> 		at org.apache.solr.common.cloud.SolrZkClient.<init>(SolrZkClient.java:101)
   [junit4]   2> 		at org.apache.solr.common.cloud.SolrZkClient.<init>(SolrZkClient.java:96)
   [junit4]   2> 		at org.apache.solr.common.cloud.SolrZkClient.<init>(SolrZkClient.java:83)
   [junit4]   2> 		at org.apache.solr.servlet.SolrDispatchFilter.loadConfigSolr(SolrDispatchFilter.java:174)
   [junit4]   2> 		at org.apache.solr.servlet.SolrDispatchFilter.createCoreContainer(SolrDispatchFilter.java:197)
   [junit4]   2> 		at org.apache.solr.servlet.SolrDispatchFilter.init(SolrDispatchFilter.java:146)
   [junit4]   2> 		at org.eclipse.jetty.servlet.FilterHolder.doStart(FilterHolder.java:119)
   [junit4]   2> 		at org.eclipse.jetty.util.component.AbstractLifeCycle.start(AbstractLifeCycle.java:64)
   [junit4]   2> 		at org.eclipse.jetty.servlet.ServletHandler.initialize(ServletHandler.java:719)
   [junit4]   2> 		at org.eclipse.jetty.servlet.ServletHandler.updateMappings(ServletHandler.java:1309)
   [junit4]   2> 		at org.eclipse.jetty.servlet.ServletHandler.setFilterMappings(ServletHandler.java:1345)
   [junit4]   2> 		at org.eclipse.jetty.servlet.ServletHandler.addFilterMapping(ServletHandler.java:1085)
   [junit4]   2> 		at org.eclipse.jetty.servlet.ServletHandler.addFilterWithMapping(ServletHandler.java:931)
   [junit4]   2> 		at org.eclipse.jetty.servlet.ServletHandler.addFilterWithMapping(ServletHandler.java:888)
   [junit4]   2> 		at org.eclipse.jetty.servlet.ServletContextHandler.addFilter(ServletContextHandler.java:340)
   [junit4]   2> 		at org.apache.solr.client.solrj.embedded.JettySolrRunner$1.lifeCycleStarted(JettySolrRunner.java:325)
   [junit4]   2> 		at org.eclipse.jetty.util.component.AbstractLifeCycle.setStarted(AbstractLifeCycle.java:174)
   [junit4]   2> 		at org.eclipse.jetty.util.component.AbstractLifeCycle.start(AbstractLifeCycle.java:65)
   [junit4]   2> 		at org.apache.solr.client.solrj.embedded.JettySolrRunner.start(JettySolrRunner.java:430)
   [junit4]   2> 		at org.apache.solr.client.solrj.embedded.JettySolrRunner.start(JettySolrRunner.java:403)
   [junit4]   2> 		at org.apache.solr.BaseDistributedSearchTestCase.createJetty(BaseDistributedSearchTestCase.java:378)
   [junit4]   2> 		at org.apache.solr.BaseDistributedSearchTestCase.createJetty(BaseDistributedSearchTestCase.java:364)
   [junit4]   2> 		at org.apache.solr.BaseDistributedSearchTestCase.createServers(BaseDistributedSearchTestCase.java:297)
   [junit4]   2> 		at org.apache.solr.BaseDistributedSearchTestCase.testDistribSearch(BaseDistributedSearchTestCase.java:874)
   [junit4]   2> 		at sun.reflect.NativeMethodAccessorImpl.invoke0(Native Method)
   [junit4]   2> 		at sun.reflect.NativeMethodAccessorImpl.invoke(NativeMethodAccessorImpl.java:62)
   [junit4]   2> 		at sun.reflect.DelegatingMethodAccessorImpl.invoke(DelegatingMethodAccessorImpl.java:43)
   [junit4]   2> 		at java.lang.reflect.Method.invoke(Method.java:483)
   [junit4]   2> 		at com.carrotsearch.randomizedtesting.RandomizedRunner.invoke(RandomizedRunner.java:1617)
   [junit4]   2> 		at com.carrotsearch.randomizedtesting.RandomizedRunner$6.evaluate(RandomizedRunner.java:826)
   [junit4]   2> 		at com.carrotsearch.randomizedtesting.RandomizedRunner$7.evaluate(RandomizedRunner.java:862)
   [junit4]   2> 		at com.carrotsearch.randomizedtesting.RandomizedRunner$8.evaluate(RandomizedRunner.java:876)
   [junit4]   2> 		at com.carrotsearch.randomizedtesting.rules.SystemPropertiesRestoreRule$1.evaluate(SystemPropertiesRestoreRule.java:53)
   [junit4]   2> 		at org.apache.lucene.util.TestRuleSetupTeardownChained$1.evaluate(TestRuleSetupTeardownChained.java:50)
   [junit4]   2> 		at org.apache.lucene.util.TestRuleFieldCacheSanity$1.evaluate(TestRuleFieldCacheSanity.java:51)
   [junit4]   2> 		at org.apache.lucene.util.AbstractBeforeAfterRule$1.evaluate(AbstractBeforeAfterRule.java:46)
   [junit4]   2> 		at com.carrotsearch.randomizedtesting.rules.SystemPropertiesInvariantRule$1.evaluate(SystemPropertiesInvariantRule.java:55)
   [junit4]   2> 		at org.apache.lucene.util.TestRuleThreadAndTestName$1.evaluate(TestRuleThreadAndTestName.java:49)
   [junit4]   2> 		at org.apache.lucene.util.TestRuleIgnoreAfterMaxFailures$1.evaluate(TestRuleIgnoreAfterMaxFailures.java:70)
   [junit4]   2> 		at org.apache.lucene.util.TestRuleMarkFailure$1.evaluate(TestRuleMarkFailure.java:48)
   [junit4]   2> 		at com.carrotsearch.randomizedtesting.rules.StatementAdapter.evaluate(StatementAdapter.java:36)
   [junit4]   2> 		at com.carrotsearch.randomizedtesting.ThreadLeakControl$StatementRunner.run(ThreadLeakControl.java:359)
   [junit4]   2> 		at com.carrotsearch.randomizedtesting.ThreadLeakControl.forkTimeoutingTask(ThreadLeakControl.java:783)
   [junit4]   2> 		at com.carrotsearch.randomizedtesting.ThreadLeakControl$3.evaluate(ThreadLeakControl.java:443)
   [junit4]   2> 		at com.carrotsearch.randomizedtesting.RandomizedRunner.runSingleTest(RandomizedRunner.java:835)
   [junit4]   2> 		at com.carrotsearch.randomizedtesting.RandomizedRunner$3.evaluate(RandomizedRunner.java:737)
   [junit4]   2> 		at com.carrotsearch.randomizedtesting.RandomizedRunner$4.evaluate(RandomizedRunner.java:771)
   [junit4]   2> 		at com.carrotsearch.randomizedtesting.RandomizedRunner$5.evaluate(RandomizedRunner.java:782)
   [junit4]   2> 		at com.carrotsearch.randomizedtesting.rules.StatementAdapter.evaluate(StatementAdapter.java:36)
   [junit4]   2> 		at com.carrotsearch.randomizedtesting.rules.SystemPropertiesRestoreRule$1.evaluate(SystemPropertiesRestoreRule.java:53)
   [junit4]   2> 		at org.apache.lucene.util.AbstractBeforeAfterRule$1.evaluate(AbstractBeforeAfterRule.java:46)
   [junit4]   2> 		at org.apache.lucene.util.TestRuleStoreClassName$1.evaluate(TestRuleStoreClassName.java:42)
   [junit4]   2> 		at com.carrotsearch.randomizedtesting.rules.SystemPropertiesInvariantRule$1.evaluate(SystemPropertiesInvariantRule.java:55)
   [junit4]   2> 		at com.carrotsearch.randomizedtesting.rules.NoShadowingOrOverridesOnMethodsRule$1.evaluate(NoShadowingOrOverridesOnMethodsRule.java:39)
   [junit4]   2> 		at com.carrotsearch.randomizedtesting.rules.NoShadowingOrOverridesOnMethodsRule$1.evaluate(NoShadowingOrOverridesOnMethodsRule.java:39)
   [junit4]   2> 		at com.carrotsearch.randomizedtesting.rules.StatementAdapter.evaluate(StatementAdapter.java:36)
   [junit4]   2> 		at org.apache.lucene.util.TestRuleAssertionsRequired$1.evaluate(TestRuleAssertionsRequired.java:43)
   [junit4]   2> 		at org.apache.lucene.util.TestRuleMarkFailure$1.evaluate(TestRuleMarkFailure.java:48)
   [junit4]   2> 		at org.apache.lucene.util.TestRuleIgnoreAfterMaxFailures$1.evaluate(TestRuleIgnoreAfterMaxFailures.java:70)
   [junit4]   2> 		at org.apache.lucene.util.TestRuleIgnoreTestSuites$1.evaluate(TestRuleIgnoreTestSuites.java:55)
   [junit4]   2> 		at com.carrotsearch.randomizedtesting.rules.StatementAdapter.evaluate(StatementAdapter.java:36)
   [junit4]   2> 		at com.carrotsearch.randomizedtesting.ThreadLeakControl$StatementRunner.run(ThreadLeakControl.java:359)
   [junit4]   2> 		at java.lang.Thread.run(Thread.java:744)
   [junit4]   2> 	Caused by: java.util.concurrent.TimeoutException: Could not connect to ZooKeeper 127.0.0.1:53964/solr within 30000 ms
   [junit4]   2> 		at org.apache.solr.common.cloud.ConnectionManager.waitForConnected(ConnectionManager.java:223)
   [junit4]   2> 		at org.apache.solr.common.cloud.SolrZkClient.<init>(SolrZkClient.java:142)
   [junit4]   2> 		... 63 more
   [junit4]   2> 	
   [junit4]   2> 877778 T3016 oass.SolrDispatchFilter.init SolrDispatchFilter.init() done
   [junit4]   2> 877785 T3016 oejs.Server.doStart jetty-8.1.10.v20130312
   [junit4]   2> 877798 T3016 oejs.AbstractConnector.doStart Started SelectChannelConnector@127.0.0.1:54092
   [junit4]   2> 877800 T3016 oass.SolrDispatchFilter.init SolrDispatchFilter.init()
   [junit4]   2> 877801 T3016 oasc.SolrResourceLoader.locateSolrHome JNDI not configured for solr (NoInitialContextEx)
   [junit4]   2> 877802 T3016 oasc.SolrResourceLoader.locateSolrHome using system property solr.solr.home: C:\Users\JenkinsSlave\workspace\Lucene-Solr-4.x-Windows\solr\core\src\test-files\solr
   [junit4]   2> 877803 T3016 oasc.SolrResourceLoader.<init> new SolrResourceLoader for directory: 'C:\Users\JenkinsSlave\workspace\Lucene-Solr-4.x-Windows\solr\core\src\test-files\solr\'
   [junit4]   2> 877850 T3016 oass.SolrDispatchFilter.loadConfigSolr Trying to read solr.xml from 127.0.0.1:53964/solr
   [junit4]   2> 877852 T3016 oascc.ConnectionManager.waitForConnected Waiting for client to connect to ZooKeeper
   [junit4]   2> 878858 T3037 oaz.ClientCnxn$SendThread.run WARN Session 0x0 for server null, unexpected error, closing socket connection and attempting reconnect java.net.ConnectException: Connection refused: no further information
   [junit4]   2> 	at sun.nio.ch.SocketChannelImpl.checkConnect(Native Method)
   [junit4]   2> 	at sun.nio.ch.SocketChannelImpl.finishConnect(SocketChannelImpl.java:712)
   [junit4]   2> 	at org.apache.zookeeper.ClientCnxnSocketNIO.doTransport(ClientCnxnSocketNIO.java:350)
   [junit4]   2> 	at org.apache.zookeeper.ClientCnxn$SendThread.run(ClientCnxn.java:1068)
   [junit4]   2> 
   [junit4]   2> 880966 T3037 oaz.ClientCnxn$SendThread.run WARN Session 0x0 for server null, unexpected error, closing socket connection and attempting reconnect java.net.ConnectException: Connection refused: no further information
   [junit4]   2> 	at sun.nio.ch.SocketChannelImpl.checkConnect(Native Method)
   [junit4]   2> 	at sun.nio.ch.SocketChannelImpl.finishConnect(SocketChannelImpl.java:712)
   [junit4]   2> 	at org.apache.zookeeper.ClientCnxnSocketNIO.doTransport(ClientCnxnSocketNIO.java:350)
   [junit4]   2> 	at org.apache.zookeeper.ClientCnxn$SendThread.run(ClientCnxn.java:1068)
   [junit4]   2> 
   [junit4]   2> 883068 T3037 oaz.ClientCnxn$SendThread.run WARN Session 0x0 for server null, unexpected error, closing socket connection and attempting reconnect java.net.ConnectException: Connection refused: no further information
   [junit4]   2> 	at sun.nio.ch.SocketChannelImpl.checkConnect(Native Method)
   [junit4]   2> 	at sun.nio.ch.SocketChannelImpl.finishConnect(SocketChannelImpl.java:712)
   [junit4]   2> 	at org.apache.zookeeper.ClientCnxnSocketNIO.doTransport(ClientCnxnSocketNIO.java:350)
   [junit4]   2> 	at org.apache.zookeeper.ClientCnxn$SendThread.run(ClientCnxn.java:1068)
   [junit4]   2> 
   [junit4]   2> 885172 T3037 oaz.ClientCnxn$SendThread.run WARN Session 0x0 for server null, unexpected error, closing socket connection and attempting reconnect java.net.ConnectException: Connection refused: no further information
   [junit4]   2> 	at sun.nio.ch.SocketChannelImpl.checkConnect(Native Method)
   [junit4]   2> 	at sun.nio.ch.SocketChannelImpl.finishConnect(SocketChannelImpl.java:712)
   [junit4]   2> 	at org.apache.zookeeper.ClientCnxnSocketNIO.doTransport(ClientCnxnSocketNIO.java:350)
   [junit4]   2> 	at org.apache.zookeeper.ClientCnxn$SendThread.run(ClientCnxn.java:1068)
   [junit4]   2> 
   [junit4]   2> 887278 T3037 oaz.ClientCnxn$SendThread.run WARN Session 0x0 for server null, unexpected error, closing socket connection and attempting reconnect java.net.ConnectException: Connection refused: no further information
   [junit4]   2> 	at sun.nio.ch.SocketChannelImpl.checkConnect(Native Method)
   [junit4]   2> 	at sun.nio.ch.SocketChannelImpl.finishConnect(SocketChannelImpl.java:712)
   [junit4]   2> 	at org.apache.zookeeper.ClientCnxnSocketNIO.doTransport(ClientCnxnSocketNIO.java:350)
   [junit4]   2> 	at org.apache.zookeeper.ClientCnxn$SendThread.run(ClientCnxn.java:1068)
   [junit4]   2> 
   [junit4]   2> 889382 T3037 oaz.ClientCnxn$SendThread.run WARN Session 0x0 for server null, unexpected error, closing socket connection and attempting reconnect java.net.ConnectException: Connection refused: no further information
   [junit4]   2> 	at sun.nio.ch.SocketChannelImpl.checkConnect(Native Method)
   [junit4]   2> 	at sun.nio.ch.SocketChannelImpl.finishConnect(SocketChannelImpl.java:712)
   [junit4]   2> 	at org.apache.zookeeper.ClientCnxnSocketNIO.doTransport(ClientCnxnSocketNIO.java:350)
   [junit4]   2> 	at org.apache.zookeeper.ClientCnxn$SendThread.run(ClientCnxn.java:1068)
   [junit4]   2> 
   [junit4]   2> 891485 T3037 oaz.ClientCnxn$SendThread.run WARN Session 0x0 for server null, unexpected error, closing socket connection and attempting reconnect java.net.ConnectException: Connection refused: no further information
   [junit4]   2> 	at sun.nio.ch.SocketChannelImpl.checkConnect(Native Method)
   [junit4]   2> 	at sun.nio.ch.SocketChannelImpl.finishConnect(SocketChannelImpl.java:712)
   [junit4]   2> 	at org.apache.zookeeper.ClientCnxnSocketNIO.doTransport(ClientCnxnSocketNIO.java:350)
   [junit4]   2> 	at org.apache.zookeeper.ClientCnxn$SendThread.run(ClientCnxn.java:1068)
   [junit4]   2> 
   [junit4]   2> 893599 T3037 oaz.ClientCnxn$SendThread.run WARN Session 0x0 for server null, unexpected error, closing socket connection and attempting reconnect java.net.ConnectException: Connection refused: no further information
   [junit4]   2> 	at sun.nio.ch.SocketChannelImpl.checkConnect(Native Method)
   [junit4]   2> 	at sun.nio.ch.SocketChannelImpl.finishConnect(SocketChannelImpl.java:712)
   [junit4]   2> 	at org.apache.zookeeper.ClientCnxnSocketNIO.doTransport(ClientCnxnSocketNIO.java:350)
   [junit4]   2> 	at org.apache.zookeeper.ClientCnxn$SendThread.run(ClientCnxn.java:1068)
   [junit4]   2> 
   [junit4]   2> 895703 T3037 oaz.ClientCnxn$SendThread.run WARN Session 0x0 for server null, unexpected error, closing socket connection and attempting reconnect java.net.ConnectException: Connection refused: no further information
   [junit4]   2> 	at sun.nio.ch.SocketChannelImpl.checkConnect(Native Method)
   [junit4]   2> 	at sun.nio.ch.SocketChannelImpl.finishConnect(SocketChannelImpl.java:712)
   [junit4]   2> 	at org.apache.zookeeper.ClientCnxnSocketNIO.doTransport(ClientCnxnSocketNIO.java:350)
   [junit4]   2> 	at org.apache.zookeeper.ClientCnxn$SendThread.run(ClientCnxn.java:1068)
   [junit4]   2> 
   [junit4]   2> 897805 T3037 oaz.ClientCnxn$SendThread.run WARN Session 0x0 for server null, unexpected error, closing socket connection and attempting reconnect java.net.ConnectException: Connection refused: no further information
   [junit4]   2> 	at sun.nio.ch.SocketChannelImpl.checkConnect(Native Method)
   [junit4]   2> 	at sun.nio.ch.SocketChannelImpl.finishConnect(SocketChannelImpl.java:712)
   [junit4]   2> 	at org.apache.zookeeper.ClientCnxnSocketNIO.doTransport(ClientCnxnSocketNIO.java:350)
   [junit4]   2> 	at org.apache.zookeeper.ClientCnxn$SendThread.run(ClientCnxn.java:1068)
   [junit4]   2> 
   [junit4]   2> 899919 T3037 oaz.ClientCnxn$SendThread.run WARN Session 0x0 for server null, unexpected error, closing socket connection and attempting reconnect java.net.ConnectException: Connection refused: no further information
   [junit4]   2> 	at sun.nio.ch.SocketChannelImpl.checkConnect(Native Method)
   [junit4]   2> 	at sun.nio.ch.SocketChannelImpl.finishConnect(SocketChannelImpl.java:712)
   [junit4]   2> 	at org.apache.zookeeper.ClientCnxnSocketNIO.doTransport(ClientCnxnSocketNIO.java:350)
   [junit4]   2> 	at org.apache.zookeeper.ClientCnxn$SendThread.run(ClientCnxn.java:1068)
   [junit4]   2> 
   [junit4]   2> 902020 T3037 oaz.ClientCnxn$SendThread.run WARN Session 0x0 for server null, unexpected error, closing socket connection and attempting reconnect java.net.ConnectException: Connection refused: no further information
   [junit4]   2> 	at sun.nio.ch.SocketChannelImpl.checkConnect(Native Method)
   [junit4]   2> 	at sun.nio.ch.SocketChannelImpl.finishConnect(SocketChannelImpl.java:712)
   [junit4]   2> 	at org.apache.zookeeper.ClientCnxnSocketNIO.doTransport(ClientCnxnSocketNIO.java:350)
   [junit4]   2> 	at org.apache.zookeeper.ClientCnxn$SendThread.run(ClientCnxn.java:1068)
   [junit4]   2> 
   [junit4]   2> 904135 T3037 oaz.ClientCnxn$SendThread.run WARN Session 0x0 for server null, unexpected error, closing socket connection and attempting reconnect java.net.ConnectException: Connection refused: no further information
   [junit4]   2> 	at sun.nio.ch.SocketChannelImpl.checkConnect(Native Method)
   [junit4]   2> 	at sun.nio.ch.SocketChannelImpl.finishConnect(SocketChannelImpl.java:712)
   [junit4]   2> 	at org.apache.zookeeper.ClientCnxnSocketNIO.doTransport(ClientCnxnSocketNIO.java:350)
   [junit4]   2> 	at org.apache.zookeeper.ClientCnxn$SendThread.run(ClientCnxn.java:1068)
   [junit4]   2> 
   [junit4]   2> 906249 T3037 oaz.ClientCnxn$SendThread.run WARN Session 0x0 for server null, unexpected error, closing socket connection and attempting reconnect java.net.ConnectException: Connection refused: no further information
   [junit4]   2> 	at sun.nio.ch.SocketChannelImpl.checkConnect(Native Method)
   [junit4]   2> 	at sun.nio.ch.SocketChannelImpl.finishConnect(SocketChannelImpl.java:712)
   [junit4]   2> 	at org.apache.zookeeper.ClientCnxnSocketNIO.doTransport(ClientCnxnSocketNIO.java:350)
   [junit4]   2> 	at org.apache.zookeeper.ClientCnxn$SendThread.run(ClientCnxn.java:1068)
   [junit4]   2> 
   [junit4]   2> 908454 T3016 oass.SolrDispatchFilter.init ERROR Could not start Solr. Check solr/home property and the logs
   [junit4]   2> 908455 T3016 oasc.SolrException.log ERROR null:org.apache.solr.common.SolrException: java.util.concurrent.TimeoutException: Could not connect to ZooKeeper 127.0.0.1:53964/solr within 30000 ms
   [junit4]   2> 		at org.apache.solr.common.cloud.SolrZkClient.<init>(SolrZkClient.java:150)
   [junit4]   2> 		at org.apache.solr.common.cloud.SolrZkClient.<init>(SolrZkClient.java:101)
   [junit4]   2> 		at org.apache.solr.common.cloud.SolrZkClient.<init>(SolrZkClient.java:96)
   [junit4]   2> 		at org.apache.solr.common.cloud.SolrZkClient.<init>(SolrZkClient.java:83)
   [junit4]   2> 		at org.apache.solr.servlet.SolrDispatchFilter.loadConfigSolr(SolrDispatchFilter.java:174)
   [junit4]   2> 		at org.apache.solr.servlet.SolrDispatchFilter.createCoreContainer(SolrDispatchFilter.java:197)
   [junit4]   2> 		at org.apache.solr.servlet.SolrDispatchFilter.init(SolrDispatchFilter.java:146)
   [junit4]   2> 		at org.eclipse.jetty.servlet.FilterHolder.doStart(FilterHolder.java:119)
   [junit4]   2> 		at org.eclipse.jetty.util.component.AbstractLifeCycle.start(AbstractLifeCycle.java:64)
   [junit4]   2> 		at org.eclipse.jetty.servlet.ServletHandler.initialize(ServletHandler.java:719)
   [junit4]   2> 		at org.eclipse.jetty.servlet.ServletHandler.updateMappings(ServletHandler.java:1309)
   [junit4]   2> 		at org.eclipse.jetty.servlet.ServletHandler.setFilterMappings(ServletHandler.java:1345)
   [junit4]   2> 		at org.eclipse.jetty.servlet.ServletHandler.addFilterMapping(ServletHandler.java:1085)
   [junit4]   2> 		at org.eclipse.jetty.servlet.ServletHandler.addFilterWithMapping(ServletHandler.java:931)
   [junit4]   2> 		at org.eclipse.jetty.servlet.ServletHandler.addFilterWithMapping(ServletHandler.java:888)
   [junit4]   2> 		at org.eclipse.jetty.servlet.ServletContextHandler.addFilter(ServletContextHandler.java:340)
   [junit4]   2> 		at org.apache.solr.client.solrj.embedded.JettySolrRunner$1.lifeCycleStarted(JettySolrRunner.java:325)
   [junit4]   2> 		at org.eclipse.jetty.util.component.AbstractLifeCycle.setStarted(AbstractLifeCycle.java:174)
   [junit4]   2> 		at org.eclipse.jetty.util.component.AbstractLifeCycle.start(AbstractLifeCycle.java:65)
   [junit4]   2> 		at org.apache.solr.client.solrj.embedded.JettySolrRunner.start(JettySolrRunner.java:430)
   [junit4]   2> 		at org.apache.solr.client.solrj.embedded.JettySolrRunner.start(JettySolrRunner.java:403)
   [junit4]   2> 		at org.apache.solr.BaseDistributedSearchTestCase.createJetty(BaseDistributedSearchTestCase.java:378)
   [junit4]   2> 		at org.apache.solr.BaseDistributedSearchTestCase.createJetty(BaseDistributedSearchTestCase.java:364)
   [junit4]   2> 		at org.apache.solr.BaseDistributedSearchTestCase.createServers(BaseDistributedSearchTestCase.java:305)
   [junit4]   2> 		at org.apache.solr.BaseDistributedSearchTestCase.testDistribSearch(BaseDistributedSearchTestCase.java:874)
   [junit4]   2> 		at sun.reflect.NativeMethodAccessorImpl.invoke0(Native Method)
   [junit4]   2> 		at sun.reflect.NativeMethodAccessorImpl.invoke(NativeMethodAccessorImpl.java:62)
   [junit4]   2> 		at sun.reflect.DelegatingMethodAccessorImpl.invoke(DelegatingMethodAccessorImpl.java:43)
   [junit4]   2> 		at java.lang.reflect.Method.invoke(Method.java:483)
   [junit4]   2> 		at com.carrotsearch.randomizedtesting.RandomizedRunner.invoke(RandomizedRunner.java:1617)
   [junit4]   2> 		at com.carrotsearch.randomizedtesting.RandomizedRunner$6.evaluate(RandomizedRunner.java:826)
   [junit4]   2> 		at com.carrotsearch.randomizedtesting.RandomizedRunner$7.evaluate(RandomizedRunner.java:862)
   [junit4]   2> 		at com.carrotsearch.randomizedtesting.RandomizedRunner$8.evaluate(RandomizedRunner.java:876)
   [junit4]   2> 		at com.carrotsearch.randomizedtesting.rules.SystemPropertiesRestoreRule$1.evaluate(SystemPropertiesRestoreRule.java:53)
   [junit4]   2> 		at org.apache.lucene.util.TestRuleSetupTeardownChained$1.evaluate(TestRuleSetupTeardownChained.java:50)
   [junit4]   2> 		at org.apache.lucene.util.TestRuleFieldCacheSanity$1.evaluate(TestRuleFieldCacheSanity.java:51)
   [junit4]   2> 		at org.apache.lucene.util.AbstractBeforeAfterRule$1.evaluate(AbstractBeforeAfterRule.java:46)
   [junit4]   2> 		at com.carrotsearch.randomizedtesting.rules.SystemPropertiesInvariantRule$1.evaluate(SystemPropertiesInvariantRule.java:55)
   [junit4]   2> 		at org.apache.lucene.util.TestRuleThreadAndTestName$1.evaluate(TestRuleThreadAndTestName.java:49)
   [junit4]   2> 		at org.apache.lucene.util.TestRuleIgnoreAfterMaxFailures$1.evaluate(TestRuleIgnoreAfterMaxFailures.java:70)
   [junit4]   2> 		at org.apache.lucene.util.TestRuleMarkFailure$1.evaluate(TestRuleMarkFailure.java:48)
   [junit4]   2> 		at com.carrotsearch.randomizedtesting.rules.StatementAdapter.evaluate(StatementAdapter.java:36)
   [junit4]   2> 		at com.carrotsearch.randomizedtesting.ThreadLeakControl$StatementRunner.run(ThreadLeakControl.java:359)
   [junit4]   2> 		at com.carrotsearch.randomizedtesting.ThreadLeakControl.forkTimeoutingTask(ThreadLeakControl.java:783)
   [junit4]   2> 		at com.carrotsearch.randomizedtesting.ThreadLeakControl$3.evaluate(ThreadLeakControl.java:443)
   [junit4]   2> 		at com.carrotsearch.randomizedtesting.RandomizedRunner.runSingleTest(RandomizedRunner.java:835)
   [junit4]   2> 		at com.carrotsearch.randomizedtesting.RandomizedRunner$3.evaluate(RandomizedRunner.java:737)
   [junit4]   2> 		at com.carrotsearch.randomizedtesting.RandomizedRunner$4.evaluate(RandomizedRunner.java:771)
   [junit4]   2> 		at com.carrotsearch.randomizedtesting.RandomizedRunner$5.evaluate(RandomizedRunner.java:782)
   [junit4]   2> 		at com.carrotsearch.randomizedtesting.rules.StatementAdapter.evaluate(StatementAdapter.java:36)
   [junit4]   2> 		at com.carrotsearch.randomizedtesting.rules.SystemPropertiesRestoreRule$1.evaluate(SystemPropertiesRestoreRule.java:53)
   [junit4]   2> 		at org.apache.lucene.util.AbstractBeforeAfterRule$1.evaluate(AbstractBeforeAfterRule.java:46)
   [junit4]   2> 		at org.apache.lucene.util.TestRuleStoreClassName$1.evaluate(TestRuleStoreClassName.java:42)
   [junit4]   2> 		at com.carrotsearch.randomizedtesting.rules.SystemPropertiesInvariantRule$1.evaluate(SystemPropertiesInvariantRule.java:55)
   [junit4]   2> 		at com.carrotsearch.randomizedtesting.rules.NoShadowingOrOverridesOnMethodsRule$1.evaluate(NoShadowingOrOverridesOnMethodsRule.java:39)
   [junit4]   2> 		at com.carrotsearch.randomizedtesting.rules.NoShadowingOrOverridesOnMethodsRule$1.evaluate(NoShadowingOrOverridesOnMethodsRule.java:39)
   [junit4]   2> 		at com.carrotsearch.randomizedtesting.rules.StatementAdapter.evaluate(StatementAdapter.java:36)
   [junit4]   2> 		at org.apache.lucene.util.TestRuleAssertionsRequired$1.evaluate(TestRuleAssertionsRequired.java:43)
   [junit4]   2> 		at org.apache.lucene.util.TestRuleMarkFailure$1.evaluate(TestRuleMarkFailure.java:48)
   [junit4]   2> 		at org.apache.lucene.util.TestRuleIgnoreAfterMaxFailures$1.evaluate(TestRuleIgnoreAfterMaxFailures.java:70)
   [junit4]   2> 		at org.apache.lucene.util.TestRuleIgnoreTestSuites$1.evaluate(TestRuleIgnoreTestSuites.java:55)
   [junit4]   2> 		at com.carrotsearch.randomizedtesting.rules.StatementAdapter.evaluate(StatementAdapter.java:36)
   [junit4]   2> 		at com.carrotsearch.randomizedtesting.ThreadLeakControl$StatementRunner.run(ThreadLeakControl.java:359)
   [junit4]   2> 		at java.lang.Thread.run(Thread.java:744)
   [junit4]   2> 	Caused by: java.util.concurrent.TimeoutException: Could not connect to ZooKeeper 127.0.0.1:53964/solr within 30000 ms
   [junit4]   2> 		at org.apache.solr.common.cloud.ConnectionManager.waitForConnected(ConnectionManager.java:223)
   [junit4]   2> 		at org.apache.solr.common.cloud.SolrZkClient.<init>(SolrZkClient.java:142)
   [junit4]   2> 		... 63 more
   [junit4]   2> 	
   [junit4]   2> 908458 T3016 oass.SolrDispatchFilter.init SolrDispatchFilter.init() done
   [junit4]   2> 908473 T3016 oejsh.ContextHandler.doStop stopped o.e.j.s.ServletContextHandler{/ve/lp,null}
   [junit4]   2> 908539 T3016 oejsh.ContextHandler.doStop stopped o.e.j.s.ServletContextHandler{/ve/lp,null}
   [junit4]   2> 908594 T3016 oas.SolrTestCaseJ4.tearDown ###Ending testDistribSearch
   [junit4]   2> NOTE: reproduce with: ant test  -Dtestcase=DistributedSpellCheckComponentTest -Dtests.method=testDistribSearch -Dtests.seed=5A9179BE0A4E8A74 -Dtests.slow=true -Dtests.locale=zh_SG -Dtests.timezone=Africa/Brazzaville -Dtests.file.encoding=US-ASCII
   [junit4] ERROR   60.9s | DistributedSpellCheckComponentTest.testDistribSearch <<<
   [junit4]    > Throwable #1: org.apache.solr.client.solrj.impl.HttpSolrServer$RemoteSolrException: Expected mime type application/octet-stream but got text/html. <html>
   [junit4]    > <head>
   [junit4]    > <meta http-equiv="Content-Type" content="text/html;charset=ISO-8859-1"/>
   [junit4]    > <title>Error 503 Server is shutting down or failed to initialize</title>
   [junit4]    > </head>
   [junit4]    > <body>
   [junit4]    > <h2>HTTP ERROR: 503</h2>
   [junit4]    > <p>Problem accessing /ve/lp/update. Reason:
   [junit4]    > <pre>    Server is shutting down or failed to initialize</pre></p>
   [junit4]    > <hr /><i><small>Powered by Jetty://</small></i>
   [junit4]    >                                                 
   [junit4]    >                                                 
   [junit4]    >                                                 
   [junit4]    >                                                 
   [junit4]    >                                                 
   [junit4]    >                                                 
   [junit4]    >                                                 
   [junit4]    >                                                 
   [junit4]    >                                                 
   [junit4]    >                                                 
   [junit4]    >                                                 
   [junit4]    >                                                 
   [junit4]    >                                                 
   [junit4]    >                                                 
   [junit4]    >                                                 
   [junit4]    >                                                 
   [junit4]    >                                                 
   [junit4]    >                                                 
   [junit4]    >                                                 
   [junit4]    >                                                 
   [junit4]    > </body>
   [junit4]    > </html>
   [junit4]    > 	at __randomizedtesting.SeedInfo.seed([5A9179BE0A4E8A74:DB77F7A67D11EA48]:0)
   [junit4]    > 	at org.apache.solr.client.solrj.impl.HttpSolrServer.executeMethod(HttpSolrServer.java:466)
   [junit4]    > 	at org.apache.solr.client.solrj.impl.HttpSolrServer.request(HttpSolrServer.java:203)
   [junit4]    > 	at org.apache.solr.client.solrj.impl.HttpSolrServer.request(HttpSolrServer.java:199)
   [junit4]    > 	at org.apache.solr.client.solrj.request.AbstractUpdateRequest.process(AbstractUpdateRequest.java:118)
   [junit4]    > 	at org.apache.solr.client.solrj.SolrServer.deleteByQuery(SolrServer.java:285)
   [junit4]    > 	at org.apache.solr.client.solrj.SolrServer.deleteByQuery(SolrServer.java:271)
   [junit4]    > 	at org.apache.solr.BaseDistributedSearchTestCase.del(BaseDistributedSearchTestCase.java:498)
   [junit4]    > 	at org.apache.solr.handler.component.DistributedSpellCheckComponentTest.doTest(DistributedSpellCheckComponentTest.java:99)
   [junit4]    > 	at org.apache.solr.BaseDistributedSearchTestCase.testDistribSearch(BaseDistributedSearchTestCase.java:876)
   [junit4]    > 	at java.lang.Thread.run(Thread.java:744)
   [junit4]   2> 908603 T3016 oas.SolrTestCaseJ4.deleteCore ###deleteCore
   [junit4]   2> NOTE: test params are: codec=Lucene41, sim=DefaultSimilarity, locale=zh_SG, timezone=Africa/Brazzaville
   [junit4]   2> NOTE: Windows 7 6.1 x86/Oracle Corporation 1.8.0 (32-bit)/cpus=2,threads=1,free=158001560,total=298201088
   [junit4]   2> NOTE: All tests run in this JVM: [TestRecoveryHdfs, PrimUtilsTest, TestSchemaResource, TestShortCircuitedRequests, SpatialFilterTest, PingRequestHandlerTest, TestFieldCollectionResource, TestUniqueKeyFieldResource, SuggesterWFSTTest, ZkNodePropsTest, TestLazyCores, TestCursorMarkWithoutUniqueKey, SoftAutoCommitTest, SOLR749Test, TestElisionMultitermQuery, UnloadDistributedZkTest, TestDistributedGrouping, SpellPossibilityIteratorTest, SolrCoreTest, IndexSchemaRuntimeFieldTest, CollectionsAPIAsyncDistributedZkTest, SolrIndexSplitterTest, TestConfig, TestFieldTypeResource, TestJmxIntegration, ShardRoutingTest, CurrencyFieldXmlFileTest, MBeansHandlerTest, HighlighterConfigTest, HdfsCollectionsAPIDistributedZkTest, WordBreakSolrSpellCheckerTest, ConnectionManagerTest, PreAnalyzedFieldTest, TestFuzzyAnalyzedSuggestions, TestFastLRUCache, DeleteReplicaTest, TermsComponentTest, TestXIncludeConfig, SolrXmlInZkTest, TestMultiCoreConfBootstrap, TestManagedSchemaFieldResource, DistributedSuggestComponentTest, TestLMDirichletSimilarityFactory, TestPhraseSuggestions, TestAnalyzedSuggestions, TestMergePolicyConfig, PluginInfoTest, SyncSliceTest, TestNRTOpen, JSONWriterTest, TestSolr4Spatial, DistributedQueryComponentCustomSortTest, EchoParamsTest, TestReversedWildcardFilterFactory, TestStressVersions, CursorMarkTest, TestBM25SimilarityFactory, TestBinaryResponseWriter, HdfsSyncSliceTest, JsonLoaderTest, AddBlockUpdateTest, TestSolrQueryParserResource, TestCopyFieldCollectionResource, TestRandomMergePolicy, BlockDirectoryTest, TestSearcherReuse, TestDFRSimilarityFactory, TestWordDelimiterFilterFactory, TestBinaryField, BasicZkTest, TestLRUCache, QueryEqualityTest, TestNonDefinedSimilarityFactory, AlternateDirectoryTest, BadCopyFieldTest, SearchHandlerTest, TestIndexSearcher, PathHierarchyTokenizerFactoryTest, DateMathParserTest, HdfsRecoveryZkTest, TestManagedSchema, DisMaxRequestHandlerTest, TestLuceneMatchVersion, TestSolrXmlPersistor, OverseerCollectionProcessorTest, BasicFunctionalityTest, LoggingHandlerTest, TestDistribDocBasedVersion, TimeZoneUtilsTest, CSVRequestHandlerTest, SolrRequestParserTest, TestStandardQParsers, DirectUpdateHandlerTest, SortByFunctionTest, TestReload, QueryResultKeyTest, TestFieldSortValues, ResourceLoaderTest, TestRequestStatusCollectionAPI, ReturnFieldsTest, SolrCoreCheckLockOnStartupTest, TermVectorComponentDistributedTest, DistributedSpellCheckComponentTest]
   [junit4] Completed in 60.97s, 1 test, 1 error <<< FAILURES!

[...truncated 1 lines...]
   [junit4] Suite: org.apache.solr.cloud.DistribCursorPagingTest
   [junit4]   2> 908669 T3040 oas.SolrTestCaseJ4.buildSSLConfig Randomized ssl (true) and clientAuth (false)
   [junit4]   2> 908670 T3040 oas.BaseDistributedSearchTestCase.initHostContext Setting hostContext system property: /bdug/
   [junit4]   2> 908673 T3040 oas.SolrTestCaseJ4.setUp ###Starting testDistribSearch
   [junit4]   2> Creating dataDir: C:\Users\JenkinsSlave\workspace\Lucene-Solr-4.x-Windows\solr\build\solr-core\test\J0\.\solrtest-DistribCursorPagingTest-1395222895350
   [junit4]   2> 908676 T3040 oasc.ZkTestServer.run STARTING ZK TEST SERVER
   [junit4]   2> 908677 T3041 oasc.ZkTestServer$ZKServerMain.runFromConfig Starting server
   [junit4]   2> 908777 T3040 oasc.ZkTestServer.run start zk server on port:54115
   [junit4]   2> 908779 T3040 oascc.ConnectionManager.waitForConnected Waiting for client to connect to ZooKeeper
   [junit4]   2> 908786 T3047 oascc.ConnectionManager.process Watcher org.apache.solr.common.cloud.ConnectionManager@f28ff6 name:ZooKeeperConnection Watcher:127.0.0.1:54115 got event WatchedEvent state:SyncConnected type:None path:null path:null type:None
   [junit4]   2> 908787 T3040 oascc.ConnectionManager.waitForConnected Client is connected to ZooKeeper
   [junit4]   2> 908787 T3040 oascc.SolrZkClient.makePath makePath: /solr
   [junit4]   2> 908794 T3042 oazs.NIOServerCnxn.doIO WARN caught end of stream exception EndOfStreamException: Unable to read additional data from client sessionid 0x144d9c3dafe0000, likely client has closed socket
   [junit4]   2> 	at org.apache.zookeeper.server.NIOServerCnxn.doIO(NIOServerCnxn.java:220)
   [junit4]   2> 	at org.apache.zookeeper.server.NIOServerCnxnFactory.run(NIOServerCnxnFactory.java:208)
   [junit4]   2> 	at java.lang.Thread.run(Thread.java:744)
   [junit4]   2> 
   [junit4]   2> 908796 T3040 oascc.ConnectionManager.waitForConnected Waiting for client to connect to ZooKeeper
   [junit4]   2> 908800 T3049 oascc.ConnectionManager.process Watcher org.apache.solr.common.cloud.ConnectionManager@597da4 name:ZooKeeperConnection Watcher:127.0.0.1:54115/solr got event WatchedEvent state:SyncConnected type:None path:null path:null type:None
   [junit4]   2> 908800 T3040 oascc.ConnectionManager.waitForConnected Client is connected to ZooKeeper
   [junit4]   2> 908800 T3040 oascc.SolrZkClient.makePath makePath: /collections/collection1
   [junit4]   2> 908805 T3040 oascc.SolrZkClient.makePath makePath: /collections/collection1/shards
   [junit4]   2> 908810 T3040 oascc.SolrZkClient.makePath makePath: /collections/control_collection
   [junit4]   2> 908814 T3040 oascc.SolrZkClient.makePath makePath: /collections/control_collection/shards
   [junit4]   2> 908819 T3040 oasc.AbstractZkTestCase.putConfig put C:\Users\JenkinsSlave\workspace\Lucene-Solr-4.x-Windows\solr\core\src\test-files\solr\collection1\conf\solrconfig-deeppaging.xml to /configs/conf1/solrconfig.xml
   [junit4]   2> 908819 T3040 oascc.SolrZkClient.makePath makePath: /configs/conf1/solrconfig.xml
   [junit4]   2> 908829 T3040 oasc.AbstractZkTestCase.putConfig put C:\Users\JenkinsSlave\workspace\Lucene-Solr-4.x-Windows\solr\core\src\test-files\solr\collection1\conf\schema-sorts.xml to /configs/conf1/schema.xml
   [junit4]   2> 908829 T3040 oascc.SolrZkClient.makePath makePath: /configs/conf1/schema.xml
   [junit4]   2> 908834 T3040 oasc.AbstractZkTestCase.putConfig put C:\Users\JenkinsSlave\workspace\Lucene-Solr-4.x-Windows\solr\core\src\test-files\solr\collection1\conf\solrconfig.snippet.randomindexconfig.xml to /configs/conf1/solrconfig.snippet.randomindexconfig.xml
   [junit4]   2> 908834 T3040 oascc.SolrZkClient.makePath makePath: /configs/conf1/solrconfig.snippet.randomindexconfig.xml
   [junit4]   2> 908840 T3040 oasc.AbstractZkTestCase.putConfig put C:\Users\JenkinsSlave\workspace\Lucene-Solr-4.x-Windows\solr\core\src\test-files\solr\collection1\conf\stopwords.txt to /configs/conf1/stopwords.txt
   [junit4]   2> 908840 T3040 oascc.SolrZkClient.makePath makePath: /configs/conf1/stopwords.txt
   [junit4]   2> 908855 T3040 oasc.AbstractZkTestCase.putConfig put C:\Users\JenkinsSlave\workspace\Lucene-Solr-4.x-Windows\solr\core\src\test-files\solr\collection1\conf\protwords.txt to /configs/conf1/protwords.txt
   [junit4]   2> 908855 T3040 oascc.SolrZkClient.makePath makePath: /configs/conf1/protwords.txt
   [junit4]   2> 908861 T3040 oasc.AbstractZkTestCase.putConfig put C:\Users\JenkinsSlave\workspace\Lucene-Solr-4.x-Windows\solr\core\src\test-files\solr\collection1\conf\currency.xml to /configs/conf1/currency.xml
   [junit4]   2> 908861 T3040 oascc.SolrZkClient.makePath makePath: /configs/conf1/currency.xml
   [junit4]   2> 908867 T3040 oasc.AbstractZkTestCase.putConfig put C:\Users\JenkinsSlave\workspace\Lucene-Solr-4.x-Windows\solr\core\src\test-files\solr\collection1\conf\enumsConfig.xml to /configs/conf1/enumsConfig.xml
   [junit4]   2> 908867 T3040 oascc.SolrZkClient.makePath makePath: /configs/conf1/enumsConfig.xml
   [junit4]   2> 908872 T3040 oasc.AbstractZkTestCase.putConfig put C:\Users\JenkinsSlave\workspace\Lucene-Solr-4.x-Windows\solr\core\src\test-files\solr\collection1\conf\open-exchange-rates.json to /configs/conf1/open-exchange-rates.json
   [junit4]   2> 908872 T3040 oascc.SolrZkClient.makePath makePath: /configs/conf1/open-exchange-rates.json
   [junit4]   2> 908878 T3040 oasc.AbstractZkTestCase.putConfig put C:\Users\JenkinsSlave\workspace\Lucene-Solr-4.x-Windows\solr\core\src\test-files\solr\collection1\conf\mapping-ISOLatin1Accent.txt to /configs/conf1/mapping-ISOLatin1Accent.txt
   [junit4]   2> 908878 T3040 oascc.SolrZkClient.makePath makePath: /configs/conf1/mapping-ISOLatin1Accent.txt
   [junit4]   2> 908883 T3040 oasc.AbstractZkTestCase.putConfig put C:\Users\JenkinsSlave\workspace\Lucene-Solr-4.x-Windows\solr\core\src\test-files\solr\collection1\conf\old_synonyms.txt to /configs/conf1/old_synonyms.txt
   [junit4]   2> 908883 T3040 oascc.SolrZkClient.makePath makePath: /configs/conf1/old_synonyms.txt
   [junit4]   2> 908888 T3040 oasc.AbstractZkTestCase.putConfig put C:\Users\JenkinsSlave\workspace\Lucene-Solr-4.x-Windows\solr\core\src\test-files\solr\collection1\conf\synonyms.txt to /configs/conf1/synonyms.txt
   [junit4]   2> 908888 T3040 oascc.SolrZkClient.makePath makePath: /configs/conf1/synonyms.txt
   [junit4]   2> 908897 T3040 oascc.ConnectionManager.waitForConnected Waiting for client to connect to ZooKeeper
   [junit4]   2> 908900 T3051 oascc.ConnectionManager.process Watcher org.apache.solr.common.cloud.ConnectionManager@19a1e93 name:ZooKeeperConnection Watcher:127.0.0.1:54115/solr got event WatchedEvent state:SyncConnected type:None path:null path:null type:None
   [junit4]   2> 908901 T3040 oascc.ConnectionManager.waitForConnected Client is connected to ZooKeeper
   [junit4]   2> 908905 T3042 oazs.NIOServerCnxn.doIO WARN caught end of stream exception EndOfStreamException: Unable to read additional data from client sessionid 0x144d9c3dafe0002, likely client has closed socket
   [junit4]   2> 	at org.apache.zookeeper.server.NIOServerCnxn.doIO(NIOServerCnxn.java:220)
   [junit4]   2> 	at org.apache.zookeeper.server.NIOServerCnxnFactory.run(NIOServerCnxnFactory.java:208)
   [junit4]   2> 	at java.lang.Thread.run(Thread.java:744)
   [junit4]   2> 
   [junit4]   2> 911015 T3040 oejs.Server.doStart jetty-8.1.10.v20130312
   [junit4]   2> 911027 T3040 oejus.SslContextFactory.doStart Enabled Protocols [SSLv2Hello, SSLv3, TLSv1, TLSv1.1, TLSv1.2] of [SSLv2Hello, SSLv3, TLSv1, TLSv1.1, TLSv1.2]
   [junit4]   2> 911068 T3040 oejs.AbstractConnector.doStart Started SslSelectChannelConnector@127.0.0.1:54125
   [junit4]   2> 911072 T3040 oass.SolrDispatchFilter.init SolrDispatchFilter.init()
   [junit4]   2> 911073 T3040 oasc.SolrResourceLoader.locateSolrHome JNDI not configured for solr (NoInitialContextEx)
   [junit4]   2> 911073 T3040 oasc.SolrResourceLoader.locateSolrHome using system property solr.solr.home: .\org.apache.solr.cloud.DistribCursorPagingTest-controljetty-1395222895579
   [junit4]   2> 911073 T3040 oasc.SolrResourceLoader.<init> new SolrResourceLoader for directory: '.\org.apache.solr.cloud.DistribCursorPagingTest-controljetty-1395222895579\'
   [junit4]   2> 911118 T3040 oass.SolrDispatchFilter.loadConfigSolr Trying to read solr.xml from 127.0.0.1:54115/solr
   [junit4]   2> 911122 T3040 oascc.ConnectionManager.waitForConnected Waiting for client to connect to ZooKeeper
   [junit4]   2> 911128 T3062 oascc.ConnectionManager.process Watcher org.apache.solr.common.cloud.ConnectionManager@e82e2d name:ZooKeeperConnection Watcher:127.0.0.1:54115/solr got event WatchedEvent state:SyncConnected type:None path:null path:null type:None
   [junit4]   2> 911128 T3040 oascc.ConnectionManager.waitForConnected Client is connected to ZooKeeper
   [junit4]   2> 911133 T3040 oass.SolrDispatchFilter.init ERROR Could not start Solr. Check solr/home property and the logs
   [junit4]   2> 911134 T3040 oasc.SolrException.log ERROR null:org.apache.solr.common.SolrException: Could not load solr.xml from zookeeper
   [junit4]   2> 		at org.apache.solr.servlet.SolrDispatchFilter.loadConfigSolr(SolrDispatchFilter.java:181)
   [junit4]   2> 		at org.apache.solr.servlet.SolrDispatchFilter.createCoreContainer(SolrDispatchFilter.java:197)
   [junit4]   2> 		at org.apache.solr.servlet.SolrDispatchFilter.init(SolrDispatchFilter.java:146)
   [junit4]   2> 		at org.eclipse.jetty.servlet.FilterHolder.doStart(FilterHolder.java:119)
   [junit4]   2> 		at org.eclipse.jetty.util.component.AbstractLifeCycle.start(AbstractLifeCycle.java:64)
   [junit4]   2> 		at org.eclipse.jetty.servlet.ServletHandler.initialize(ServletHandler.java:719)
   [junit4]   2> 		at org.eclipse.jetty.servlet.ServletHandler.updateMappings(ServletHandler.java:1309)
   [junit4]   2> 		at org.eclipse.jetty.servlet.ServletHandler.setFilterMappings(ServletHandler.java:1345)
   [junit4]   2> 		at org.eclipse.jetty.servlet.ServletHandler.addFilterMapping(ServletHandler.java:1085)
   [junit4]   2> 		at org.eclipse.jetty.servlet.ServletHandler.addFilterWithMapping(ServletHandler.java:931)
   [junit4]   2> 		at org.eclipse.jetty.servlet.ServletHandler.addFilterWithMapping(ServletHandler.java:888)
   [junit4]   2> 		at org.eclipse.jetty.servlet.ServletContextHandler.addFilter(ServletContextHandler.java:340)
   [junit4]   2> 		at org.apache.solr.client.solrj.embedded.JettySolrRunner$1.lifeCycleStarted(JettySolrRunner.java:325)
   [junit4]   2> 		at org.eclipse.jetty.util.component.AbstractLifeCycle.setStarted(AbstractLifeCycle.java:174)
   [junit4]   2> 		at org.eclipse.jetty.util.component.AbstractLifeCycle.start(AbstractLifeCycle.java:65)
   [junit4]   2> 		at org.apache.solr.client.solrj.embedded.JettySolrRunner.start(JettySolrRunner.java:430)
   [junit4]   2> 		at org.apache.solr.client.solrj.embedded.JettySolrRunner.start(JettySolrRunner.java:403)
   [junit4]   2> 		at org.apache.solr.cloud.AbstractFullDistribZkTestBase.createJetty(AbstractFullDistribZkTestBase.java:490)
   [junit4]   2> 		at org.apache.solr.BaseDistributedSearchTestCase.createJetty(BaseDistributedSearchTestCase.java:356)
   [junit4]   2> 		at org.apache.solr.cloud.AbstractFullDistribZkTestBase.createServers(AbstractFullDistribZkTestBase.java:291)
   [junit4]   2> 		at org.apache.solr.BaseDistributedSearchTestCase.testDistribSearch(BaseDistributedSearchTestCase.java:868)
   [junit4]   2> 		at sun.reflect.NativeMethodAccessorImpl.invoke0(Native Method)
   [junit4]   2> 		at sun.reflect.NativeMethodAccessorImpl.invoke(NativeMethodAccessorImpl.java:62)
   [junit4]   2> 		at sun.reflect.DelegatingMethodAccessorImpl.invoke(DelegatingMethodAccessorImpl.java:43)
   [junit4]   2> 		at java.lang.reflect.Method.invoke(Method.java:483)
   [junit4]   2> 		at com.carrotsearch.randomizedtesting.RandomizedRunner.invoke(RandomizedRunner.java:1617)
   [junit4]   2> 		at com.carrotsearch.randomizedtesting.RandomizedRunner$6.evaluate(RandomizedRunner.java:826)
   [junit4]   2> 		at com.carrotsearch.randomizedtesting.RandomizedRunner$7.evaluate(RandomizedRunner.java:862)
   [junit4]   2> 		at com.carrotsearch.randomizedtesting.RandomizedRunner$8.evaluate(RandomizedRunner.java:876)
   [junit4]   2> 		at com.carrotsearch.randomizedtesting.rules.SystemPropertiesRestoreRule$1.evaluate(SystemPropertiesRestoreRule.java:53)
   [junit4]   2> 		at org.apache.lucene.util.TestRuleSetupTeardownChained$1.evaluate(TestRuleSetupTeardownChained.java:50)
   [junit4]   2> 		at org.apache.lucene.util.TestRuleFieldCacheSanity$1.evaluate(TestRuleFieldCacheSanity.java:51)
   [junit4]   2> 		at org.apache.lucene.util.AbstractBeforeAfterRule$1.evaluate(AbstractBeforeAfterRule.java:46)
   [junit4]   2> 		at com.carrotsearch.randomizedtesting.rules.SystemPropertiesInvariantRule$1.evaluate(SystemPropertiesInvariantRule.java:55)
   [junit4]   2> 		at org.apache.lucene.util.TestRuleThreadAndTestName$1.evaluate(TestRuleThreadAndTestName.java:49)
   [junit4]   2> 		at org.apache.lucene.util.TestRuleIgnoreAfterMaxFailures$1.evaluate(TestRuleIgnoreAfterMaxFailures.java:70)
   [junit4]   2> 		at org.apache.lucene.util.TestRuleMarkFailure$1.evaluate(TestRuleMarkFailure.java:48)
   [junit4]   2> 		at com.carrotsearch.randomizedtesting.rules.StatementAdapter.evaluate(StatementAdapter.java:36)
   [junit4]   2> 		at com.carrotsearch.randomizedtesting.ThreadLeakControl$StatementRunner.run(ThreadLeakControl.java:359)
   [junit4]   2> 		at com.carrotsearch.randomizedtesting.ThreadLeakControl.forkTimeoutingTask(ThreadLeakControl.java:783)
   [junit4]   2> 		at com.carrotsearch.randomizedtesting.ThreadLeakControl$3.evaluate(ThreadLeakControl.java:443)
   [junit4]   2> 		at com.carrotsearch.randomizedtesting.RandomizedRunner.runSingleTest(RandomizedRunner.java:835)
   [junit4]   2> 		at com.carrotsearch.randomizedtesting.RandomizedRunner$3.evaluate(RandomizedRunner.java:737)
   [junit4]   2> 		at com.carrotsearch.randomizedtesting.RandomizedRunner$4.evaluate(RandomizedRunner.java:771)
   [junit4]   2> 		at com.carrotsearch.randomizedtesting.RandomizedRunner$5.evaluate(RandomizedRunner.java:782)
   [junit4]   2> 		at com.carrotsearch.randomizedtesting.rules.StatementAdapter.evaluate(StatementAdapter.java:36)
   [junit4]   2> 		at com.carrotsearch.randomizedtesting.rules.SystemPropertiesRestoreRule$1.evaluate(SystemPropertiesRestoreRule.java:53)
   [junit4]   2> 		at org.apache.lucene.util.AbstractBeforeAfterRule$1.evaluate(AbstractBeforeAfterRule.java:46)
   [junit4]   2> 		at org.apache.lucene.util.TestRuleStoreClassName$1.evaluate(TestRuleStoreClassName.java:42)
   [junit4]   2> 		at com.carrotsearch.randomizedtesting.rules.SystemPropertiesInvariantRule$1.evaluate(SystemPropertiesInvariantRule.java:55)
   [junit4]   2> 		at com.carrotsearch.randomizedtesting.rules.NoShadowingOrOverridesOnMethodsRule$1.evaluate(NoShadowingOrOverridesOnMethodsRule.java:39)
   [junit4]   2> 		at com.carrotsearch.randomizedtesting.rules.NoShadowingOrOverridesOnMethodsRule$1.evaluate(NoShadowingOrOverridesOnMethodsRule.java:39)
   [junit4]   2> 		at com.carrotsearch.randomizedtesting.rules.StatementAdapter.evaluate(StatementAdapter.java:36)
   [junit4]   2> 		at org.apache.lucene.util.TestRuleAssertionsRequired$1.evaluate(TestRuleAssertionsRequired.java:43)
   [junit4]   2> 		at org.apache.lucene.util.TestRuleMarkFailure$1.evaluate(TestRuleMarkFailure.java:48)
   [junit4]   2> 		at org.apache.lucene.util.TestRuleIgnoreAfterMaxFailures$1.evaluate(TestRuleIgnoreAfterMaxFailures.java:70)
   [junit4]   2> 		at org.apache.lucene.util.TestRuleIgnoreTestSuites$1.evaluate(TestRuleIgnoreTestSuites.java:55)
   [junit4]   2> 		at com.carrotsearch.randomizedtesting.rules.StatementAdapter.evaluate(StatementAdapter.java:36)
   [junit4]   2> 		at com.carrotsearch.randomizedtesting.ThreadLeakControl$StatementRunner.run(ThreadLeakControl.java:359)
   [junit4]   2> 		at java.lang.Thread.run(Thread.java:744)
   [junit4]   2> 	Caused by: org.apache.solr.common.SolrException: Could not load solr.xml from zookeeper: node not found
   [junit4]   2> 		at org.apache.solr.servlet.SolrDispatchFilter.loadConfigSolr(SolrDispatchFilter.java:177)
   [junit4]   2> 		... 59 more
   [junit4]   2> 	
   [junit4]   2> 911134 T3040 oass.SolrDispatchFilter.init SolrDispatchFilter.init() done
   [junit4]   2> 911144 T3040 oascc.ConnectionManager.waitForConnected Waiting for client to connect to ZooKeeper
   [junit4]   2> 911150 T3064 oascc.ConnectionManager.process Watcher org.apache.solr.common.cloud.ConnectionManager@f15b84 name:ZooKeeperConnection Watcher:127.0.0.1:54115/solr got event WatchedEvent state:SyncConnected type:None path:null path:null type:None
   [junit4]   2> 911151 T3040 oascc.ConnectionManager.waitForConnected Client is connected to ZooKeeper
   [junit4]   2> 911153 T3040 oascc.SolrZkClient.makePath makePath: /clusterstate.json
   [junit4]   2> 911157 T3040 oascc.SolrZkClient.makePath makePath: /aliases.json
   [junit4]   2> 911160 T3040 oascc.ZkStateReader.createClusterStateWatchersAndUpdate Updating cluster state from ZooKeeper... 
   [junit4]   2> 911162 T3040 oasc.ChaosMonkey.monkeyLog monkey: stop shard! 54125
   [junit4]   2> 911176 T3040 oejsh.ContextHandler.doStop stopped o.e.j.s.ServletContextHandler{/bdug,null}
   [junit4]   2> !!!! WARNING: best effort to remove C:\Users\JenkinsSlave\workspace\Lucene-Solr-4.x-Windows\solr\build\solr-core\test\J0\.\org.apache.solr.cloud.DistribCursorPagingTest-1395222895348\zookeeper\server1\data\version-2\log.1 FAILED !!!!!
   [junit4]   2> !!!! WARNING: best effort to remove C:\Users\JenkinsSlave\workspace\Lucene-Solr-4.x-Windows\solr\build\solr-core\test\J0\.\org.apache.solr.cloud.DistribCursorPagingTest-1395222895348\zookeeper\server1\data\version-2 FAILED !!!!!
   [junit4]   2> !!!! WARNING: best effort to remove C:\Users\JenkinsSlave\workspace\Lucene-Solr-4.x-Windows\solr\build\solr-core\test\J0\.\org.apache.solr.cloud.DistribCursorPagingTest-1395222895348\zookeeper\server1\data FAILED !!!!!
   [junit4]   2> !!!! WARNING: best effort to remove C:\Users\JenkinsSlave\workspace\Lucene-Solr-4.x-Windows\solr\build\solr-core\test\J0\.\org.apache.solr.cloud.DistribCursorPagingTest-1395222895348\zookeeper\server1 FAILED !!!!!
   [junit4]   2> !!!! WARNING: best effort to remove C:\Users\JenkinsSlave\workspace\Lucene-Solr-4.x-Windows\solr\build\solr-core\test\J0\.\org.apache.solr.cloud.DistribCursorPagingTest-1395222895348\zookeeper FAILED !!!!!
   [junit4]   2> !!!! WARNING: best effort to remove C:\Users\JenkinsSlave\workspace\Lucene-Solr-4.x-Windows\solr\build\solr-core\test\J0\.\org.apache.solr.cloud.DistribCursorPagingTest-1395222895348 FAILED !!!!!
   [junit4]   2> 911239 T3040 oas.SolrTestCaseJ4.tearDown ###Ending testDistribSearch
   [junit4]   2> 911243 T3040 oasc.ZkTestServer.send4LetterWord connecting to 127.0.0.1:54115 54115
   [junit4]   1> client port:0.0.0.0/0.0.0.0:0
   [junit4]   2> NOTE: reproduce with: ant test  -Dtestcase=DistribCursorPagingTest -Dtests.method=testDistribSearch -Dtests.seed=5A9179BE0A4E8A74 -Dtests.slow=true -Dtests.locale=in_ID -Dtests.timezone=Africa/Douala -Dtests.file.encoding=US-ASCII
   [junit4] ERROR   4.85s | DistribCursorPagingTest.testDistribSearch <<<
   [junit4]    > Throwable #1: org.apache.solr.common.cloud.ZooKeeperException: 
   [junit4]    > 	at __randomizedtesting.SeedInfo.seed([5A9179BE0A4E8A74:DB77F7A67D11EA48]:0)
   [junit4]    > 	at org.apache.solr.client.solrj.impl.CloudSolrServer.connect(CloudSolrServer.java:249)
   [junit4]    > 	at org.apache.solr.cloud.AbstractFullDistribZkTestBase.initCloud(AbstractFullDistribZkTestBase.java:256)
   [junit4]    > 	at org.apache.solr.cloud.AbstractFullDistribZkTestBase.createServers(AbstractFullDistribZkTestBase.java:312)
   [junit4]    > 	at org.apache.solr.BaseDistributedSearchTestCase.testDistribSearch(BaseDistributedSearchTestCase.java:868)
   [junit4]    > 	at java.lang.Thread.run(Thread.java:744)
   [junit4]    > Caused by: org.apache.zookeeper.KeeperException$NoNodeException: KeeperErrorCode = NoNode for /live_nodes
   [junit4]    > 	at org.apache.zookeeper.KeeperException.create(KeeperException.java:111)
   [junit4]    > 	at org.apache.zookeeper.KeeperException.create(KeeperException.java:51)
   [junit4]    > 	at org.apache.zookeeper.ZooKeeper.getChildren(ZooKeeper.java:1468)
   [junit4]    > 	at org.apache.solr.common.cloud.SolrZkClient$6.execute(SolrZkClient.java:259)
   [junit4]    > 	at org.apache.solr.common.cloud.SolrZkClient$6.execute(SolrZkClient.java:256)
   [junit4]    > 	at org.apache.solr.common.cloud.ZkCmdExecutor.retryOperation(ZkCmdExecutor.java:73)
   [junit4]    > 	at org.apache.solr.common.cloud.SolrZkClient.getChildren(SolrZkClient.java:256)
   [junit4]    > 	at org.apache.solr.common.cloud.ZkStateReader.createClusterStateWatchersAndUpdate(ZkStateReader.java:299)
   [junit4]    > 	at org.apache.solr.client.solrj.impl.CloudSolrServer.connect(CloudSolrServer.java:242)
   [junit4]    > 	... 42 more
   [junit4]   2> 913518 T3040 oas.SolrTestCaseJ4.deleteCore ###deleteCore
   [junit4]   2> 913520 T3040 oas.SolrTestCaseJ4.endTrackingZkClients ERROR ERROR: SolrZkClient opens=5 closes=4
   [junit4]   2> 4856 T3039 ccr.ThreadLeakControl.checkThreadLeaks WARNING Will linger awaiting termination of 2 leaked thread(s).
   [junit4]   2> 913597 T3064 oascc.ConnectionManager.process Watcher org.apache.solr.common.cloud.ConnectionManager@f15b84 name:ZooKeeperConnection Watcher:127.0.0.1:54115/solr got event WatchedEvent state:Disconnected type:None path:null path:null type:None
   [junit4]   2> 913598 T3064 oascc.ConnectionManager.process zkClient has disconnected
   [junit4]   2> 915802 T3063 oaz.ClientCnxn$SendThread.run WARN Session 0x144d9c3dafe0004 for server null, unexpected error, closing socket connection and attempting reconnect java.net.ConnectException: Connection refused: no further information
   [junit4]   2> 	at sun.nio.ch.SocketChannelImpl.checkConnect(Native Method)
   [junit4]   2> 	at sun.nio.ch.SocketChannelImpl.finishConnect(SocketChannelImpl.java:712)
   [junit4]   2> 	at org.apache.zookeeper.ClientCnxnSocketNIO.doTransport(ClientCnxnSocketNIO.java:350)
   [junit4]   2> 	at org.apache.zookeeper.ClientCnxn$SendThread.run(ClientCnxn.java:1068)
   [junit4]   2> 
   [junit4]   2> 918516 T3063 oaz.ClientCnxn$SendThread.run WARN Session 0x144d9c3dafe0004 for server null, unexpected error, closing socket connection and attempting reconnect java.net.ConnectException: Connection refused: no further information
   [junit4]   2> 	at sun.nio.ch.SocketChannelImpl.checkConnect(Native Method)
   [junit4]   2> 	at sun.nio.ch.SocketChannelImpl.finishConnect(SocketChannelImpl.java:712)
   [junit4]   2> 	at org.apache.zookeeper.ClientCnxnSocketNIO.doTransport(ClientCnxnSocketNIO.java:350)
   [junit4]   2> 	at org.apache.zookeeper.ClientCnxn$SendThread.run(ClientCnxn.java:1068)
   [junit4]   2> 
   [junit4]   2> 921254 T3063 oaz.ClientCnxn$SendThread.run WARN Session 0x144d9c3dafe0004 for server null, unexpected error, closing socket connection and attempting reconnect java.net.ConnectException: Connection refused: no further information
   [junit4]   2> 	at sun.nio.ch.SocketChannelImpl.checkConnect(Native Method)
   [junit4]   2> 	at sun.nio.ch.SocketChannelImpl.finishConnect(SocketChannelImpl.java:712)
   [junit4]   2> 	at org.apache.zookeeper.ClientCnxnSocketNIO.doTransport(ClientCnxnSocketNIO.java:350)
   [junit4]   2> 	at org.apache.zookeeper.ClientCnxn$SendThread.run(ClientCnxn.java:1068)
   [junit4]   2> 
   [junit4]   2> 924409 T3063 oaz.ClientCnxn$SendThread.run WARN Session 0x144d9c3dafe0004 for server null, unexpected error, closing socket connection and attempting reconnect java.net.ConnectException: Connection refused: no further information
   [junit4]   2> 	at sun.nio.ch.SocketChannelImpl.checkConnect(Native Method)
   [junit4]   2> 	at sun.nio.ch.SocketChannelImpl.finishConnect(SocketChannelImpl.java:712)
   [junit4]   2> 	at org.apache.zookeeper.ClientCnxnSocketNIO.doTransport(ClientCnxnSocketNIO.java:350)
   [junit4]   2> 	at org.apache.zookeeper.ClientCnxn$SendThread.run(ClientCnxn.java:1068)
   [junit4]   2> 
   [junit4]   2> 926850 T3063 oaz.ClientCnxn$SendThread.run WARN Session 0x144d9c3dafe0004 for server null, unexpected error, closing socket connection and attempting reconnect java.net.ConnectException: Connection refused: no further information
   [junit4]   2> 	at sun.nio.ch.SocketChannelImpl.checkConnect(Native Method)
   [junit4]   2> 	at sun.nio.ch.SocketChannelImpl.finishConnect(SocketChannelImpl.java:712)
   [junit4]   2> 	at org.apache.zookeeper.ClientCnxnSocketNIO.doTransport(ClientCnxnSocketNIO.java:350)
   [junit4]   2> 	at org.apache.zookeeper.ClientCnxn$SendThread.run(ClientCnxn.java:1068)
   [junit4]   2> 
   [junit4]   2> 929338 T3063 oaz.ClientCnxn$SendThread.run WARN Session 0x144d9c3dafe0004 for server null, unexpected error, closing socket connection and attempting reconnect java.net.ConnectException: Connection refused: no further information
   [junit4]   2> 	at sun.nio.ch.SocketChannelImpl.checkConnect(Native Method)
   [junit4]   2> 	at sun.nio.ch.SocketChannelImpl.finishConnect(SocketChannelImpl.java:712)
   [junit4]   2> 	at org.apache.zookeeper.ClientCnxnSocketNIO.doTransport(ClientCnxnSocketNIO.java:350)
   [junit4]   2> 	at org.apache.zookeeper.ClientCnxn$SendThread.run(ClientCnxn.java:1068)
   [junit4]   2> 
   [junit4]   2> 932009 T3063 oaz.ClientCnxn$SendThread.run WARN Session 0x144d9c3dafe0004 for server null, unexpected error, closing socket connection and attempting reconnect java.net.ConnectException: Connection refused: no further information
   [junit4]   2> 	at sun.nio.ch.SocketChannelImpl.checkConnect(Native Method)
   [junit4]   2> 	at sun.nio.ch.SocketChannelImpl.finishConnect(SocketChannelImpl.java:712)
   [junit4]   2> 	at org.apache.zookeeper.ClientCnxnSocketNIO.doTransport(ClientCnxnSocketNIO.java:350)
   [junit4]   2> 	at org.apache.zookeeper.ClientCnxn$SendThread.run(ClientCnxn.java:1068)
   [junit4]   2> 
   [junit4]   2> 24947 T3039 ccr.ThreadLeakControl.checkThreadLeaks SEVERE 2 threads leaked from SUITE scope at org.apache.solr.cloud.DistribCursorPagingTest: 
   [junit4]   2> 	   1) Thread[id=3064, name=TEST-DistribCursorPagingTest.testDistribSearch-seed#[5A9179BE0A4E8A74]-EventThread, state=WAITING, group=TGRP-DistribCursorPagingTest]
   [junit4]   2> 	        at sun.misc.Unsafe.park(Native Method)
   [junit4]   2> 	        at java.util.concurrent.locks.LockSupport.park(LockSupport.java:175)
   [junit4]   2> 	        at java.util.concurrent.locks.AbstractQueuedSynchronizer$ConditionObject.await(AbstractQueuedSynchronizer.java:2039)
   [junit4]   2> 	        at java.util.concurrent.LinkedBlockingQueue.take(LinkedBlockingQueue.java:442)
   [junit4]   2> 	        at org.apache.zookeeper.ClientCnxn$EventThread.run(ClientCnxn.java:491)
   [junit4]   2> 	   2) Thread[id=3063, name=TEST-DistribCursorPagingTest.testDistribSearch-seed#[5A9179BE0A4E8A74]-SendThread(127.0.0.1:54115), state=TIMED_WAITING, group=TGRP-DistribCursorPagingTest]
   [junit4]   2> 	        at java.lang.Thread.sleep(Native Method)
   [junit4]   2> 	        at org.apache.zookeeper.client.StaticHostProvider.next(StaticHostProvider.java:86)
   [junit4]   2> 	        at org.apache.zookeeper.Cl

[...truncated too long message...]

SocketChannelImpl.finishConnect(SocketChannelImpl.java:748)
   [junit4]   2> 	at org.apache.zookeeper.ClientCnxnSocketNIO.doTransport(ClientCnxnSocketNIO.java:350)
   [junit4]   2> 	at org.apache.zookeeper.ClientCnxn$SendThread.run(ClientCnxn.java:1068)
   [junit4]   2> 
   [junit4]   2> 934618 T3063 oaz.ClientCnxn$SendThread.run WARN Unexpected exception java.lang.InterruptedException: sleep interrupted
   [junit4]   2> 	at java.lang.Thread.sleep(Native Method)
   [junit4]   2> 	at org.apache.zookeeper.ClientCnxn$SendThread.run(ClientCnxn.java:984)
   [junit4]   2> 
   [junit4]   2> 935119 T3063 oazc.StaticHostProvider.next WARN Unexpected exception java.lang.InterruptedException: sleep interrupted
   [junit4]   2> 	at java.lang.Thread.sleep(Native Method)
   [junit4]   2> 	at org.apache.zookeeper.client.StaticHostProvider.next(StaticHostProvider.java:86)
   [junit4]   2> 	at org.apache.zookeeper.ClientCnxn$SendThread.startConnect(ClientCnxn.java:937)
   [junit4]   2> 	at org.apache.zookeeper.ClientCnxn$SendThread.run(ClientCnxn.java:993)
   [junit4]   2> 
   [junit4]   2> 936107 T3063 oaz.ClientCnxn$SendThread.run WARN Session 0x144d9c3dafe0004 for server null, unexpected error, closing socket connection and attempting reconnect java.nio.channels.ClosedByInterruptException
   [junit4]   2> 	at java.nio.channels.spi.AbstractInterruptibleChannel.end(AbstractInterruptibleChannel.java:202)
   [junit4]   2> 	at sun.nio.ch.SocketChannelImpl.finishConnect(SocketChannelImpl.java:748)
   [junit4]   2> 	at org.apache.zookeeper.ClientCnxnSocketNIO.doTransport(ClientCnxnSocketNIO.java:350)
   [junit4]   2> 	at org.apache.zookeeper.ClientCnxn$SendThread.run(ClientCnxn.java:1068)
   [junit4]   2> 
   [junit4]   2> 936121 T3063 oaz.ClientCnxn$SendThread.run WARN Unexpected exception java.lang.InterruptedException: sleep interrupted
   [junit4]   2> 	at java.lang.Thread.sleep(Native Method)
   [junit4]   2> 	at org.apache.zookeeper.ClientCnxn$SendThread.run(ClientCnxn.java:984)
   [junit4]   2> 
   [junit4]   2> 27953 T3039 ccr.ThreadLeakControl.tryToInterruptAll SEVERE There are still zombie threads that couldn't be terminated:
   [junit4]   2> 	   1) Thread[id=3063, name=TEST-DistribCursorPagingTest.testDistribSearch-seed#[5A9179BE0A4E8A74]-SendThread(127.0.0.1:54115), state=TIMED_WAITING, group=TGRP-DistribCursorPagingTest]
   [junit4]   2> 	        at java.lang.Thread.sleep(Native Method)
   [junit4]   2> 	        at org.apache.zookeeper.client.StaticHostProvider.next(StaticHostProvider.java:86)
   [junit4]   2> 	        at org.apache.zookeeper.ClientCnxn$SendThread.startConnect(ClientCnxn.java:937)
   [junit4]   2> 	        at org.apache.zookeeper.ClientCnxn$SendThread.run(ClientCnxn.java:993)
   [junit4]   2> NOTE: test params are: codec=Appending, sim=RandomSimilarityProvider(queryNorm=true,coord=crazy): {}, locale=in_ID, timezone=Africa/Douala
   [junit4]   2> NOTE: Windows 7 6.1 x86/Oracle Corporation 1.8.0 (32-bit)/cpus=2,threads=2,free=181409840,total=298201088
   [junit4]   2> NOTE: All tests run in this JVM: [TestRecoveryHdfs, PrimUtilsTest, TestSchemaResource, TestShortCircuitedRequests, SpatialFilterTest, PingRequestHandlerTest, TestFieldCollectionResource, TestUniqueKeyFieldResource, SuggesterWFSTTest, ZkNodePropsTest, TestLazyCores, TestCursorMarkWithoutUniqueKey, SoftAutoCommitTest, SOLR749Test, TestElisionMultitermQuery, UnloadDistributedZkTest, TestDistributedGrouping, SpellPossibilityIteratorTest, SolrCoreTest, IndexSchemaRuntimeFieldTest, CollectionsAPIAsyncDistributedZkTest, SolrIndexSplitterTest, TestConfig, TestFieldTypeResource, TestJmxIntegration, ShardRoutingTest, CurrencyFieldXmlFileTest, MBeansHandlerTest, HighlighterConfigTest, HdfsCollectionsAPIDistributedZkTest, WordBreakSolrSpellCheckerTest, ConnectionManagerTest, PreAnalyzedFieldTest, TestFuzzyAnalyzedSuggestions, TestFastLRUCache, DeleteReplicaTest, TermsComponentTest, TestXIncludeConfig, SolrXmlInZkTest, TestMultiCoreConfBootstrap, TestManagedSchemaFieldResource, DistributedSuggestComponentTest, TestLMDirichletSimilarityFactory, TestPhraseSuggestions, TestAnalyzedSuggestions, TestMergePolicyConfig, PluginInfoTest, SyncSliceTest, TestNRTOpen, JSONWriterTest, TestSolr4Spatial, DistributedQueryComponentCustomSortTest, EchoParamsTest, TestReversedWildcardFilterFactory, TestStressVersions, CursorMarkTest, TestBM25SimilarityFactory, TestBinaryResponseWriter, HdfsSyncSliceTest, JsonLoaderTest, AddBlockUpdateTest, TestSolrQueryParserResource, TestCopyFieldCollectionResource, TestRandomMergePolicy, BlockDirectoryTest, TestSearcherReuse, TestDFRSimilarityFactory, TestWordDelimiterFilterFactory, TestBinaryField, BasicZkTest, TestLRUCache, QueryEqualityTest, TestNonDefinedSimilarityFactory, AlternateDirectoryTest, BadCopyFieldTest, SearchHandlerTest, TestIndexSearcher, PathHierarchyTokenizerFactoryTest, DateMathParserTest, HdfsRecoveryZkTest, TestManagedSchema, DisMaxRequestHandlerTest, TestLuceneMatchVersion, TestSolrXmlPersistor, OverseerCollectionProcessorTest, BasicFunctionalityTest, LoggingHandlerTest, TestDistribDocBasedVersion, TimeZoneUtilsTest, CSVRequestHandlerTest, SolrRequestParserTest, TestStandardQParsers, DirectUpdateHandlerTest, SortByFunctionTest, TestReload, QueryResultKeyTest, TestFieldSortValues, ResourceLoaderTest, TestRequestStatusCollectionAPI, ReturnFieldsTest, SolrCoreCheckLockOnStartupTest, TermVectorComponentDistributedTest, DistributedSpellCheckComponentTest, DistribCursorPagingTest]
   [junit4]   2> NOTE: reproduce with: ant test  -Dtestcase=DistribCursorPagingTest -Dtests.seed=5A9179BE0A4E8A74 -Dtests.slow=true -Dtests.locale=in_ID -Dtests.timezone=Africa/Douala -Dtests.file.encoding=US-ASCII
   [junit4] ERROR   0.00s | DistribCursorPagingTest (suite) <<<
   [junit4]    > Throwable #1: java.lang.AssertionError: ERROR: SolrZkClient opens=5 closes=4
   [junit4]    > 	at __randomizedtesting.SeedInfo.seed([5A9179BE0A4E8A74]:0)
   [junit4]    > 	at org.apache.solr.SolrTestCaseJ4.endTrackingZkClients(SolrTestCaseJ4.java:420)
   [junit4]    > 	at org.apache.solr.SolrTestCaseJ4.afterClass(SolrTestCaseJ4.java:177)
   [junit4]    > 	at java.lang.Thread.run(Thread.java:744)Throwable #2: com.carrotsearch.randomizedtesting.ThreadLeakError: 2 threads leaked from SUITE scope at org.apache.solr.cloud.DistribCursorPagingTest: 
   [junit4]    >    1) Thread[id=3064, name=TEST-DistribCursorPagingTest.testDistribSearch-seed#[5A9179BE0A4E8A74]-EventThread, state=WAITING, group=TGRP-DistribCursorPagingTest]
   [junit4]    >         at sun.misc.Unsafe.park(Native Method)
   [junit4]    >         at java.util.concurrent.locks.LockSupport.park(LockSupport.java:175)
   [junit4]    >         at java.util.concurrent.locks.AbstractQueuedSynchronizer$ConditionObject.await(AbstractQueuedSynchronizer.java:2039)
   [junit4]    >         at java.util.concurrent.LinkedBlockingQueue.take(LinkedBlockingQueue.java:442)
   [junit4]    >         at org.apache.zookeeper.ClientCnxn$EventThread.run(ClientCnxn.java:491)
   [junit4]    >    2) Thread[id=3063, name=TEST-DistribCursorPagingTest.testDistribSearch-seed#[5A9179BE0A4E8A74]-SendThread(127.0.0.1:54115), state=TIMED_WAITING, group=TGRP-DistribCursorPagingTest]
   [junit4]    >         at java.lang.Thread.sleep(Native Method)
   [junit4]    >         at org.apache.zookeeper.client.StaticHostProvider.next(StaticHostProvider.java:86)
   [junit4]    >         at org.apache.zookeeper.ClientCnxn$SendThread.startConnect(ClientCnxn.java:937)
   [junit4]    >         at org.apache.zookeeper.ClientCnxn$SendThread.run(ClientCnxn.java:993)
   [junit4]    > 	at __randomizedtesting.SeedInfo.seed([5A9179BE0A4E8A74]:0)Throwable #3: com.carrotsearch.randomizedtesting.ThreadLeakError: There are still zombie threads that couldn't be terminated:
   [junit4]    >    1) Thread[id=3063, name=TEST-DistribCursorPagingTest.testDistribSearch-seed#[5A9179BE0A4E8A74]-SendThread(127.0.0.1:54115), state=TIMED_WAITING, group=TGRP-DistribCursorPagingTest]
   [junit4]    >         at java.lang.Thread.sleep(Native Method)
   [junit4]    >         at org.apache.zookeeper.client.StaticHostProvider.next(StaticHostProvider.java:86)
   [junit4]    >         at org.apache.zookeeper.ClientCnxn$SendThread.startConnect(ClientCnxn.java:937)
   [junit4]    >         at org.apache.zookeeper.ClientCnxn$SendThread.run(ClientCnxn.java:993)
   [junit4]    > 	at __randomizedtesting.SeedInfo.seed([5A9179BE0A4E8A74]:0)
   [junit4] Completed in 28.01s, 1 test, 1 failure, 3 errors <<< FAILURES!

[...truncated 824 lines...]
BUILD FAILED
C:\Users\JenkinsSlave\workspace\Lucene-Solr-4.x-Windows\build.xml:467: The following error occurred while executing this line:
C:\Users\JenkinsSlave\workspace\Lucene-Solr-4.x-Windows\build.xml:447: The following error occurred while executing this line:
C:\Users\JenkinsSlave\workspace\Lucene-Solr-4.x-Windows\build.xml:45: The following error occurred while executing this line:
C:\Users\JenkinsSlave\workspace\Lucene-Solr-4.x-Windows\extra-targets.xml:37: The following error occurred while executing this line:
C:\Users\JenkinsSlave\workspace\Lucene-Solr-4.x-Windows\solr\build.xml:189: The following error occurred while executing this line:
C:\Users\JenkinsSlave\workspace\Lucene-Solr-4.x-Windows\solr\common-build.xml:490: The following error occurred while executing this line:
C:\Users\JenkinsSlave\workspace\Lucene-Solr-4.x-Windows\lucene\common-build.xml:1276: The following error occurred while executing this line:
C:\Users\JenkinsSlave\workspace\Lucene-Solr-4.x-Windows\lucene\common-build.xml:908: There were test failures: 377 suites, 1597 tests, 3 suite-level errors, 2 errors, 1043 ignored (14 assumptions)

Total time: 46 minutes 32 seconds
Build step 'Invoke Ant' marked build as failure
Description set: Java: 32bit/jdk1.8.0 -client -XX:+UseSerialGC
Archiving artifacts
Recording test results
Email was triggered for: Failure
Sending email for trigger: Failure



Mime
View raw message