lucene-dev mailing list archives

Site index · List index
Message view « Date » · « Thread »
Top « Date » · « Thread »
From Policeman Jenkins Server <jenk...@thetaphi.de>
Subject [JENKINS] Lucene-Solr-4.x-Linux (32bit/jdk1.7.0_60-ea-b10) - Build # 9810 - Still Failing!
Date Thu, 27 Mar 2014 04:14:36 GMT
Build: http://jenkins.thetaphi.de/job/Lucene-Solr-4.x-Linux/9810/
Java: 32bit/jdk1.7.0_60-ea-b10 -server -XX:+UseConcMarkSweepGC

1 tests failed.
REGRESSION:  org.apache.lucene.analysis.core.TestRandomChains.testRandomChains

Error Message:
startOffset must be non-negative, and endOffset must be >= startOffset, startOffset=15,endOffset=14

Stack Trace:
java.lang.IllegalArgumentException: startOffset must be non-negative, and endOffset must be
>= startOffset, startOffset=15,endOffset=14
	at __randomizedtesting.SeedInfo.seed([AB4B4ED506204E76:96AA67B4413253B6]:0)
	at org.apache.lucene.analysis.tokenattributes.OffsetAttributeImpl.setOffset(OffsetAttributeImpl.java:45)
	at org.apache.lucene.analysis.shingle.ShingleFilter.incrementToken(ShingleFilter.java:345)
	at org.apache.lucene.analysis.ValidatingTokenFilter.incrementToken(ValidatingTokenFilter.java:78)
	at org.apache.lucene.analysis.pattern.PatternCaptureGroupTokenFilter.incrementToken(PatternCaptureGroupTokenFilter.java:159)
	at org.apache.lucene.analysis.ValidatingTokenFilter.incrementToken(ValidatingTokenFilter.java:78)
	at org.apache.lucene.analysis.BaseTokenStreamTestCase.checkAnalysisConsistency(BaseTokenStreamTestCase.java:700)
	at org.apache.lucene.analysis.BaseTokenStreamTestCase.checkRandomData(BaseTokenStreamTestCase.java:611)
	at org.apache.lucene.analysis.BaseTokenStreamTestCase.checkRandomData(BaseTokenStreamTestCase.java:510)
	at org.apache.lucene.analysis.core.TestRandomChains.testRandomChains(TestRandomChains.java:922)
	at sun.reflect.NativeMethodAccessorImpl.invoke0(Native Method)
	at sun.reflect.NativeMethodAccessorImpl.invoke(NativeMethodAccessorImpl.java:57)
	at sun.reflect.DelegatingMethodAccessorImpl.invoke(DelegatingMethodAccessorImpl.java:43)
	at java.lang.reflect.Method.invoke(Method.java:606)
	at com.carrotsearch.randomizedtesting.RandomizedRunner.invoke(RandomizedRunner.java:1617)
	at com.carrotsearch.randomizedtesting.RandomizedRunner$6.evaluate(RandomizedRunner.java:826)
	at com.carrotsearch.randomizedtesting.RandomizedRunner$7.evaluate(RandomizedRunner.java:862)
	at com.carrotsearch.randomizedtesting.RandomizedRunner$8.evaluate(RandomizedRunner.java:876)
	at org.apache.lucene.util.TestRuleSetupTeardownChained$1.evaluate(TestRuleSetupTeardownChained.java:50)
	at org.apache.lucene.util.TestRuleFieldCacheSanity$1.evaluate(TestRuleFieldCacheSanity.java:51)
	at org.apache.lucene.util.AbstractBeforeAfterRule$1.evaluate(AbstractBeforeAfterRule.java:46)
	at com.carrotsearch.randomizedtesting.rules.SystemPropertiesInvariantRule$1.evaluate(SystemPropertiesInvariantRule.java:55)
	at org.apache.lucene.util.TestRuleThreadAndTestName$1.evaluate(TestRuleThreadAndTestName.java:49)
	at org.apache.lucene.util.TestRuleIgnoreAfterMaxFailures$1.evaluate(TestRuleIgnoreAfterMaxFailures.java:70)
	at org.apache.lucene.util.TestRuleMarkFailure$1.evaluate(TestRuleMarkFailure.java:48)
	at com.carrotsearch.randomizedtesting.rules.StatementAdapter.evaluate(StatementAdapter.java:36)
	at com.carrotsearch.randomizedtesting.ThreadLeakControl$StatementRunner.run(ThreadLeakControl.java:359)
	at com.carrotsearch.randomizedtesting.ThreadLeakControl.forkTimeoutingTask(ThreadLeakControl.java:783)
	at com.carrotsearch.randomizedtesting.ThreadLeakControl$3.evaluate(ThreadLeakControl.java:443)
	at com.carrotsearch.randomizedtesting.RandomizedRunner.runSingleTest(RandomizedRunner.java:835)
	at com.carrotsearch.randomizedtesting.RandomizedRunner$3.evaluate(RandomizedRunner.java:737)
	at com.carrotsearch.randomizedtesting.RandomizedRunner$4.evaluate(RandomizedRunner.java:771)
	at com.carrotsearch.randomizedtesting.RandomizedRunner$5.evaluate(RandomizedRunner.java:782)
	at org.apache.lucene.util.AbstractBeforeAfterRule$1.evaluate(AbstractBeforeAfterRule.java:46)
	at org.apache.lucene.util.TestRuleStoreClassName$1.evaluate(TestRuleStoreClassName.java:42)
	at com.carrotsearch.randomizedtesting.rules.SystemPropertiesInvariantRule$1.evaluate(SystemPropertiesInvariantRule.java:55)
	at com.carrotsearch.randomizedtesting.rules.NoShadowingOrOverridesOnMethodsRule$1.evaluate(NoShadowingOrOverridesOnMethodsRule.java:39)
	at com.carrotsearch.randomizedtesting.rules.NoShadowingOrOverridesOnMethodsRule$1.evaluate(NoShadowingOrOverridesOnMethodsRule.java:39)
	at com.carrotsearch.randomizedtesting.rules.StatementAdapter.evaluate(StatementAdapter.java:36)
	at org.apache.lucene.util.TestRuleAssertionsRequired$1.evaluate(TestRuleAssertionsRequired.java:43)
	at org.apache.lucene.util.TestRuleMarkFailure$1.evaluate(TestRuleMarkFailure.java:48)
	at org.apache.lucene.util.TestRuleIgnoreAfterMaxFailures$1.evaluate(TestRuleIgnoreAfterMaxFailures.java:70)
	at org.apache.lucene.util.TestRuleIgnoreTestSuites$1.evaluate(TestRuleIgnoreTestSuites.java:55)
	at com.carrotsearch.randomizedtesting.rules.StatementAdapter.evaluate(StatementAdapter.java:36)
	at com.carrotsearch.randomizedtesting.ThreadLeakControl$StatementRunner.run(ThreadLeakControl.java:359)
	at java.lang.Thread.run(Thread.java:744)




Build Log:
[...truncated 5454 lines...]
   [junit4] Suite: org.apache.lucene.analysis.core.TestRandomChains
   [junit4]   2> TEST FAIL: useCharFilter=true text='<?</  b ug \u0306 \u0104\u3284\u8770\uf1e2'
   [junit4]   2> Exception from random analyzer: 
   [junit4]   2> charfilters=
   [junit4]   2> tokenizer=
   [junit4]   2>   org.apache.lucene.analysis.path.ReversePathHierarchyTokenizer(org.apache.lucene.analysis.core.TestRandomChains$CheckThatYouDidntReadAnythingReaderWrapper@1a8aad9)
   [junit4]   2> filters=
   [junit4]   2>   org.apache.lucene.analysis.fa.PersianNormalizationFilter(ValidatingTokenFilter@1294014
term=,bytes=[],startOffset=0,endOffset=0,positionIncrement=1)
   [junit4]   2>   org.apache.lucene.analysis.miscellaneous.WordDelimiterFilter(LUCENE_48,
ValidatingTokenFilter@1894a70 term=,bytes=[],startOffset=0,endOffset=0,positionIncrement=1,type=word,
-44, [])
   [junit4]   2>   org.apache.lucene.analysis.shingle.ShingleFilter(ValidatingTokenFilter@75ad51
term=,bytes=[],startOffset=0,endOffset=0,positionIncrement=1,type=word,positionLength=1)
   [junit4]   2>   org.apache.lucene.analysis.pattern.PatternCaptureGroupTokenFilter(ValidatingTokenFilter@6bf9a
term=,bytes=[],startOffset=0,endOffset=0,positionIncrement=1,type=word,positionLength=1, true,
[([a-z]+), ([0-9]+)])
   [junit4]   2> offsetsAreCorrect=false
   [junit4]   2> NOTE: reproduce with: ant test  -Dtestcase=TestRandomChains -Dtests.method=testRandomChains
-Dtests.seed=AB4B4ED506204E76 -Dtests.multiplier=3 -Dtests.slow=true -Dtests.locale=ar_QA
-Dtests.timezone=Europe/Amsterdam -Dtests.file.encoding=UTF-8
   [junit4] ERROR   19.2s J1 | TestRandomChains.testRandomChains <<<
   [junit4]    > Throwable #1: java.lang.IllegalArgumentException: startOffset must be
non-negative, and endOffset must be >= startOffset, startOffset=15,endOffset=14
   [junit4]    > 	at __randomizedtesting.SeedInfo.seed([AB4B4ED506204E76:96AA67B4413253B6]:0)
   [junit4]    > 	at org.apache.lucene.analysis.tokenattributes.OffsetAttributeImpl.setOffset(OffsetAttributeImpl.java:45)
   [junit4]    > 	at org.apache.lucene.analysis.shingle.ShingleFilter.incrementToken(ShingleFilter.java:345)
   [junit4]    > 	at org.apache.lucene.analysis.ValidatingTokenFilter.incrementToken(ValidatingTokenFilter.java:78)
   [junit4]    > 	at org.apache.lucene.analysis.pattern.PatternCaptureGroupTokenFilter.incrementToken(PatternCaptureGroupTokenFilter.java:159)
   [junit4]    > 	at org.apache.lucene.analysis.ValidatingTokenFilter.incrementToken(ValidatingTokenFilter.java:78)
   [junit4]    > 	at org.apache.lucene.analysis.BaseTokenStreamTestCase.checkAnalysisConsistency(BaseTokenStreamTestCase.java:700)
   [junit4]    > 	at org.apache.lucene.analysis.BaseTokenStreamTestCase.checkRandomData(BaseTokenStreamTestCase.java:611)
   [junit4]    > 	at org.apache.lucene.analysis.BaseTokenStreamTestCase.checkRandomData(BaseTokenStreamTestCase.java:510)
   [junit4]    > 	at org.apache.lucene.analysis.core.TestRandomChains.testRandomChains(TestRandomChains.java:922)
   [junit4]    > 	at java.lang.Thread.run(Thread.java:744)
   [junit4]   2> NOTE: test params are: codec=Asserting, sim=DefaultSimilarity, locale=ar_QA,
timezone=Europe/Amsterdam
   [junit4]   2> NOTE: Linux 3.8.0-37-generic i386/Oracle Corporation 1.7.0_60-ea (32-bit)/cpus=8,threads=1,free=7788288,total=83734528
   [junit4]   2> NOTE: All tests run in this JVM: [TestPrefixAwareTokenFilter, TestCollationKeyFilter,
ShingleFilterTest, TestAllAnalyzersHaveFactories, TestFilesystemResourceLoader, TestRollingCharBuffer,
TestBrazilianStemmer, TestFrenchMinimalStemFilterFactory, TestTrimFilterFactory, TestSolrSynonymParser,
TestComplexPrefix, TestPersianAnalyzer, TestFinnishLightStemFilterFactory, TestKeywordMarkerFilter,
TestPortugueseLightStemFilter, TestTurkishLowerCaseFilter, TestPortugueseLightStemFilterFactory,
TestCharArrayIterator, TestPersianCharFilter, TestKStemmer, TestGreekStemFilterFactory, TestSpanishLightStemFilter,
TestDictionary, TestArabicFilters, PatternAnalyzerTest, TestCodepointCountFilterFactory, TestPortugueseStemFilterFactory,
TestCondition, TestPortugueseAnalyzer, TestThaiTokenizerFactory, TestPatternCaptureGroupTokenFilter,
TypeAsPayloadTokenFilterTest, TestHindiAnalyzer, TestStandardAnalyzer, TestLucene47WordDelimiterFilter,
TestCollationKeyFilterFactory, TestUAX29URLEmailTokenizer, TestStandardFactories, TokenRangeSinkTokenizerTest,
TestGreekStemmer, TestWordnetSynonymParser, TestSoraniNormalizationFilter, TestPortugueseStemFilter,
TestTurkishAnalyzer, TestReverseStringFilter, TestSwedishLightStemFilter, TestGermanAnalyzer,
TestHungarianLightStemFilterFactory, TestGermanMinimalStemFilterFactory, TestFrenchLightStemFilter,
TokenTypeSinkTokenizerTest, TestDictionaryCompoundWordTokenFilterFactory, TestCharacterUtils,
TestNorwegianLightStemFilterFactory, EdgeNGramTokenizerTest, TestStemmerOverrideFilterFactory,
TestPatternReplaceFilter, TestSoraniStemFilterFactory, TestPerFieldAnalyzerWrapper, DelimitedPayloadTokenFilterTest,
TestConv, TestCommonGramsQueryFilterFactory, TestSoraniAnalyzer, TestHunspellStemFilter, TestCJKWidthFilter,
TestSnowball, TestRandomChains]
   [junit4] Completed on J1 in 93.16s, 2 tests, 1 error <<< FAILURES!

[...truncated 379 lines...]
BUILD FAILED
/mnt/ssd/jenkins/workspace/Lucene-Solr-4.x-Linux/build.xml:467: The following error occurred
while executing this line:
/mnt/ssd/jenkins/workspace/Lucene-Solr-4.x-Linux/build.xml:447: The following error occurred
while executing this line:
/mnt/ssd/jenkins/workspace/Lucene-Solr-4.x-Linux/build.xml:45: The following error occurred
while executing this line:
/mnt/ssd/jenkins/workspace/Lucene-Solr-4.x-Linux/extra-targets.xml:37: The following error
occurred while executing this line:
/mnt/ssd/jenkins/workspace/Lucene-Solr-4.x-Linux/lucene/build.xml:539: The following error
occurred while executing this line:
/mnt/ssd/jenkins/workspace/Lucene-Solr-4.x-Linux/lucene/common-build.xml:1996: The following
error occurred while executing this line:
/mnt/ssd/jenkins/workspace/Lucene-Solr-4.x-Linux/lucene/analysis/build.xml:106: The following
error occurred while executing this line:
/mnt/ssd/jenkins/workspace/Lucene-Solr-4.x-Linux/lucene/analysis/build.xml:38: The following
error occurred while executing this line:
/mnt/ssd/jenkins/workspace/Lucene-Solr-4.x-Linux/lucene/module-build.xml:60: The following
error occurred while executing this line:
/mnt/ssd/jenkins/workspace/Lucene-Solr-4.x-Linux/lucene/common-build.xml:1276: The following
error occurred while executing this line:
/mnt/ssd/jenkins/workspace/Lucene-Solr-4.x-Linux/lucene/common-build.xml:908: There were test
failures: 263 suites, 1431 tests, 1 error, 1 ignored

Total time: 23 minutes 21 seconds
Build step 'Invoke Ant' marked build as failure
Description set: Java: 32bit/jdk1.7.0_60-ea-b10 -server -XX:+UseConcMarkSweepGC
Archiving artifacts
Recording test results
Email was triggered for: Failure
Sending email for trigger: Failure



Mime
View raw message