lucene-dev mailing list archives

Site index · List index
Message view « Date » · « Thread »
Top « Date » · « Thread »
From Michael McCandless <luc...@mikemccandless.com>
Subject Re: [JENKINS] Lucene-Solr-NightlyTests-trunk - Build # 531 - Still Failing
Date Mon, 03 Mar 2014 11:10:20 GMT
I committed a fix.  With this seed the poor test got
SerialMergeScheduler, MockRandomMergePolicy, maxBufferedDocs=3, and
probably some sleeping IndexInputs.

Mike McCandless

http://blog.mikemccandless.com


On Mon, Mar 3, 2014 at 5:46 AM, Michael McCandless
<lucene@mikemccandless.com> wrote:
> I'll dig.
>
> Mike McCandless
>
> http://blog.mikemccandless.com
>
>
> On Mon, Mar 3, 2014 at 1:56 AM, Apache Jenkins Server
> <jenkins@builds.apache.org> wrote:
>> Build: https://builds.apache.org/job/Lucene-Solr-NightlyTests-trunk/531/
>>
>> 2 tests failed.
>> REGRESSION:  org.apache.lucene.facet.taxonomy.TestSearcherTaxonomyManager.testNRT
>>
>> Error Message:
>> Test abandoned because suite timeout was reached.
>>
>> Stack Trace:
>> java.lang.Exception: Test abandoned because suite timeout was reached.
>>         at __randomizedtesting.SeedInfo.seed([29A477BF2FD53737]:0)
>>
>>
>> FAILED:  junit.framework.TestSuite.org.apache.lucene.facet.taxonomy.TestSearcherTaxonomyManager
>>
>> Error Message:
>> Suite timeout exceeded (>= 7200000 msec).
>>
>> Stack Trace:
>> java.lang.Exception: Suite timeout exceeded (>= 7200000 msec).
>>         at __randomizedtesting.SeedInfo.seed([29A477BF2FD53737]:0)
>>
>>
>>
>>
>> Build Log:
>> [...truncated 7810 lines...]
>>    [junit4] Suite: org.apache.lucene.facet.taxonomy.TestSearcherTaxonomyManager
>>    [junit4]   2> 3? 03, 2014 5:56:18 ?? com.carrotsearch.randomizedtesting.ThreadLeakControl$2
evaluate
>>    [junit4]   2> WARNING: Suite execution timed out: org.apache.lucene.facet.taxonomy.TestSearcherTaxonomyManager
>>    [junit4]   2> ==== jstack at approximately timeout time ====
>>    [junit4]   2> "Thread-191" ID=228 RUNNABLE
>>    [junit4]   2>        at org.apache.lucene.util.fst.FST.readNextRealArc(FST.java:1075)
>>    [junit4]   2>        at org.apache.lucene.util.fst.FST.readFirstRealTargetArc(FST.java:985)
>>    [junit4]   2>        at org.apache.lucene.util.fst.FST.pack(FST.java:1610)
>>    [junit4]   2>        at org.apache.lucene.util.fst.Builder.finish(Builder.java:480)
>>    [junit4]   2>        at org.apache.lucene.codecs.memory.MemoryPostingsFormat$TermsWriter.finish(MemoryPostingsFormat.java:266)
>>    [junit4]   2>        at org.apache.lucene.codecs.memory.MemoryPostingsFormat$MemoryFieldsConsumer.write(MemoryPostingsFormat.java:389)
>>    [junit4]   2>        at org.apache.lucene.codecs.perfield.PerFieldPostingsFormat$FieldsWriter.write(PerFieldPostingsFormat.java:178)
>>    [junit4]   2>        at org.apache.lucene.index.SegmentMerger.mergeTerms(SegmentMerger.java:381)
>>    [junit4]   2>        at org.apache.lucene.index.SegmentMerger.merge(SegmentMerger.java:103)
>>    [junit4]   2>        at org.apache.lucene.index.IndexWriter.mergeMiddle(IndexWriter.java:4058)
>>    [junit4]   2>        at org.apache.lucene.index.IndexWriter.merge(IndexWriter.java:3655)
>>    [junit4]   2>        at org.apache.lucene.index.SerialMergeScheduler.merge(SerialMergeScheduler.java:40)
>>    [junit4]   2>        - locked org.apache.lucene.index.SerialMergeScheduler@1cac1495
>>    [junit4]   2>        at org.apache.lucene.index.IndexWriter.maybeMerge(IndexWriter.java:1935)
>>    [junit4]   2>        at org.apache.lucene.index.IndexWriter.doAfterSegmentFlushed(IndexWriter.java:4651)
>>    [junit4]   2>        at org.apache.lucene.index.DocumentsWriter$MergePendingEvent.process(DocumentsWriter.java:687)
>>    [junit4]   2>        at org.apache.lucene.index.IndexWriter.processEvents(IndexWriter.java:4674)
>>    [junit4]   2>        at org.apache.lucene.index.IndexWriter.processEvents(IndexWriter.java:4666)
>>    [junit4]   2>        at org.apache.lucene.index.IndexWriter.updateDocument(IndexWriter.java:1529)
>>    [junit4]   2>        at org.apache.lucene.index.IndexWriter.addDocument(IndexWriter.java:1198)
>>    [junit4]   2>        at org.apache.lucene.index.IndexWriter.addDocument(IndexWriter.java:1179)
>>    [junit4]   2>        at org.apache.lucene.facet.taxonomy.TestSearcherTaxonomyManager$IndexerThread.run(TestSearcherTaxonomyManager.java:93)
>>    [junit4]   2>
>>    [junit4]   2> "Thread-192" ID=229 TIMED_WAITING
>>    [junit4]   2>        at java.lang.Thread.sleep(Native Method)
>>    [junit4]   2>        at org.apache.lucene.facet.taxonomy.TestSearcherTaxonomyManager$1.run(TestSearcherTaxonomyManager.java:136)
>>    [junit4]   2>
>>    [junit4]   2> "TEST-TestSearcherTaxonomyManager.testNRT-seed#[29A477BF2FD53737]"
ID=227 RUNNABLE
>>    [junit4]   2>        at org.apache.lucene.codecs.memory.MemoryDocValuesProducer$5.get(MemoryDocValuesProducer.java:300)
>>    [junit4]   2>        at org.apache.lucene.facet.taxonomy.FastTaxonomyFacetCounts.count(FastTaxonomyFacetCounts.java:64)
>>    [junit4]   2>        at org.apache.lucene.facet.taxonomy.FastTaxonomyFacetCounts.<init>(FastTaxonomyFacetCounts.java:49)
>>    [junit4]   2>        at org.apache.lucene.facet.FacetTestCase.getTaxonomyFacetCounts(FacetTestCase.java:48)
>>    [junit4]   2>        at org.apache.lucene.facet.FacetTestCase.getTaxonomyFacetCounts(FacetTestCase.java:42)
>>    [junit4]   2>        at org.apache.lucene.facet.taxonomy.TestSearcherTaxonomyManager.testNRT(TestSearcherTaxonomyManager.java:164)
>>    [junit4]   2>        at sun.reflect.NativeMethodAccessorImpl.invoke0(Native
Method)
>>    [junit4]   2>        at sun.reflect.NativeMethodAccessorImpl.invoke(NativeMethodAccessorImpl.java:57)
>>    [junit4]   2>        at sun.reflect.DelegatingMethodAccessorImpl.invoke(DelegatingMethodAccessorImpl.java:43)
>>    [junit4]   2>        at java.lang.reflect.Method.invoke(Method.java:606)
>>    [junit4]   2>        at com.carrotsearch.randomizedtesting.RandomizedRunner.invoke(RandomizedRunner.java:1559)
>>    [junit4]   2>        at com.carrotsearch.randomizedtesting.RandomizedRunner.access$600(RandomizedRunner.java:79)
>>    [junit4]   2>        at com.carrotsearch.randomizedtesting.RandomizedRunner$6.evaluate(RandomizedRunner.java:737)
>>    [junit4]   2>        at com.carrotsearch.randomizedtesting.RandomizedRunner$7.evaluate(RandomizedRunner.java:773)
>>    [junit4]   2>        at com.carrotsearch.randomizedtesting.RandomizedRunner$8.evaluate(RandomizedRunner.java:787)
>>    [junit4]   2>        at org.apache.lucene.util.TestRuleSetupTeardownChained$1.evaluate(TestRuleSetupTeardownChained.java:50)
>>    [junit4]   2>        at org.apache.lucene.util.TestRuleFieldCacheSanity$1.evaluate(TestRuleFieldCacheSanity.java:51)
>>    [junit4]   2>        at org.apache.lucene.util.AbstractBeforeAfterRule$1.evaluate(AbstractBeforeAfterRule.java:46)
>>    [junit4]   2>        at com.carrotsearch.randomizedtesting.rules.SystemPropertiesInvariantRule$1.evaluate(SystemPropertiesInvariantRule.java:55)
>>    [junit4]   2>        at org.apache.lucene.util.TestRuleThreadAndTestName$1.evaluate(TestRuleThreadAndTestName.java:49)
>>    [junit4]   2>        at org.apache.lucene.util.TestRuleIgnoreAfterMaxFailures$1.evaluate(TestRuleIgnoreAfterMaxFailures.java:70)
>>    [junit4]   2>        at org.apache.lucene.util.TestRuleMarkFailure$1.evaluate(TestRuleMarkFailure.java:48)
>>    [junit4]   2>        at com.carrotsearch.randomizedtesting.rules.StatementAdapter.evaluate(StatementAdapter.java:36)
>>    [junit4]   2>        at com.carrotsearch.randomizedtesting.ThreadLeakControl$StatementRunner.run(ThreadLeakControl.java:358)
>>    [junit4]   2>        at com.carrotsearch.randomizedtesting.ThreadLeakControl.forkTimeoutingTask(ThreadLeakControl.java:782)
>>    [junit4]   2>        at com.carrotsearch.randomizedtesting.ThreadLeakControl$3.evaluate(ThreadLeakControl.java:442)
>>    [junit4]   2>        at com.carrotsearch.randomizedtesting.RandomizedRunner.runSingleTest(RandomizedRunner.java:746)
>>    [junit4]   2>        at com.carrotsearch.randomizedtesting.RandomizedRunner$3.evaluate(RandomizedRunner.java:648)
>>    [junit4]   2>        at com.carrotsearch.randomizedtesting.RandomizedRunner$4.evaluate(RandomizedRunner.java:682)
>>    [junit4]   2>        at com.carrotsearch.randomizedtesting.RandomizedRunner$5.evaluate(RandomizedRunner.java:693)
>>    [junit4]   2>        at org.apache.lucene.util.AbstractBeforeAfterRule$1.evaluate(AbstractBeforeAfterRule.java:46)
>>    [junit4]   2>        at org.apache.lucene.util.TestRuleStoreClassName$1.evaluate(TestRuleStoreClassName.java:42)
>>    [junit4]   2>        at com.carrotsearch.randomizedtesting.rules.SystemPropertiesInvariantRule$1.evaluate(SystemPropertiesInvariantRule.java:55)
>>    [junit4]   2>        at com.carrotsearch.randomizedtesting.rules.NoShadowingOrOverridesOnMethodsRule$1.evaluate(NoShadowingOrOverridesOnMethodsRule.java:39)
>>    [junit4]   2>        at com.carrotsearch.randomizedtesting.rules.NoShadowingOrOverridesOnMethodsRule$1.evaluate(NoShadowingOrOverridesOnMethodsRule.java:39)
>>    [junit4]   2>        at com.carrotsearch.randomizedtesting.rules.StatementAdapter.evaluate(StatementAdapter.java:36)
>>    [junit4]   2>        at org.apache.lucene.util.TestRuleAssertionsRequired$1.evaluate(TestRuleAssertionsRequired.java:43)
>>    [junit4]   2>        at org.apache.lucene.util.TestRuleMarkFailure$1.evaluate(TestRuleMarkFailure.java:48)
>>    [junit4]   2>        at org.apache.lucene.util.TestRuleIgnoreAfterMaxFailures$1.evaluate(TestRuleIgnoreAfterMaxFailures.java:70)
>>    [junit4]   2>        at org.apache.lucene.util.TestRuleIgnoreTestSuites$1.evaluate(TestRuleIgnoreTestSuites.java:55)
>>    [junit4]   2>        at com.carrotsearch.randomizedtesting.rules.StatementAdapter.evaluate(StatementAdapter.java:36)
>>    [junit4]   2>        at com.carrotsearch.randomizedtesting.ThreadLeakControl$StatementRunner.run(ThreadLeakControl.java:358)
>>    [junit4]   2>        at java.lang.Thread.run(Thread.java:724)
>>    [junit4]   2>
>>    [junit4]   2> "SUITE-TestSearcherTaxonomyManager-seed#[29A477BF2FD53737]" ID=226
RUNNABLE
>>    [junit4]   2>        at sun.management.ThreadImpl.dumpThreads0(Native Method)
>>    [junit4]   2>        at sun.management.ThreadImpl.dumpAllThreads(ThreadImpl.java:446)
>>    [junit4]   2>        at com.carrotsearch.randomizedtesting.ThreadLeakControl.formatThreadStacksFull(ThreadLeakControl.java:655)
>>    [junit4]   2>        at com.carrotsearch.randomizedtesting.ThreadLeakControl.access$800(ThreadLeakControl.java:60)
>>    [junit4]   2>        at com.carrotsearch.randomizedtesting.ThreadLeakControl$2.evaluate(ThreadLeakControl.java:396)
>>    [junit4]   2>        - locked java.lang.Object@17688e48
>>    [junit4]   2>        at com.carrotsearch.randomizedtesting.RandomizedRunner.runSuite(RandomizedRunner.java:556)
>>    [junit4]   2>        at com.carrotsearch.randomizedtesting.RandomizedRunner.access$200(RandomizedRunner.java:79)
>>    [junit4]   2>        at com.carrotsearch.randomizedtesting.RandomizedRunner$1.run(RandomizedRunner.java:492)
>>    [junit4]   2>
>>    [junit4]   2> "Signal Dispatcher" ID=4 RUNNABLE
>>    [junit4]   2>
>>    [junit4]   2> "Finalizer" ID=3 WAITING on java.lang.ref.ReferenceQueue$Lock@515524f9
>>    [junit4]   2>        at java.lang.Object.wait(Native Method)
>>    [junit4]   2>        - waiting on java.lang.ref.ReferenceQueue$Lock@515524f9
>>    [junit4]   2>        at java.lang.ref.ReferenceQueue.remove(ReferenceQueue.java:135)
>>    [junit4]   2>        at java.lang.ref.ReferenceQueue.remove(ReferenceQueue.java:151)
>>    [junit4]   2>        at java.lang.ref.Finalizer$FinalizerThread.run(Finalizer.java:189)
>>    [junit4]   2>
>>    [junit4]   2> "Reference Handler" ID=2 WAITING on java.lang.ref.Reference$Lock@2cee8126
>>    [junit4]   2>        at java.lang.Object.wait(Native Method)
>>    [junit4]   2>        - waiting on java.lang.ref.Reference$Lock@2cee8126
>>    [junit4]   2>        at java.lang.Object.wait(Object.java:503)
>>    [junit4]   2>        at java.lang.ref.Reference$ReferenceHandler.run(Reference.java:133)
>>    [junit4]   2>
>>    [junit4]   2> "main" ID=1 WAITING on com.carrotsearch.randomizedtesting.RandomizedRunner$1@3a9d05eb
>>    [junit4]   2>        at java.lang.Object.wait(Native Method)
>>    [junit4]   2>        - waiting on com.carrotsearch.randomizedtesting.RandomizedRunner$1@3a9d05eb
>>    [junit4]   2>        at java.lang.Thread.join(Thread.java:1260)
>>    [junit4]   2>        at java.lang.Thread.join(Thread.java:1334)
>>    [junit4]   2>        at com.carrotsearch.randomizedtesting.RandomizedRunner.runSuite(RandomizedRunner.java:502)
>>    [junit4]   2>        at com.carrotsearch.randomizedtesting.RandomizedRunner.run(RandomizedRunner.java:399)
>>    [junit4]   2>        at com.carrotsearch.ant.tasks.junit4.slave.SlaveMain.execute(SlaveMain.java:180)
>>    [junit4]   2>        at com.carrotsearch.ant.tasks.junit4.slave.SlaveMain.main(SlaveMain.java:275)
>>    [junit4]   2>        at com.carrotsearch.ant.tasks.junit4.slave.SlaveMainSafe.main(SlaveMainSafe.java:12)
>>    [junit4]   2>
>>    [junit4]   2> ^^==============================================
>>    [junit4]   2>
>>    [junit4]   2> NOTE: download the large Jenkins line-docs file by running 'ant
get-jenkins-line-docs' in the lucene directory.
>>    [junit4]   2> NOTE: reproduce with: ant test  -Dtestcase=TestSearcherTaxonomyManager
-Dtests.method=testNRT -Dtests.seed=29A477BF2FD53737 -Dtests.multiplier=2 -Dtests.nightly=true
-Dtests.slow=true -Dtests.linedocsfile=/home/hudson/lucene-data/enwiki.random.lines.txt -Dtests.locale=ko
-Dtests.timezone=AET -Dtests.file.encoding=UTF-8
>>    [junit4] ERROR   7200s J0 | TestSearcherTaxonomyManager.testNRT <<<
>>    [junit4]    > Throwable #1: java.lang.Exception: Test abandoned because suite
timeout was reached.
>>    [junit4]    >        at __randomizedtesting.SeedInfo.seed([29A477BF2FD53737]:0)
>>    [junit4]   2> 3? 03, 2014 5:56:18 ?? com.carrotsearch.randomizedtesting.ThreadLeakControl
checkThreadLeaks
>>    [junit4]   2> WARNING: Will linger awaiting termination of 3 leaked thread(s).
>>    [junit4]   2> 3? 03, 2014 5:56:38 ?? com.carrotsearch.randomizedtesting.ThreadLeakControl
checkThreadLeaks
>>    [junit4]   2> SEVERE: 3 threads leaked from SUITE scope at org.apache.lucene.facet.taxonomy.TestSearcherTaxonomyManager:
>>    [junit4]   2>    1) Thread[id=229, name=Thread-192, state=TIMED_WAITING, group=TGRP-TestSearcherTaxonomyManager]
>>    [junit4]   2>         at java.lang.Thread.sleep(Native Method)
>>    [junit4]   2>         at org.apache.lucene.facet.taxonomy.TestSearcherTaxonomyManager$1.run(TestSearcherTaxonomyManager.java:136)
>>    [junit4]   2>    2) Thread[id=227, name=TEST-TestSearcherTaxonomyManager.testNRT-seed#[29A477BF2FD53737],
state=RUNNABLE, group=TGRP-TestSearcherTaxonomyManager]
>>    [junit4]   2>         at org.apache.lucene.search.Scorer.score(Scorer.java:65)
>>    [junit4]   2>         at org.apache.lucene.search.IndexSearcher.search(IndexSearcher.java:613)
>>    [junit4]   2>         at org.apache.lucene.search.IndexSearcher.search(IndexSearcher.java:301)
>>    [junit4]   2>         at org.apache.lucene.facet.taxonomy.TestSearcherTaxonomyManager.testNRT(TestSearcherTaxonomyManager.java:163)
>>    [junit4]   2>         at sun.reflect.NativeMethodAccessorImpl.invoke0(Native
Method)
>>    [junit4]   2>         at sun.reflect.NativeMethodAccessorImpl.invoke(NativeMethodAccessorImpl.java:57)
>>    [junit4]   2>         at sun.reflect.DelegatingMethodAccessorImpl.invoke(DelegatingMethodAccessorImpl.java:43)
>>    [junit4]   2>         at java.lang.reflect.Method.invoke(Method.java:606)
>>    [junit4]   2>         at com.carrotsearch.randomizedtesting.RandomizedRunner.invoke(RandomizedRunner.java:1559)
>>    [junit4]   2>         at com.carrotsearch.randomizedtesting.RandomizedRunner.access$600(RandomizedRunner.java:79)
>>    [junit4]   2>         at com.carrotsearch.randomizedtesting.RandomizedRunner$6.evaluate(RandomizedRunner.java:737)
>>    [junit4]   2>         at com.carrotsearch.randomizedtesting.RandomizedRunner$7.evaluate(RandomizedRunner.java:773)
>>    [junit4]   2>         at com.carrotsearch.randomizedtesting.RandomizedRunner$8.evaluate(RandomizedRunner.java:787)
>>    [junit4]   2>         at org.apache.lucene.util.TestRuleSetupTeardownChained$1.evaluate(TestRuleSetupTeardownChained.java:50)
>>    [junit4]   2>         at org.apache.lucene.util.TestRuleFieldCacheSanity$1.evaluate(TestRuleFieldCacheSanity.java:51)
>>    [junit4]   2>         at org.apache.lucene.util.AbstractBeforeAfterRule$1.evaluate(AbstractBeforeAfterRule.java:46)
>>    [junit4]   2>         at com.carrotsearch.randomizedtesting.rules.SystemPropertiesInvariantRule$1.evaluate(SystemPropertiesInvariantRule.java:55)
>>    [junit4]   2>         at org.apache.lucene.util.TestRuleThreadAndTestName$1.evaluate(TestRuleThreadAndTestName.java:49)
>>    [junit4]   2>         at org.apache.lucene.util.TestRuleIgnoreAfterMaxFailures$1.evaluate(TestRuleIgnoreAfterMaxFailures.java:70)
>>    [junit4]   2>         at org.apache.lucene.util.TestRuleMarkFailure$1.evaluate(TestRuleMarkFailure.java:48)
>>    [junit4]   2>         at com.carrotsearch.randomizedtesting.rules.StatementAdapter.evaluate(StatementAdapter.java:36)
>>    [junit4]   2>         at com.carrotsearch.randomizedtesting.ThreadLeakControl$StatementRunner.run(ThreadLeakControl.java:358)
>>    [junit4]   2>         at com.carrotsearch.randomizedtesting.ThreadLeakControl.forkTimeoutingTask(ThreadLeakControl.java:782)
>>    [junit4]   2>         at com.carrotsearch.randomizedtesting.ThreadLeakControl$3.evaluate(ThreadLeakControl.java:442)
>>    [junit4]   2>         at com.carrotsearch.randomizedtesting.RandomizedRunner.runSingleTest(RandomizedRunner.java:746)
>>    [junit4]   2>         at com.carrotsearch.randomizedtesting.RandomizedRunner$3.evaluate(RandomizedRunner.java:648)
>>    [junit4]   2>         at com.carrotsearch.randomizedtesting.RandomizedRunner$4.evaluate(RandomizedRunner.java:682)
>>    [junit4]   2>         at com.carrotsearch.randomizedtesting.RandomizedRunner$5.evaluate(RandomizedRunner.java:693)
>>    [junit4]   2>         at org.apache.lucene.util.AbstractBeforeAfterRule$1.evaluate(AbstractBeforeAfterRule.java:46)
>>    [junit4]   2>         at org.apache.lucene.util.TestRuleStoreClassName$1.evaluate(TestRuleStoreClassName.java:42)
>>    [junit4]   2>         at com.carrotsearch.randomizedtesting.rules.SystemPropertiesInvariantRule$1.evaluate(SystemPropertiesInvariantRule.java:55)
>>    [junit4]   2>         at com.carrotsearch.randomizedtesting.rules.NoShadowingOrOverridesOnMethodsRule$1.evaluate(NoShadowingOrOverridesOnMethodsRule.java:39)
>>    [junit4]   2>         at com.carrotsearch.randomizedtesting.rules.NoShadowingOrOverridesOnMethodsRule$1.evaluate(NoShadowingOrOverridesOnMethodsRule.java:39)
>>    [junit4]   2>         at com.carrotsearch.randomizedtesting.rules.StatementAdapter.evaluate(StatementAdapter.java:36)
>>    [junit4]   2>         at org.apache.lucene.util.TestRuleAssertionsRequired$1.evaluate(TestRuleAssertionsRequired.java:43)
>>    [junit4]   2>         at org.apache.lucene.util.TestRuleMarkFailure$1.evaluate(TestRuleMarkFailure.java:48)
>>    [junit4]   2>         at org.apache.lucene.util.TestRuleIgnoreAfterMaxFailures$1.evaluate(TestRuleIgnoreAfterMaxFailures.java:70)
>>    [junit4]   2>         at org.apache.lucene.util.TestRuleIgnoreTestSuites$1.evaluate(TestRuleIgnoreTestSuites.java:55)
>>    [junit4]   2>         at com.carrotsearch.randomizedtesting.rules.StatementAdapter.evaluate(StatementAdapter.java:36)
>>    [junit4]   2>         at com.carrotsearch.randomizedtesting.ThreadLeakControl$StatementRunner.run(ThreadLeakControl.java:358)
>>    [junit4]   2>         at java.lang.Thread.run(Thread.java:724)
>>    [junit4]   2>    3) Thread[id=228, name=Thread-191, state=RUNNABLE, group=TGRP-TestSearcherTaxonomyManager]
>>    [junit4]   2>         at org.apache.lucene.util.packed.GrowableWriter.get(GrowableWriter.java:56)
>>    [junit4]   2>         at org.apache.lucene.util.packed.AbstractPagedMutable.get(AbstractPagedMutable.java:89)
>>    [junit4]   2>         at org.apache.lucene.util.fst.NodeHash.add(NodeHash.java:123)
>>    [junit4]   2>         at org.apache.lucene.util.fst.Builder.compileNode(Builder.java:197)
>>    [junit4]   2>         at org.apache.lucene.util.fst.Builder.freezeTail(Builder.java:289)
>>    [junit4]   2>         at org.apache.lucene.util.fst.Builder.add(Builder.java:394)
>>    [junit4]   2>         at org.apache.lucene.codecs.memory.MemoryPostingsFormat$TermsWriter.finishTerm(MemoryPostingsFormat.java:253)
>>    [junit4]   2>         at org.apache.lucene.codecs.memory.MemoryPostingsFormat$TermsWriter.access$500(MemoryPostingsFormat.java:108)
>>    [junit4]   2>         at org.apache.lucene.codecs.memory.MemoryPostingsFormat$MemoryFieldsConsumer.write(MemoryPostingsFormat.java:384)
>>    [junit4]   2>         at org.apache.lucene.codecs.perfield.PerFieldPostingsFormat$FieldsWriter.write(PerFieldPostingsFormat.java:178)
>>    [junit4]   2>         at org.apache.lucene.index.SegmentMerger.mergeTerms(SegmentMerger.java:381)
>>    [junit4]   2>         at org.apache.lucene.index.SegmentMerger.merge(SegmentMerger.java:103)
>>    [junit4]   2>         at org.apache.lucene.index.IndexWriter.mergeMiddle(IndexWriter.java:4058)
>>    [junit4]   2>         at org.apache.lucene.index.IndexWriter.merge(IndexWriter.java:3655)
>>    [junit4]   2>         at org.apache.lucene.index.SerialMergeScheduler.merge(SerialMergeScheduler.java:40)
>>    [junit4]   2>         at org.apache.lucene.index.IndexWriter.maybeMerge(IndexWriter.java:1935)
>>    [junit4]   2>         at org.apache.lucene.index.IndexWriter.doAfterSegmentFlushed(IndexWriter.java:4651)
>>    [junit4]   2>         at org.apache.lucene.index.DocumentsWriter$MergePendingEvent.process(DocumentsWriter.java:687)
>>    [junit4]   2>         at org.apache.lucene.index.IndexWriter.processEvents(IndexWriter.java:4674)
>>    [junit4]   2>         at org.apache.lucene.index.IndexWriter.processEvents(IndexWriter.java:4666)
>>    [junit4]   2>         at org.apache.lucene.index.IndexWriter.updateDocument(IndexWriter.java:1529)
>>    [junit4]   2>         at org.apache.lucene.index.IndexWriter.addDocument(IndexWriter.java:1198)
>>    [junit4]   2>         at org.apache.lucene.index.IndexWriter.addDocument(IndexWriter.java:1179)
>>    [junit4]   2>         at org.apache.lucene.facet.taxonomy.TestSearcherTaxonomyManager$IndexerThread.run(TestSearcherTaxonomyManager.java:93)
>>    [junit4]   2> 3? 03, 2014 5:56:38 ?? com.carrotsearch.randomizedtesting.ThreadLeakControl
tryToInterruptAll
>>    [junit4]   2> INFO: Starting to interrupt leaked threads:
>>    [junit4]   2>    1) Thread[id=229, name=Thread-192, state=TIMED_WAITING, group=TGRP-TestSearcherTaxonomyManager]
>>    [junit4]   2>    2) Thread[id=227, name=TEST-TestSearcherTaxonomyManager.testNRT-seed#[29A477BF2FD53737],
state=RUNNABLE, group=TGRP-TestSearcherTaxonomyManager]
>>    [junit4]   2>    3) Thread[id=228, name=Thread-191, state=RUNNABLE, group=TGRP-TestSearcherTaxonomyManager]
>>    [junit4]   2> 3? 03, 2014 5:56:41 ?? com.carrotsearch.randomizedtesting.ThreadLeakControl
tryToInterruptAll
>>    [junit4]   2> SEVERE: There are still zombie threads that couldn't be terminated:
>>    [junit4]   2>    1) Thread[id=227, name=TEST-TestSearcherTaxonomyManager.testNRT-seed#[29A477BF2FD53737],
state=RUNNABLE, group=TGRP-TestSearcherTaxonomyManager]
>>    [junit4]   2>         at org.apache.lucene.index.CheckIndex.checkFields(CheckIndex.java:1041)
>>    [junit4]   2>         at org.apache.lucene.index.CheckIndex.testPostings(CheckIndex.java:1239)
>>    [junit4]   2>         at org.apache.lucene.index.CheckIndex.checkIndex(CheckIndex.java:600)
>>    [junit4]   2>         at org.apache.lucene.util.TestUtil.checkIndex(TestUtil.java:221)
>>    [junit4]   2>         at org.apache.lucene.store.BaseDirectoryWrapper.close(BaseDirectoryWrapper.java:45)
>>    [junit4]   2>         at org.apache.lucene.util.IOUtils.close(IOUtils.java:139)
>>    [junit4]   2>         at org.apache.lucene.facet.taxonomy.TestSearcherTaxonomyManager.testNRT(TestSearcherTaxonomyManager.java:188)
>>    [junit4]   2>         at sun.reflect.NativeMethodAccessorImpl.invoke0(Native
Method)
>>    [junit4]   2>         at sun.reflect.NativeMethodAccessorImpl.invoke(NativeMethodAccessorImpl.java:57)
>>    [junit4]   2>         at sun.reflect.DelegatingMethodAccessorImpl.invoke(DelegatingMethodAccessorImpl.java:43)
>>    [junit4]   2>         at java.lang.reflect.Method.invoke(Method.java:606)
>>    [junit4]   2>         at com.carrotsearch.randomizedtesting.RandomizedRunner.invoke(RandomizedRunner.java:1559)
>>    [junit4]   2>         at com.carrotsearch.randomizedtesting.RandomizedRunner.access$600(RandomizedRunner.java:79)
>>    [junit4]   2>         at com.carrotsearch.randomizedtesting.RandomizedRunner$6.evaluate(RandomizedRunner.java:737)
>>    [junit4]   2>         at com.carrotsearch.randomizedtesting.RandomizedRunner$7.evaluate(RandomizedRunner.java:773)
>>    [junit4]   2>         at com.carrotsearch.randomizedtesting.RandomizedRunner$8.evaluate(RandomizedRunner.java:787)
>>    [junit4]   2>         at org.apache.lucene.util.TestRuleSetupTeardownChained$1.evaluate(TestRuleSetupTeardownChained.java:50)
>>    [junit4]   2>         at org.apache.lucene.util.TestRuleFieldCacheSanity$1.evaluate(TestRuleFieldCacheSanity.java:51)
>>    [junit4]   2>         at org.apache.lucene.util.AbstractBeforeAfterRule$1.evaluate(AbstractBeforeAfterRule.java:46)
>>    [junit4]   2>         at com.carrotsearch.randomizedtesting.rules.SystemPropertiesInvariantRule$1.evaluate(SystemPropertiesInvariantRule.java:55)
>>    [junit4]   2>         at org.apache.lucene.util.TestRuleThreadAndTestName$1.evaluate(TestRuleThreadAndTestName.java:49)
>>    [junit4]   2>         at org.apache.lucene.util.TestRuleIgnoreAfterMaxFailures$1.evaluate(TestRuleIgnoreAfterMaxFailures.java:70)
>>    [junit4]   2>         at org.apache.lucene.util.TestRuleMarkFailure$1.evaluate(TestRuleMarkFailure.java:48)
>>    [junit4]   2>         at com.carrotsearch.randomizedtesting.rules.StatementAdapter.evaluate(StatementAdapter.java:36)
>>    [junit4]   2>         at com.carrotsearch.randomizedtesting.ThreadLeakControl$StatementRunner.run(ThreadLeakControl.java:358)
>>    [junit4]   2>         at com.carrotsearch.randomizedtesting.ThreadLeakControl.forkTimeoutingTask(ThreadLeakControl.java:782)
>>    [junit4]   2>         at com.carrotsearch.randomizedtesting.ThreadLeakControl$3.evaluate(ThreadLeakControl.java:442)
>>    [junit4]   2>         at com.carrotsearch.randomizedtesting.RandomizedRunner.runSingleTest(RandomizedRunner.java:746)
>>    [junit4]   2>         at com.carrotsearch.randomizedtesting.RandomizedRunner$3.evaluate(RandomizedRunner.java:648)
>>    [junit4]   2>         at com.carrotsearch.randomizedtesting.RandomizedRunner$4.evaluate(RandomizedRunner.java:682)
>>    [junit4]   2>         at com.carrotsearch.randomizedtesting.RandomizedRunner$5.evaluate(RandomizedRunner.java:693)
>>    [junit4]   2>         at org.apache.lucene.util.AbstractBeforeAfterRule$1.evaluate(AbstractBeforeAfterRule.java:46)
>>    [junit4]   2>         at org.apache.lucene.util.TestRuleStoreClassName$1.evaluate(TestRuleStoreClassName.java:42)
>>    [junit4]   2>         at com.carrotsearch.randomizedtesting.rules.SystemPropertiesInvariantRule$1.evaluate(SystemPropertiesInvariantRule.java:55)
>>    [junit4]   2>         at com.carrotsearch.randomizedtesting.rules.NoShadowingOrOverridesOnMethodsRule$1.evaluate(NoShadowingOrOverridesOnMethodsRule.java:39)
>>    [junit4]   2>         at com.carrotsearch.randomizedtesting.rules.NoShadowingOrOverridesOnMethodsRule$1.evaluate(NoShadowingOrOverridesOnMethodsRule.java:39)
>>    [junit4]   2>         at com.carrotsearch.randomizedtesting.rules.StatementAdapter.evaluate(StatementAdapter.java:36)
>>    [junit4]   2>         at org.apache.lucene.util.TestRuleAssertionsRequired$1.evaluate(TestRuleAssertionsRequired.java:43)
>>    [junit4]   2>         at org.apache.lucene.util.TestRuleMarkFailure$1.evaluate(TestRuleMarkFailure.java:48)
>>    [junit4]   2>         at org.apache.lucene.util.TestRuleIgnoreAfterMaxFailures$1.evaluate(TestRuleIgnoreAfterMaxFailures.java:70)
>>    [junit4]   2>         at org.apache.lucene.util.TestRuleIgnoreTestSuites$1.evaluate(TestRuleIgnoreTestSuites.java:55)
>>    [junit4]   2>         at com.carrotsearch.randomizedtesting.rules.StatementAdapter.evaluate(StatementAdapter.java:36)
>>    [junit4]   2>         at com.carrotsearch.randomizedtesting.ThreadLeakControl$StatementRunner.run(ThreadLeakControl.java:358)
>>    [junit4]   2>         at java.lang.Thread.run(Thread.java:724)
>>    [junit4]   2> NOTE: test params are: codec=Lucene46: {$payloads$=PostingsFormat(name=Direct),
$full_path$=PostingsFormat(name=Lucene41VarGapFixedInterval), $facets=PostingsFormat(name=Memory
doPackFST= true)}, docValues:{$facets=DocValuesFormat(name=Memory)}, sim=RandomSimilarityProvider(queryNorm=false,coord=no):
{}, locale=ko, timezone=AET
>>    [junit4]   2> NOTE: FreeBSD 9.1-RELEASE-p3 amd64/Oracle Corporation 1.7.0_25
(64-bit)/cpus=16,threads=2,free=161220360,total=501481472
>>    [junit4]   2> NOTE: All tests run in this JVM: [TestFacetLabel, TestFacetsConfig,
TestCharBlockArray, TestCachedOrdinalsReader, TestTaxonomyFacetAssociations, TestAddTaxonomy,
TestDirectoryTaxonomyWriter, TestConcurrentFacetedIndexing, TestDirectoryTaxonomyReader, TestDrillSideways,
TestMultipleIndexFields, TestSortedSetDocValuesFacets, TestSearcherTaxonomyManager]
>>    [junit4]   2> NOTE: download the large Jenkins line-docs file by running 'ant
get-jenkins-line-docs' in the lucene directory.
>>    [junit4]   2> NOTE: reproduce with: ant test  -Dtestcase=TestSearcherTaxonomyManager
-Dtests.seed=29A477BF2FD53737 -Dtests.multiplier=2 -Dtests.nightly=true -Dtests.slow=true
-Dtests.linedocsfile=/home/hudson/lucene-data/enwiki.random.lines.txt -Dtests.locale=ko -Dtests.timezone=AET
-Dtests.file.encoding=UTF-8
>>    [junit4] ERROR   0.00s J0 | TestSearcherTaxonomyManager (suite) <<<
>>    [junit4]    > Throwable #1: java.lang.Exception: Suite timeout exceeded (>=
7200000 msec).
>>    [junit4]    >        at __randomizedtesting.SeedInfo.seed([29A477BF2FD53737]:0)
>>    [junit4] Completed on J0 in 7223.15s, 2 tests, 2 errors <<< FAILURES!
>>
>> [...truncated 11 lines...]
>> BUILD FAILED
>> /usr/home/hudson/hudson-slave/workspace/Lucene-Solr-NightlyTests-trunk/build.xml:472:
The following error occurred while executing this line:
>> /usr/home/hudson/hudson-slave/workspace/Lucene-Solr-NightlyTests-trunk/build.xml:445:
The following error occurred while executing this line:
>> /usr/home/hudson/hudson-slave/workspace/Lucene-Solr-NightlyTests-trunk/build.xml:39:
The following error occurred while executing this line:
>> /usr/home/hudson/hudson-slave/workspace/Lucene-Solr-NightlyTests-trunk/extra-targets.xml:37:
The following error occurred while executing this line:
>> /usr/home/hudson/hudson-slave/workspace/Lucene-Solr-NightlyTests-trunk/lucene/build.xml:539:
The following error occurred while executing this line:
>> /usr/home/hudson/hudson-slave/workspace/Lucene-Solr-NightlyTests-trunk/lucene/common-build.xml:1995:
The following error occurred while executing this line:
>> /usr/home/hudson/hudson-slave/workspace/Lucene-Solr-NightlyTests-trunk/lucene/module-build.xml:60:
The following error occurred while executing this line:
>> /usr/home/hudson/hudson-slave/workspace/Lucene-Solr-NightlyTests-trunk/lucene/common-build.xml:1274:
The following error occurred while executing this line:
>> /usr/home/hudson/hudson-slave/workspace/Lucene-Solr-NightlyTests-trunk/lucene/common-build.xml:907:
There were test failures: 21 suites, 150 tests, 1 suite-level error, 1 error, 6 ignored (6
assumptions)
>>
>> Total time: 200 minutes 38 seconds
>> Build step 'Invoke Ant' marked build as failure
>> Archiving artifacts
>> Recording test results
>> Email was triggered for: Failure
>> Sending email for trigger: Failure
>>
>>
>>
>>
>> ---------------------------------------------------------------------
>> To unsubscribe, e-mail: dev-unsubscribe@lucene.apache.org
>> For additional commands, e-mail: dev-help@lucene.apache.org

---------------------------------------------------------------------
To unsubscribe, e-mail: dev-unsubscribe@lucene.apache.org
For additional commands, e-mail: dev-help@lucene.apache.org


Mime
View raw message