lucene-dev mailing list archives

Site index · List index
Message view « Date » · « Thread »
Top « Date » · « Thread »
From Michael McCandless <luc...@mikemccandless.com>
Subject Re: [JENKINS] Lucene-Solr-NightlyTests-4.x - Build # 541 - Still Failing
Date Thu, 20 Mar 2014 15:45:29 GMT
I committed a fix.

Mike McCandless

http://blog.mikemccandless.com


On Wed, Mar 19, 2014 at 6:33 PM, Apache Jenkins Server
<jenkins@builds.apache.org> wrote:
> Build: https://builds.apache.org/job/Lucene-Solr-NightlyTests-4.x/541/
>
> 1 tests failed.
> REGRESSION:  org.apache.lucene.replicator.LocalReplicatorTest.testObtainMissingFile
>
> Error Message:
> /usr/home/hudson/hudson-slave/workspace/Lucene-Solr-NightlyTests-4.x/lucene/build/replicator/test/J1/index3004630048tmp/madeUpFile
>
> Stack Trace:
> java.nio.file.NoSuchFileException: /usr/home/hudson/hudson-slave/workspace/Lucene-Solr-NightlyTests-4.x/lucene/build/replicator/test/J1/index3004630048tmp/madeUpFile
>         at __randomizedtesting.SeedInfo.seed([441C78757690D0BA:621FD230CEC36F9D]:0)
>         at sun.nio.fs.UnixException.translateToIOException(UnixException.java:86)
>         at sun.nio.fs.UnixException.rethrowAsIOException(UnixException.java:102)
>         at sun.nio.fs.UnixException.rethrowAsIOException(UnixException.java:107)
>         at sun.nio.fs.UnixFileSystemProvider.newFileChannel(UnixFileSystemProvider.java:176)
>         at java.nio.channels.FileChannel.open(FileChannel.java:287)
>         at java.nio.channels.FileChannel.open(FileChannel.java:334)
>         at org.apache.lucene.store.NIOFSDirectory.openInput(NIOFSDirectory.java:82)
>         at org.apache.lucene.store.FilterDirectory.openInput(FilterDirectory.java:80)
>         at org.apache.lucene.replicator.IndexRevision.open(IndexRevision.java:136)
>         at org.apache.lucene.replicator.LocalReplicator.obtainFile(LocalReplicator.java:198)
>         at org.apache.lucene.replicator.LocalReplicatorTest.testObtainMissingFile(LocalReplicatorTest.java:155)
>         at sun.reflect.NativeMethodAccessorImpl.invoke0(Native Method)
>         at sun.reflect.NativeMethodAccessorImpl.invoke(NativeMethodAccessorImpl.java:57)
>         at sun.reflect.DelegatingMethodAccessorImpl.invoke(DelegatingMethodAccessorImpl.java:43)
>         at java.lang.reflect.Method.invoke(Method.java:606)
>         at com.carrotsearch.randomizedtesting.RandomizedRunner.invoke(RandomizedRunner.java:1617)
>         at com.carrotsearch.randomizedtesting.RandomizedRunner$6.evaluate(RandomizedRunner.java:826)
>         at com.carrotsearch.randomizedtesting.RandomizedRunner$7.evaluate(RandomizedRunner.java:862)
>         at com.carrotsearch.randomizedtesting.RandomizedRunner$8.evaluate(RandomizedRunner.java:876)
>         at org.apache.lucene.util.TestRuleSetupTeardownChained$1.evaluate(TestRuleSetupTeardownChained.java:50)
>         at org.apache.lucene.util.TestRuleFieldCacheSanity$1.evaluate(TestRuleFieldCacheSanity.java:51)
>         at org.apache.lucene.util.AbstractBeforeAfterRule$1.evaluate(AbstractBeforeAfterRule.java:46)
>         at com.carrotsearch.randomizedtesting.rules.SystemPropertiesInvariantRule$1.evaluate(SystemPropertiesInvariantRule.java:55)
>         at org.apache.lucene.util.TestRuleThreadAndTestName$1.evaluate(TestRuleThreadAndTestName.java:49)
>         at org.apache.lucene.util.TestRuleIgnoreAfterMaxFailures$1.evaluate(TestRuleIgnoreAfterMaxFailures.java:70)
>         at org.apache.lucene.util.TestRuleMarkFailure$1.evaluate(TestRuleMarkFailure.java:48)
>         at com.carrotsearch.randomizedtesting.rules.StatementAdapter.evaluate(StatementAdapter.java:36)
>         at com.carrotsearch.randomizedtesting.ThreadLeakControl$StatementRunner.run(ThreadLeakControl.java:359)
>         at com.carrotsearch.randomizedtesting.ThreadLeakControl.forkTimeoutingTask(ThreadLeakControl.java:783)
>         at com.carrotsearch.randomizedtesting.ThreadLeakControl$3.evaluate(ThreadLeakControl.java:443)
>         at com.carrotsearch.randomizedtesting.RandomizedRunner.runSingleTest(RandomizedRunner.java:835)
>         at com.carrotsearch.randomizedtesting.RandomizedRunner$3.evaluate(RandomizedRunner.java:737)
>         at com.carrotsearch.randomizedtesting.RandomizedRunner$4.evaluate(RandomizedRunner.java:771)
>         at com.carrotsearch.randomizedtesting.RandomizedRunner$5.evaluate(RandomizedRunner.java:782)
>         at org.apache.lucene.util.AbstractBeforeAfterRule$1.evaluate(AbstractBeforeAfterRule.java:46)
>         at org.apache.lucene.util.TestRuleStoreClassName$1.evaluate(TestRuleStoreClassName.java:42)
>         at com.carrotsearch.randomizedtesting.rules.SystemPropertiesInvariantRule$1.evaluate(SystemPropertiesInvariantRule.java:55)
>         at com.carrotsearch.randomizedtesting.rules.NoShadowingOrOverridesOnMethodsRule$1.evaluate(NoShadowingOrOverridesOnMethodsRule.java:39)
>         at com.carrotsearch.randomizedtesting.rules.NoShadowingOrOverridesOnMethodsRule$1.evaluate(NoShadowingOrOverridesOnMethodsRule.java:39)
>         at com.carrotsearch.randomizedtesting.rules.StatementAdapter.evaluate(StatementAdapter.java:36)
>         at org.apache.lucene.util.TestRuleAssertionsRequired$1.evaluate(TestRuleAssertionsRequired.java:43)
>         at org.apache.lucene.util.TestRuleMarkFailure$1.evaluate(TestRuleMarkFailure.java:48)
>         at org.apache.lucene.util.TestRuleIgnoreAfterMaxFailures$1.evaluate(TestRuleIgnoreAfterMaxFailures.java:70)
>         at org.apache.lucene.util.TestRuleIgnoreTestSuites$1.evaluate(TestRuleIgnoreTestSuites.java:55)
>         at com.carrotsearch.randomizedtesting.rules.StatementAdapter.evaluate(StatementAdapter.java:36)
>         at com.carrotsearch.randomizedtesting.ThreadLeakControl$StatementRunner.run(ThreadLeakControl.java:359)
>         at java.lang.Thread.run(Thread.java:724)
>
>
>
>
> Build Log:
> [...truncated 9061 lines...]
>    [junit4] Suite: org.apache.lucene.replicator.LocalReplicatorTest
>    [junit4]   2> NOTE: download the large Jenkins line-docs file by running 'ant get-jenkins-line-docs'
in the lucene directory.
>    [junit4]   2> NOTE: reproduce with: ant test  -Dtestcase=LocalReplicatorTest -Dtests.method=testObtainMissingFile
-Dtests.seed=441C78757690D0BA -Dtests.multiplier=2 -Dtests.nightly=true -Dtests.slow=true
-Dtests.linedocsfile=/home/hudson/lucene-data/enwiki.random.lines.txt -Dtests.locale=no_NO_NY
-Dtests.timezone=SST -Dtests.file.encoding=UTF-8
>    [junit4] ERROR   0.14s J1 | LocalReplicatorTest.testObtainMissingFile <<<
>    [junit4]    > Throwable #1: java.nio.file.NoSuchFileException: /usr/home/hudson/hudson-slave/workspace/Lucene-Solr-NightlyTests-4.x/lucene/build/replicator/test/J1/index3004630048tmp/madeUpFile
>    [junit4]    >        at __randomizedtesting.SeedInfo.seed([441C78757690D0BA:621FD230CEC36F9D]:0)
>    [junit4]    >        at sun.nio.fs.UnixException.translateToIOException(UnixException.java:86)
>    [junit4]    >        at sun.nio.fs.UnixException.rethrowAsIOException(UnixException.java:102)
>    [junit4]    >        at sun.nio.fs.UnixException.rethrowAsIOException(UnixException.java:107)
>    [junit4]    >        at sun.nio.fs.UnixFileSystemProvider.newFileChannel(UnixFileSystemProvider.java:176)
>    [junit4]    >        at java.nio.channels.FileChannel.open(FileChannel.java:287)
>    [junit4]    >        at java.nio.channels.FileChannel.open(FileChannel.java:334)
>    [junit4]    >        at org.apache.lucene.store.NIOFSDirectory.openInput(NIOFSDirectory.java:82)
>    [junit4]    >        at org.apache.lucene.store.FilterDirectory.openInput(FilterDirectory.java:80)
>    [junit4]    >        at org.apache.lucene.replicator.IndexRevision.open(IndexRevision.java:136)
>    [junit4]    >        at org.apache.lucene.replicator.LocalReplicator.obtainFile(LocalReplicator.java:198)
>    [junit4]    >        at org.apache.lucene.replicator.LocalReplicatorTest.testObtainMissingFile(LocalReplicatorTest.java:155)
>    [junit4]    >        at java.lang.Thread.run(Thread.java:724)
>    [junit4]   2> NOTE: test params are: codec=Lucene42, sim=DefaultSimilarity, locale=no_NO_NY,
timezone=SST
>    [junit4]   2> NOTE: FreeBSD 9.1-RELEASE-p3 amd64/Oracle Corporation 1.7.0_25 (64-bit)/cpus=16,threads=1,free=143578584,total=195624960
>    [junit4]   2> NOTE: All tests run in this JVM: [LocalReplicatorTest]
>    [junit4] Completed on J1 in 2.37s, 10 tests, 1 error <<< FAILURES!
>
> [...truncated 28 lines...]
> BUILD FAILED
> /usr/home/hudson/hudson-slave/workspace/Lucene-Solr-NightlyTests-4.x/build.xml:474: The
following error occurred while executing this line:
> /usr/home/hudson/hudson-slave/workspace/Lucene-Solr-NightlyTests-4.x/build.xml:447: The
following error occurred while executing this line:
> /usr/home/hudson/hudson-slave/workspace/Lucene-Solr-NightlyTests-4.x/build.xml:45: The
following error occurred while executing this line:
> /usr/home/hudson/hudson-slave/workspace/Lucene-Solr-NightlyTests-4.x/extra-targets.xml:37:
The following error occurred while executing this line:
> /usr/home/hudson/hudson-slave/workspace/Lucene-Solr-NightlyTests-4.x/lucene/build.xml:539:
The following error occurred while executing this line:
> /usr/home/hudson/hudson-slave/workspace/Lucene-Solr-NightlyTests-4.x/lucene/common-build.xml:1996:
The following error occurred while executing this line:
> /usr/home/hudson/hudson-slave/workspace/Lucene-Solr-NightlyTests-4.x/lucene/module-build.xml:60:
The following error occurred while executing this line:
> /usr/home/hudson/hudson-slave/workspace/Lucene-Solr-NightlyTests-4.x/lucene/common-build.xml:1276:
The following error occurred while executing this line:
> /usr/home/hudson/hudson-slave/workspace/Lucene-Solr-NightlyTests-4.x/lucene/common-build.xml:908:
There were test failures: 7 suites, 30 tests, 1 error
>
> Total time: 86 minutes 5 seconds
> Build step 'Invoke Ant' marked build as failure
> Archiving artifacts
> Recording test results
> Email was triggered for: Failure
> Sending email for trigger: Failure
>
>
>
>
> ---------------------------------------------------------------------
> To unsubscribe, e-mail: dev-unsubscribe@lucene.apache.org
> For additional commands, e-mail: dev-help@lucene.apache.org

---------------------------------------------------------------------
To unsubscribe, e-mail: dev-unsubscribe@lucene.apache.org
For additional commands, e-mail: dev-help@lucene.apache.org


Mime
View raw message