lucene-dev mailing list archives

Site index · List index
Message view « Date » · « Thread »
Top « Date » · « Thread »
From Policeman Jenkins Server <jenk...@thetaphi.de>
Subject [JENKINS] Lucene-Solr-trunk-Linux (32bit/jdk1.8.0_20-ea-b05) - Build # 10165 - Failure!
Date Sat, 26 Apr 2014 12:48:38 GMT
Build: http://jenkins.thetaphi.de/job/Lucene-Solr-trunk-Linux/10165/
Java: 32bit/jdk1.8.0_20-ea-b05 -client -XX:+UseConcMarkSweepGC

2 tests failed.
REGRESSION:  org.apache.solr.cloud.CollectionsAPIDistributedZkTest.testDistribSearch

Error Message:
createcollection the collection error [Watcher fired on path: null state: SyncConnected type None]

Stack Trace:
org.apache.solr.client.solrj.impl.HttpSolrServer$RemoteSolrException: createcollection the collection error [Watcher fired on path: null state: SyncConnected type None]
	at __randomizedtesting.SeedInfo.seed([D35961A95B891665:52BFEFB12CD67659]:0)
	at org.apache.solr.client.solrj.impl.HttpSolrServer.executeMethod(HttpSolrServer.java:554)
	at org.apache.solr.client.solrj.impl.HttpSolrServer.request(HttpSolrServer.java:210)
	at org.apache.solr.client.solrj.impl.HttpSolrServer.request(HttpSolrServer.java:206)
	at org.apache.solr.client.solrj.request.CollectionAdminRequest.process(CollectionAdminRequest.java:300)
	at org.apache.solr.client.solrj.request.CollectionAdminRequest.createCollection(CollectionAdminRequest.java:360)
	at org.apache.solr.client.solrj.request.CollectionAdminRequest.createCollection(CollectionAdminRequest.java:346)
	at org.apache.solr.cloud.CollectionsAPIDistributedZkTest.testSolrJAPICalls(CollectionsAPIDistributedZkTest.java:298)
	at org.apache.solr.cloud.CollectionsAPIDistributedZkTest.doTest(CollectionsAPIDistributedZkTest.java:201)
	at org.apache.solr.BaseDistributedSearchTestCase.testDistribSearch(BaseDistributedSearchTestCase.java:865)
	at sun.reflect.NativeMethodAccessorImpl.invoke0(Native Method)
	at sun.reflect.NativeMethodAccessorImpl.invoke(NativeMethodAccessorImpl.java:62)
	at sun.reflect.DelegatingMethodAccessorImpl.invoke(DelegatingMethodAccessorImpl.java:43)
	at java.lang.reflect.Method.invoke(Method.java:483)
	at com.carrotsearch.randomizedtesting.RandomizedRunner.invoke(RandomizedRunner.java:1618)
	at com.carrotsearch.randomizedtesting.RandomizedRunner$6.evaluate(RandomizedRunner.java:827)
	at com.carrotsearch.randomizedtesting.RandomizedRunner$7.evaluate(RandomizedRunner.java:863)
	at com.carrotsearch.randomizedtesting.RandomizedRunner$8.evaluate(RandomizedRunner.java:877)
	at com.carrotsearch.randomizedtesting.rules.SystemPropertiesRestoreRule$1.evaluate(SystemPropertiesRestoreRule.java:53)
	at org.apache.lucene.util.TestRuleSetupTeardownChained$1.evaluate(TestRuleSetupTeardownChained.java:50)
	at org.apache.lucene.util.TestRuleFieldCacheSanity$1.evaluate(TestRuleFieldCacheSanity.java:51)
	at org.apache.lucene.util.AbstractBeforeAfterRule$1.evaluate(AbstractBeforeAfterRule.java:46)
	at com.carrotsearch.randomizedtesting.rules.SystemPropertiesInvariantRule$1.evaluate(SystemPropertiesInvariantRule.java:55)
	at org.apache.lucene.util.TestRuleThreadAndTestName$1.evaluate(TestRuleThreadAndTestName.java:49)
	at org.apache.lucene.util.TestRuleIgnoreAfterMaxFailures$1.evaluate(TestRuleIgnoreAfterMaxFailures.java:65)
	at org.apache.lucene.util.TestRuleMarkFailure$1.evaluate(TestRuleMarkFailure.java:48)
	at com.carrotsearch.randomizedtesting.rules.StatementAdapter.evaluate(StatementAdapter.java:36)
	at com.carrotsearch.randomizedtesting.ThreadLeakControl$StatementRunner.run(ThreadLeakControl.java:360)
	at com.carrotsearch.randomizedtesting.ThreadLeakControl.forkTimeoutingTask(ThreadLeakControl.java:793)
	at com.carrotsearch.randomizedtesting.ThreadLeakControl$3.evaluate(ThreadLeakControl.java:453)
	at com.carrotsearch.randomizedtesting.RandomizedRunner.runSingleTest(RandomizedRunner.java:836)
	at com.carrotsearch.randomizedtesting.RandomizedRunner$3.evaluate(RandomizedRunner.java:738)
	at com.carrotsearch.randomizedtesting.RandomizedRunner$4.evaluate(RandomizedRunner.java:772)
	at com.carrotsearch.randomizedtesting.RandomizedRunner$5.evaluate(RandomizedRunner.java:783)
	at com.carrotsearch.randomizedtesting.rules.StatementAdapter.evaluate(StatementAdapter.java:36)
	at com.carrotsearch.randomizedtesting.rules.SystemPropertiesRestoreRule$1.evaluate(SystemPropertiesRestoreRule.java:53)
	at org.apache.lucene.util.AbstractBeforeAfterRule$1.evaluate(AbstractBeforeAfterRule.java:46)
	at org.apache.lucene.util.TestRuleStoreClassName$1.evaluate(TestRuleStoreClassName.java:42)
	at com.carrotsearch.randomizedtesting.rules.SystemPropertiesInvariantRule$1.evaluate(SystemPropertiesInvariantRule.java:55)
	at com.carrotsearch.randomizedtesting.rules.NoShadowingOrOverridesOnMethodsRule$1.evaluate(NoShadowingOrOverridesOnMethodsRule.java:39)
	at com.carrotsearch.randomizedtesting.rules.NoShadowingOrOverridesOnMethodsRule$1.evaluate(NoShadowingOrOverridesOnMethodsRule.java:39)
	at com.carrotsearch.randomizedtesting.rules.StatementAdapter.evaluate(StatementAdapter.java:36)
	at com.carrotsearch.randomizedtesting.rules.StatementAdapter.evaluate(StatementAdapter.java:36)
	at org.apache.lucene.util.TestRuleAssertionsRequired$1.evaluate(TestRuleAssertionsRequired.java:43)
	at org.apache.lucene.util.TestRuleMarkFailure$1.evaluate(TestRuleMarkFailure.java:48)
	at org.apache.lucene.util.TestRuleIgnoreAfterMaxFailures$1.evaluate(TestRuleIgnoreAfterMaxFailures.java:65)
	at org.apache.lucene.util.TestRuleIgnoreTestSuites$1.evaluate(TestRuleIgnoreTestSuites.java:55)
	at com.carrotsearch.randomizedtesting.rules.StatementAdapter.evaluate(StatementAdapter.java:36)
	at com.carrotsearch.randomizedtesting.ThreadLeakControl$StatementRunner.run(ThreadLeakControl.java:360)
	at java.lang.Thread.run(Thread.java:744)


REGRESSION:  org.apache.solr.cloud.OverseerRolesTest.testDistribSearch

Error Message:
could not set the new overseer . expected 127.0.0.1:44432_ current order : [127.0.0.1:44432_, 127.0.0.1:59800_, 127.0.0.1:59772_, 127.0.0.1:46378_, 127.0.0.1:37392_, 127.0.0.1:45156_, 127.0.0.1:33789_] ldr :null

Stack Trace:
java.lang.AssertionError: could not set the new overseer . expected 127.0.0.1:44432_ current order : [127.0.0.1:44432_, 127.0.0.1:59800_, 127.0.0.1:59772_, 127.0.0.1:46378_, 127.0.0.1:37392_, 127.0.0.1:45156_, 127.0.0.1:33789_] ldr :null
	at __randomizedtesting.SeedInfo.seed([D35961A95B891665:52BFEFB12CD67659]:0)
	at org.junit.Assert.fail(Assert.java:93)
	at org.junit.Assert.assertTrue(Assert.java:43)
	at org.apache.solr.cloud.OverseerRolesTest.testOverseerRole(OverseerRolesTest.java:158)
	at org.apache.solr.cloud.OverseerRolesTest.doTest(OverseerRolesTest.java:94)
	at org.apache.solr.BaseDistributedSearchTestCase.testDistribSearch(BaseDistributedSearchTestCase.java:865)
	at sun.reflect.NativeMethodAccessorImpl.invoke0(Native Method)
	at sun.reflect.NativeMethodAccessorImpl.invoke(NativeMethodAccessorImpl.java:62)
	at sun.reflect.DelegatingMethodAccessorImpl.invoke(DelegatingMethodAccessorImpl.java:43)
	at java.lang.reflect.Method.invoke(Method.java:483)
	at com.carrotsearch.randomizedtesting.RandomizedRunner.invoke(RandomizedRunner.java:1618)
	at com.carrotsearch.randomizedtesting.RandomizedRunner$6.evaluate(RandomizedRunner.java:827)
	at com.carrotsearch.randomizedtesting.RandomizedRunner$7.evaluate(RandomizedRunner.java:863)
	at com.carrotsearch.randomizedtesting.RandomizedRunner$8.evaluate(RandomizedRunner.java:877)
	at com.carrotsearch.randomizedtesting.rules.SystemPropertiesRestoreRule$1.evaluate(SystemPropertiesRestoreRule.java:53)
	at org.apache.lucene.util.TestRuleSetupTeardownChained$1.evaluate(TestRuleSetupTeardownChained.java:50)
	at org.apache.lucene.util.TestRuleFieldCacheSanity$1.evaluate(TestRuleFieldCacheSanity.java:51)
	at org.apache.lucene.util.AbstractBeforeAfterRule$1.evaluate(AbstractBeforeAfterRule.java:46)
	at com.carrotsearch.randomizedtesting.rules.SystemPropertiesInvariantRule$1.evaluate(SystemPropertiesInvariantRule.java:55)
	at org.apache.lucene.util.TestRuleThreadAndTestName$1.evaluate(TestRuleThreadAndTestName.java:49)
	at org.apache.lucene.util.TestRuleIgnoreAfterMaxFailures$1.evaluate(TestRuleIgnoreAfterMaxFailures.java:65)
	at org.apache.lucene.util.TestRuleMarkFailure$1.evaluate(TestRuleMarkFailure.java:48)
	at com.carrotsearch.randomizedtesting.rules.StatementAdapter.evaluate(StatementAdapter.java:36)
	at com.carrotsearch.randomizedtesting.ThreadLeakControl$StatementRunner.run(ThreadLeakControl.java:360)
	at com.carrotsearch.randomizedtesting.ThreadLeakControl.forkTimeoutingTask(ThreadLeakControl.java:793)
	at com.carrotsearch.randomizedtesting.ThreadLeakControl$3.evaluate(ThreadLeakControl.java:453)
	at com.carrotsearch.randomizedtesting.RandomizedRunner.runSingleTest(RandomizedRunner.java:836)
	at com.carrotsearch.randomizedtesting.RandomizedRunner$3.evaluate(RandomizedRunner.java:738)
	at com.carrotsearch.randomizedtesting.RandomizedRunner$4.evaluate(RandomizedRunner.java:772)
	at com.carrotsearch.randomizedtesting.RandomizedRunner$5.evaluate(RandomizedRunner.java:783)
	at com.carrotsearch.randomizedtesting.rules.StatementAdapter.evaluate(StatementAdapter.java:36)
	at com.carrotsearch.randomizedtesting.rules.SystemPropertiesRestoreRule$1.evaluate(SystemPropertiesRestoreRule.java:53)
	at org.apache.lucene.util.AbstractBeforeAfterRule$1.evaluate(AbstractBeforeAfterRule.java:46)
	at org.apache.lucene.util.TestRuleStoreClassName$1.evaluate(TestRuleStoreClassName.java:42)
	at com.carrotsearch.randomizedtesting.rules.SystemPropertiesInvariantRule$1.evaluate(SystemPropertiesInvariantRule.java:55)
	at com.carrotsearch.randomizedtesting.rules.NoShadowingOrOverridesOnMethodsRule$1.evaluate(NoShadowingOrOverridesOnMethodsRule.java:39)
	at com.carrotsearch.randomizedtesting.rules.NoShadowingOrOverridesOnMethodsRule$1.evaluate(NoShadowingOrOverridesOnMethodsRule.java:39)
	at com.carrotsearch.randomizedtesting.rules.StatementAdapter.evaluate(StatementAdapter.java:36)
	at com.carrotsearch.randomizedtesting.rules.StatementAdapter.evaluate(StatementAdapter.java:36)
	at org.apache.lucene.util.TestRuleAssertionsRequired$1.evaluate(TestRuleAssertionsRequired.java:43)
	at org.apache.lucene.util.TestRuleMarkFailure$1.evaluate(TestRuleMarkFailure.java:48)
	at org.apache.lucene.util.TestRuleIgnoreAfterMaxFailures$1.evaluate(TestRuleIgnoreAfterMaxFailures.java:65)
	at org.apache.lucene.util.TestRuleIgnoreTestSuites$1.evaluate(TestRuleIgnoreTestSuites.java:55)
	at com.carrotsearch.randomizedtesting.rules.StatementAdapter.evaluate(StatementAdapter.java:36)
	at com.carrotsearch.randomizedtesting.ThreadLeakControl$StatementRunner.run(ThreadLeakControl.java:360)
	at java.lang.Thread.run(Thread.java:744)




Build Log:
[...truncated 11332 lines...]
   [junit4] Suite: org.apache.solr.cloud.CollectionsAPIDistributedZkTest
   [junit4]   2> Creating dataDir: /mnt/ssd/jenkins/workspace/Lucene-Solr-trunk-Linux/solr/build/solr-core/test/J1/./solr.cloud.CollectionsAPIDistributedZkTest-D35961A95B891665-001/init-core-data-001
   [junit4]   2> 909864 T3213 oas.SolrTestCaseJ4.buildSSLConfig Randomized ssl (false) and clientAuth (false)
   [junit4]   2> 909865 T3213 oas.BaseDistributedSearchTestCase.initHostContext Setting hostContext system property: /lg/g
   [junit4]   2> 909874 T3213 oas.SolrTestCaseJ4.setUp ###Starting testDistribSearch
   [junit4]   2> 909875 T3213 oasc.ZkTestServer.run STARTING ZK TEST SERVER
   [junit4]   2> 909876 T3214 oasc.ZkTestServer$ZKServerMain.runFromConfig Starting server
   [junit4]   2> 909976 T3213 oasc.ZkTestServer.run start zk server on port:33223
   [junit4]   2> 909977 T3213 oascc.ConnectionManager.waitForConnected Waiting for client to connect to ZooKeeper
   [junit4]   2> 917729 T3217 oazsp.FileTxnLog.commit WARN fsync-ing the write ahead log in SyncThread:0 took 7750ms which will adversely effect operation latency. See the ZooKeeper troubleshooting guide
   [junit4]   2> 917732 T3220 oascc.ConnectionManager.process Watcher org.apache.solr.common.cloud.ConnectionManager@23a2ed name:ZooKeeperConnection Watcher:127.0.0.1:33223 got event WatchedEvent state:SyncConnected type:None path:null path:null type:None
   [junit4]   2> 917732 T3213 oascc.ConnectionManager.waitForConnected Client is connected to ZooKeeper
   [junit4]   2> 917733 T3213 oascc.SolrZkClient.makePath makePath: /solr
   [junit4]   2> 917738 T3213 oascc.ConnectionManager.waitForConnected Waiting for client to connect to ZooKeeper
   [junit4]   2> 917743 T3222 oascc.ConnectionManager.process Watcher org.apache.solr.common.cloud.ConnectionManager@15c6a1b name:ZooKeeperConnection Watcher:127.0.0.1:33223/solr got event WatchedEvent state:SyncConnected type:None path:null path:null type:None
   [junit4]   2> 917743 T3213 oascc.ConnectionManager.waitForConnected Client is connected to ZooKeeper
   [junit4]   2> 917744 T3213 oascc.SolrZkClient.makePath makePath: /collections/collection1
   [junit4]   2> 917754 T3213 oascc.SolrZkClient.makePath makePath: /collections/collection1/shards
   [junit4]   2> 917758 T3213 oascc.SolrZkClient.makePath makePath: /collections/control_collection
   [junit4]   2> 917761 T3213 oascc.SolrZkClient.makePath makePath: /collections/control_collection/shards
   [junit4]   2> 917764 T3213 oasc.AbstractZkTestCase.putConfig put /mnt/ssd/jenkins/workspace/Lucene-Solr-trunk-Linux/solr/core/src/test-files/solr/collection1/conf/solrconfig-tlog.xml to /configs/conf1/solrconfig.xml
   [junit4]   2> 917765 T3213 oascc.SolrZkClient.makePath makePath: /configs/conf1/solrconfig.xml
   [junit4]   2> 917782 T3213 oasc.AbstractZkTestCase.putConfig put /mnt/ssd/jenkins/workspace/Lucene-Solr-trunk-Linux/solr/core/src/test-files/solr/collection1/conf/schema.xml to /configs/conf1/schema.xml
   [junit4]   2> 917783 T3213 oascc.SolrZkClient.makePath makePath: /configs/conf1/schema.xml
   [junit4]   2> 917786 T3213 oasc.AbstractZkTestCase.putConfig put /mnt/ssd/jenkins/workspace/Lucene-Solr-trunk-Linux/solr/core/src/test-files/solr/collection1/conf/solrconfig.snippet.randomindexconfig.xml to /configs/conf1/solrconfig.snippet.randomindexconfig.xml
   [junit4]   2> 917787 T3213 oascc.SolrZkClient.makePath makePath: /configs/conf1/solrconfig.snippet.randomindexconfig.xml
   [junit4]   2> 917789 T3213 oasc.AbstractZkTestCase.putConfig put /mnt/ssd/jenkins/workspace/Lucene-Solr-trunk-Linux/solr/core/src/test-files/solr/collection1/conf/stopwords.txt to /configs/conf1/stopwords.txt
   [junit4]   2> 917789 T3213 oascc.SolrZkClient.makePath makePath: /configs/conf1/stopwords.txt
   [junit4]   2> 917806 T3213 oasc.AbstractZkTestCase.putConfig put /mnt/ssd/jenkins/workspace/Lucene-Solr-trunk-Linux/solr/core/src/test-files/solr/collection1/conf/protwords.txt to /configs/conf1/protwords.txt
   [junit4]   2> 917807 T3213 oascc.SolrZkClient.makePath makePath: /configs/conf1/protwords.txt
   [junit4]   2> 917814 T3213 oasc.AbstractZkTestCase.putConfig put /mnt/ssd/jenkins/workspace/Lucene-Solr-trunk-Linux/solr/core/src/test-files/solr/collection1/conf/currency.xml to /configs/conf1/currency.xml
   [junit4]   2> 917815 T3213 oascc.SolrZkClient.makePath makePath: /configs/conf1/currency.xml
   [junit4]   2> 917821 T3213 oasc.AbstractZkTestCase.putConfig put /mnt/ssd/jenkins/workspace/Lucene-Solr-trunk-Linux/solr/core/src/test-files/solr/collection1/conf/enumsConfig.xml to /configs/conf1/enumsConfig.xml
   [junit4]   2> 917822 T3213 oascc.SolrZkClient.makePath makePath: /configs/conf1/enumsConfig.xml
   [junit4]   2> 917828 T3213 oasc.AbstractZkTestCase.putConfig put /mnt/ssd/jenkins/workspace/Lucene-Solr-trunk-Linux/solr/core/src/test-files/solr/collection1/conf/open-exchange-rates.json to /configs/conf1/open-exchange-rates.json
   [junit4]   2> 917829 T3213 oascc.SolrZkClient.makePath makePath: /configs/conf1/open-exchange-rates.json
   [junit4]   2> 917833 T3213 oasc.AbstractZkTestCase.putConfig put /mnt/ssd/jenkins/workspace/Lucene-Solr-trunk-Linux/solr/core/src/test-files/solr/collection1/conf/mapping-ISOLatin1Accent.txt to /configs/conf1/mapping-ISOLatin1Accent.txt
   [junit4]   2> 917834 T3213 oascc.SolrZkClient.makePath makePath: /configs/conf1/mapping-ISOLatin1Accent.txt
   [junit4]   2> 917910 T3213 oasc.AbstractZkTestCase.putConfig put /mnt/ssd/jenkins/workspace/Lucene-Solr-trunk-Linux/solr/core/src/test-files/solr/collection1/conf/old_synonyms.txt to /configs/conf1/old_synonyms.txt
   [junit4]   2> 917911 T3213 oascc.SolrZkClient.makePath makePath: /configs/conf1/old_synonyms.txt
   [junit4]   2> 917913 T3213 oasc.AbstractZkTestCase.putConfig put /mnt/ssd/jenkins/workspace/Lucene-Solr-trunk-Linux/solr/core/src/test-files/solr/collection1/conf/synonyms.txt to /configs/conf1/synonyms.txt
   [junit4]   2> 917914 T3213 oascc.SolrZkClient.makePath makePath: /configs/conf1/synonyms.txt
   [junit4]   2> Using old style solr.xml
   [junit4]   2> 918303 T3213 oejs.Server.doStart jetty-8.1.10.v20130312
   [junit4]   2> 918308 T3213 oejs.AbstractConnector.doStart Started SelectChannelConnector@127.0.0.1:37188
   [junit4]   2> 918309 T3213 oass.SolrDispatchFilter.init SolrDispatchFilter.init()
   [junit4]   2> 918309 T3213 oasc.SolrResourceLoader.locateSolrHome JNDI not configured for solr (NoInitialContextEx)
   [junit4]   2> 918310 T3213 oasc.SolrResourceLoader.locateSolrHome using system property solr.solr.home: ../../../../../../../../../../mnt/ssd/jenkins/workspace/Lucene-Solr-trunk-Linux/solr/build/solr-core/test/J1/./solr.cloud.CollectionsAPIDistributedZkTest-D35961A95B891665-001/tempDir-002
   [junit4]   2> 918310 T3213 oasc.SolrResourceLoader.<init> new SolrResourceLoader for directory: '../../../../../../../../../../mnt/ssd/jenkins/workspace/Lucene-Solr-trunk-Linux/solr/build/solr-core/test/J1/./solr.cloud.CollectionsAPIDistributedZkTest-D35961A95B891665-001/tempDir-002/'
   [junit4]   2> 918329 T3213 oasc.ConfigSolr.fromFile Loading container configuration from /mnt/ssd/jenkins/workspace/Lucene-Solr-trunk-Linux/solr/build/solr-core/test/J1/../../../../../../../../../../mnt/ssd/jenkins/workspace/Lucene-Solr-trunk-Linux/solr/build/solr-core/test/J1/./solr.cloud.CollectionsAPIDistributedZkTest-D35961A95B891665-001/tempDir-002/solr.xml
   [junit4]   2> 918340 T3213 oasc.CoreContainer.<init> New CoreContainer 21913101
   [junit4]   2> 918341 T3213 oasc.CoreContainer.load Loading cores into CoreContainer [instanceDir=../../../../../../../../../../mnt/ssd/jenkins/workspace/Lucene-Solr-trunk-Linux/solr/build/solr-core/test/J1/./solr.cloud.CollectionsAPIDistributedZkTest-D35961A95B891665-001/tempDir-002/]
   [junit4]   2> 918342 T3213 oashc.HttpShardHandlerFactory.getParameter Setting socketTimeout to: 120000
   [junit4]   2> 918342 T3213 oashc.HttpShardHandlerFactory.getParameter Setting urlScheme to: null
   [junit4]   2> 918342 T3213 oashc.HttpShardHandlerFactory.getParameter Setting connTimeout to: 15000
   [junit4]   2> 918343 T3213 oashc.HttpShardHandlerFactory.getParameter Setting maxConnectionsPerHost to: 20
   [junit4]   2> 918343 T3213 oashc.HttpShardHandlerFactory.getParameter Setting corePoolSize to: 0
   [junit4]   2> 918343 T3213 oashc.HttpShardHandlerFactory.getParameter Setting maximumPoolSize to: 2147483647
   [junit4]   2> 918344 T3213 oashc.HttpShardHandlerFactory.getParameter Setting maxThreadIdleTime to: 5
   [junit4]   2> 918344 T3213 oashc.HttpShardHandlerFactory.getParameter Setting sizeOfQueue to: -1
   [junit4]   2> 918344 T3213 oashc.HttpShardHandlerFactory.getParameter Setting fairnessPolicy to: false
   [junit4]   2> 918345 T3213 oasl.LogWatcher.createWatcher SLF4J impl is org.slf4j.impl.Log4jLoggerFactory
   [junit4]   2> 918345 T3213 oasl.LogWatcher.newRegisteredLogWatcher Registering Log Listener [Log4j (org.slf4j.impl.Log4jLoggerFactory)]
   [junit4]   2> 918346 T3213 oasc.CoreContainer.load Host Name: 127.0.0.1
   [junit4]   2> 918346 T3213 oasc.ZkContainer.initZooKeeper Zookeeper client=127.0.0.1:33223/solr
   [junit4]   2> 918346 T3213 oasc.ZkController.checkChrootPath zkHost includes chroot
   [junit4]   2> 918347 T3213 oascc.ConnectionManager.waitForConnected Waiting for client to connect to ZooKeeper
   [junit4]   2> 918349 T3233 oascc.ConnectionManager.process Watcher org.apache.solr.common.cloud.ConnectionManager@1305d49 name:ZooKeeperConnection Watcher:127.0.0.1:33223 got event WatchedEvent state:SyncConnected type:None path:null path:null type:None
   [junit4]   2> 918349 T3213 oascc.ConnectionManager.waitForConnected Client is connected to ZooKeeper
   [junit4]   2> 918352 T3213 oascc.ConnectionManager.waitForConnected Waiting for client to connect to ZooKeeper
   [junit4]   2> 918354 T3235 oascc.ConnectionManager.process Watcher org.apache.solr.common.cloud.ConnectionManager@14feaf2 name:ZooKeeperConnection Watcher:127.0.0.1:33223/solr got event WatchedEvent state:SyncConnected type:None path:null path:null type:None
   [junit4]   2> 918354 T3213 oascc.ConnectionManager.waitForConnected Client is connected to ZooKeeper
   [junit4]   2> 918355 T3213 oascc.SolrZkClient.makePath makePath: /overseer/queue
   [junit4]   2> 918358 T3213 oascc.SolrZkClient.makePath makePath: /overseer/collection-queue-work
   [junit4]   2> 918361 T3213 oascc.SolrZkClient.makePath makePath: /overseer/collection-map-running
   [junit4]   2> 918365 T3213 oascc.SolrZkClient.makePath makePath: /overseer/collection-map-completed
   [junit4]   2> 918370 T3213 oascc.SolrZkClient.makePath makePath: /overseer/collection-map-failure
   [junit4]   2> 918374 T3213 oascc.SolrZkClient.makePath makePath: /live_nodes
   [junit4]   2> 918375 T3213 oasc.ZkController.createEphemeralLiveNode Register node as live in ZooKeeper:/live_nodes/127.0.0.1:37188_lg%2Fg
   [junit4]   2> 918376 T3213 oascc.SolrZkClient.makePath makePath: /live_nodes/127.0.0.1:37188_lg%2Fg
   [junit4]   2> 918378 T3213 oascc.SolrZkClient.makePath makePath: /overseer_elect
   [junit4]   2> 918379 T3213 oascc.SolrZkClient.makePath makePath: /overseer_elect/election
   [junit4]   2> 918385 T3213 oasc.OverseerElectionContext.runLeaderProcess I am going to be the leader 127.0.0.1:37188_lg%2Fg
   [junit4]   2> 918386 T3213 oascc.SolrZkClient.makePath makePath: /overseer_elect/leader
   [junit4]   2> 918388 T3213 oasc.Overseer.start Overseer (id=91653142238068739-127.0.0.1:37188_lg%2Fg-n_0000000000) starting
   [junit4]   2> 918393 T3213 oascc.SolrZkClient.makePath makePath: /overseer/queue-work
   [junit4]   2> 918400 T3237 oasc.OverseerCollectionProcessor.run Process current queue of collection creations
   [junit4]   2> 918400 T3213 oascc.SolrZkClient.makePath makePath: /clusterstate.json
   [junit4]   2> 918401 T3237 oasc.OverseerCollectionProcessor.prioritizeOverseerNodes prioritizing overseer nodes at 127.0.0.1:37188_lg%2Fg
   [junit4]   2> 918403 T3213 oascc.SolrZkClient.makePath makePath: /aliases.json
   [junit4]   2> 918404 T3213 oascc.ZkStateReader.createClusterStateWatchersAndUpdate Updating cluster state from ZooKeeper... 
   [junit4]   2> 918406 T3236 oasc.Overseer$ClusterStateUpdater.run Starting to work on the main queue
   [junit4]   2> 918408 T3213 oass.SolrDispatchFilter.init user.dir=/mnt/ssd/jenkins/workspace/Lucene-Solr-trunk-Linux/solr/build/solr-core/test/J1
   [junit4]   2> 918409 T3213 oass.SolrDispatchFilter.init SolrDispatchFilter.init() done
   [junit4]   2> 918410 T3213 oascc.ConnectionManager.waitForConnected Waiting for client to connect to ZooKeeper
   [junit4]   2> 918411 T3240 oascc.ConnectionManager.process Watcher org.apache.solr.common.cloud.ConnectionManager@ebece name:ZooKeeperConnection Watcher:127.0.0.1:33223/solr got event WatchedEvent state:SyncConnected type:None path:null path:null type:None
   [junit4]   2> 918411 T3213 oascc.ConnectionManager.waitForConnected Client is connected to ZooKeeper
   [junit4]   2> 918412 T3213 oascc.ZkStateReader.createClusterStateWatchersAndUpdate Updating cluster state from ZooKeeper... 
   [junit4]   2> 918415 T3213 oasc.ChaosMonkey.monkeyLog monkey: init - expire sessions:false cause connection loss:false
   [junit4]   2> 918415 T3213 oasc.AbstractFullDistribZkTestBase.createJettys Creating collection1 with stateFormat=2
   [junit4]   2> 918416 T3213 oascc.ConnectionManager.waitForConnected Waiting for client to connect to ZooKeeper
   [junit4]   2> 918417 T3242 oascc.ConnectionManager.process Watcher org.apache.solr.common.cloud.ConnectionManager@18132f4 name:ZooKeeperConnection Watcher:127.0.0.1:33223/solr got event WatchedEvent state:SyncConnected type:None path:null path:null type:None
   [junit4]   2> 918417 T3213 oascc.ConnectionManager.waitForConnected Client is connected to ZooKeeper
   [junit4]   2> 918419 T3235 oasc.DistributedQueue$LatchChildWatcher.process LatchChildWatcher fired on path: /overseer/queue state: SyncConnected type NodeChildrenChanged
   [junit4]   2> 918420 T3236 oascc.ZkStateReader.updateClusterState Updating cloud state from ZooKeeper... 
   [junit4]   2> 918422 T3236 oasc.Overseer$ClusterStateUpdater.buildCollection building a new collection: collection1
   [junit4]   2> 918422 T3236 oasc.Overseer$ClusterStateUpdater.createCollection Create collection collection1 with shards [shard1, shard2]
   [junit4]   2> 918422 T3236 oasc.Overseer$ClusterStateUpdater.createCollection _extern collection1 true
   [junit4]   2> 918424 T3235 oasc.DistributedQueue$LatchChildWatcher.process LatchChildWatcher fired on path: /overseer/queue state: SyncConnected type NodeChildrenChanged
   [junit4]   2> 918424 T3236 oasc.Overseer$ClusterStateUpdater.updateZkStates going to create_collection live nodes:[] collections:{collection1=DocCollection(collection1)={
   [junit4]   2> 	  "replicationFactor":"1",
   [junit4]   2> 	  "router":{"name":"compositeId"},
   [junit4]   2> 	  "maxShardsPerNode":"1",
   [junit4]   2> 	  "stateFormat":2,
   [junit4]   2> 	  "autoCreated":"true",
   [junit4]   2> 	  "shards":{
   [junit4]   2> 	    "shard1":{
   [junit4]   2> 	      "range":"80000000-ffffffff",
   [junit4]   2> 	      "state":"active",
   [junit4]   2> 	      "replicas":{}},
   [junit4]   2> 	    "shard2":{
   [junit4]   2> 	      "range":"0-7fffffff",
   [junit4]   2> 	      "state":"active",
   [junit4]   2> 	      "replicas":{}}}}}
   [junit4]   2> 918425 T3235 oascc.ZkStateReader$2.process A cluster state change: WatchedEvent state:SyncConnected type:NodeDataChanged path:/clusterstate.json, has occurred - updating... (live nodes size: 1)
   [junit4]   2> 918426 T3240 oascc.ZkStateReader$2.process A cluster state change: WatchedEvent state:SyncConnected type:NodeDataChanged path:/clusterstate.json, has occurred - updating... (live nodes size: 1)
   [junit4]   2> 918699 T3213 oasc.AbstractFullDistribZkTestBase.createJettys create jetty 1
   [junit4]   2> 918700 T3213 oejs.Server.doStart jetty-8.1.10.v20130312
   [junit4]   2> 918703 T3213 oejs.AbstractConnector.doStart Started SelectChannelConnector@127.0.0.1:42392
   [junit4]   2> 918704 T3213 oass.SolrDispatchFilter.init SolrDispatchFilter.init()
   [junit4]   2> 918704 T3213 oasc.SolrResourceLoader.locateSolrHome JNDI not configured for solr (NoInitialContextEx)
   [junit4]   2> 918704 T3213 oasc.SolrResourceLoader.locateSolrHome using system property solr.solr.home: ./solr.cloud.CollectionsAPIDistributedZkTest-D35961A95B891665-001/tempDir-003
   [junit4]   2> 918705 T3213 oasc.SolrResourceLoader.<init> new SolrResourceLoader for directory: './solr.cloud.CollectionsAPIDistributedZkTest-D35961A95B891665-001/tempDir-003/'
   [junit4]   2> 918722 T3213 oasc.ConfigSolr.fromFile Loading container configuration from /mnt/ssd/jenkins/workspace/Lucene-Solr-trunk-Linux/solr/build/solr-core/test/J1/./solr.cloud.CollectionsAPIDistributedZkTest-D35961A95B891665-001/tempDir-003/solr.xml
   [junit4]   2> 918739 T3213 oasc.CoreContainer.<init> New CoreContainer 6120407
   [junit4]   2> 918739 T3213 oasc.CoreContainer.load Loading cores into CoreContainer [instanceDir=./solr.cloud.CollectionsAPIDistributedZkTest-D35961A95B891665-001/tempDir-003/]
   [junit4]   2> 918740 T3213 oashc.HttpShardHandlerFactory.getParameter Setting socketTimeout to: 120000
   [junit4]   2> 918740 T3213 oashc.HttpShardHandlerFactory.getParameter Setting urlScheme to: null
   [junit4]   2> 918741 T3213 oashc.HttpShardHandlerFactory.getParameter Setting connTimeout to: 15000
   [junit4]   2> 918741 T3213 oashc.HttpShardHandlerFactory.getParameter Setting maxConnectionsPerHost to: 20
   [junit4]   2> 918741 T3213 oashc.HttpShardHandlerFactory.getParameter Setting corePoolSize to: 0
   [junit4]   2> 918742 T3213 oashc.HttpShardHandlerFactory.getParameter Setting maximumPoolSize to: 2147483647
   [junit4]   2> 918742 T3213 oashc.HttpShardHandlerFactory.getParameter Setting maxThreadIdleTime to: 5
   [junit4]   2> 918742 T3213 oashc.HttpShardHandlerFactory.getParameter Setting sizeOfQueue to: -1
   [junit4]   2> 918742 T3213 oashc.HttpShardHandlerFactory.getParameter Setting fairnessPolicy to: false
   [junit4]   2> 918743 T3213 oasl.LogWatcher.createWatcher SLF4J impl is org.slf4j.impl.Log4jLoggerFactory
   [junit4]   2> 918743 T3213 oasl.LogWatcher.newRegisteredLogWatcher Registering Log Listener [Log4j (org.slf4j.impl.Log4jLoggerFactory)]
   [junit4]   2> 918744 T3213 oasc.CoreContainer.load Host Name: 127.0.0.1
   [junit4]   2> 918744 T3213 oasc.ZkContainer.initZooKeeper Zookeeper client=127.0.0.1:33223/solr
   [junit4]   2> 918745 T3213 oasc.ZkController.checkChrootPath zkHost includes chroot
   [junit4]   2> 918745 T3213 oascc.ConnectionManager.waitForConnected Waiting for client to connect to ZooKeeper
   [junit4]   2> 918748 T3253 oascc.ConnectionManager.process Watcher org.apache.solr.common.cloud.ConnectionManager@11eb4c7 name:ZooKeeperConnection Watcher:127.0.0.1:33223 got event WatchedEvent state:SyncConnected type:None path:null path:null type:None
   [junit4]   2> 918748 T3213 oascc.ConnectionManager.waitForConnected Client is connected to ZooKeeper
   [junit4]   2> 918751 T3213 oascc.ConnectionManager.waitForConnected Waiting for client to connect to ZooKeeper
   [junit4]   2> 918752 T3255 oascc.ConnectionManager.process Watcher org.apache.solr.common.cloud.ConnectionManager@13eb5d name:ZooKeeperConnection Watcher:127.0.0.1:33223/solr got event WatchedEvent state:SyncConnected type:None path:null path:null type:None
   [junit4]   2> 918753 T3213 oascc.ConnectionManager.waitForConnected Client is connected to ZooKeeper
   [junit4]   2> 918759 T3213 oascc.ZkStateReader.createClusterStateWatchersAndUpdate Updating cluster state from ZooKeeper... 
   [junit4]   2> 919763 T3213 oasc.ZkController.createEphemeralLiveNode Register node as live in ZooKeeper:/live_nodes/127.0.0.1:42392_lg%2Fg
   [junit4]   2> 919765 T3213 oascc.SolrZkClient.makePath makePath: /live_nodes/127.0.0.1:42392_lg%2Fg
   [junit4]   2> 919771 T3213 oass.SolrDispatchFilter.init user.dir=/mnt/ssd/jenkins/workspace/Lucene-Solr-trunk-Linux/solr/build/solr-core/test/J1
   [junit4]   2> 919772 T3213 oass.SolrDispatchFilter.init SolrDispatchFilter.init() done
   [junit4]   2> 920043 T3213 oasc.AbstractFullDistribZkTestBase.createJettys create jetty 2
   [junit4]   2> 920044 T3213 oejs.Server.doStart jetty-8.1.10.v20130312
   [junit4]   2> 920045 T3213 oejs.AbstractConnector.doStart Started SelectChannelConnector@127.0.0.1:34390
   [junit4]   2> 920046 T3213 oass.SolrDispatchFilter.init SolrDispatchFilter.init()
   [junit4]   2> 920047 T3213 oasc.SolrResourceLoader.locateSolrHome JNDI not configured for solr (NoInitialContextEx)
   [junit4]   2> 920047 T3213 oasc.SolrResourceLoader.locateSolrHome using system property solr.solr.home: ../../../../../../../../../../mnt/ssd/jenkins/workspace/Lucene-Solr-trunk-Linux/solr/build/solr-core/test/J1/./solr.cloud.CollectionsAPIDistributedZkTest-D35961A95B891665-001/tempDir-004
   [junit4]   2> 920047 T3213 oasc.SolrResourceLoader.<init> new SolrResourceLoader for directory: '../../../../../../../../../../mnt/ssd/jenkins/workspace/Lucene-Solr-trunk-Linux/solr/build/solr-core/test/J1/./solr.cloud.CollectionsAPIDistributedZkTest-D35961A95B891665-001/tempDir-004/'
   [junit4]   2> 920063 T3213 oasc.ConfigSolr.fromFile Loading container configuration from /mnt/ssd/jenkins/workspace/Lucene-Solr-trunk-Linux/solr/build/solr-core/test/J1/../../../../../../../../../../mnt/ssd/jenkins/workspace/Lucene-Solr-trunk-Linux/solr/build/solr-core/test/J1/./solr.cloud.CollectionsAPIDistributedZkTest-D35961A95B891665-001/tempDir-004/solr.xml
   [junit4]   2> 920079 T3213 oasc.CoreContainer.<init> New CoreContainer 11052972
   [junit4]   2> 920080 T3213 oasc.CoreContainer.load Loading cores into CoreContainer [instanceDir=../../../../../../../../../../mnt/ssd/jenkins/workspace/Lucene-Solr-trunk-Linux/solr/build/solr-core/test/J1/./solr.cloud.CollectionsAPIDistributedZkTest-D35961A95B891665-001/tempDir-004/]
   [junit4]   2> 920080 T3213 oashc.HttpShardHandlerFactory.getParameter Setting socketTimeout to: 120000
   [junit4]   2> 920081 T3213 oashc.HttpShardHandlerFactory.getParameter Setting urlScheme to: null
   [junit4]   2> 920081 T3213 oashc.HttpShardHandlerFactory.getParameter Setting connTimeout to: 15000
   [junit4]   2> 920081 T3213 oashc.HttpShardHandlerFactory.getParameter Setting maxConnectionsPerHost to: 20
   [junit4]   2> 920082 T3213 oashc.HttpShardHandlerFactory.getParameter Setting corePoolSize to: 0
   [junit4]   2> 920082 T3213 oashc.HttpShardHandlerFactory.getParameter Setting maximumPoolSize to: 2147483647
   [junit4]   2> 920082 T3213 oashc.HttpShardHandlerFactory.getParameter Setting maxThreadIdleTime to: 5
   [junit4]   2> 920083 T3213 oashc.HttpShardHandlerFactory.getParameter Setting sizeOfQueue to: -1
   [junit4]   2> 920083 T3213 oashc.HttpShardHandlerFactory.getParameter Setting fairnessPolicy to: false
   [junit4]   2> 920084 T3213 oasl.LogWatcher.createWatcher SLF4J impl is org.slf4j.impl.Log4jLoggerFactory
   [junit4]   2> 920084 T3213 oasl.LogWatcher.newRegisteredLogWatcher Registering Log Listener [Log4j (org.slf4j.impl.Log4jLoggerFactory)]
   [junit4]   2> 920084 T3213 oasc.CoreContainer.load Host Name: 127.0.0.1
   [junit4]   2> 920085 T3213 oasc.ZkContainer.initZooKeeper Zookeeper client=127.0.0.1:33223/solr
   [junit4]   2> 920085 T3213 oasc.ZkController.checkChrootPath zkHost includes chroot
   [junit4]   2> 920086 T3213 oascc.ConnectionManager.waitForConnected Waiting for client to connect to ZooKeeper
   [junit4]   2> 920088 T3267 oascc.ConnectionManager.process Watcher org.apache.solr.common.cloud.ConnectionManager@1f04386 name:ZooKeeperConnection Watcher:127.0.0.1:33223 got event WatchedEvent state:SyncConnected type:None path:null path:null type:None
   [junit4]   2> 920088 T3213 oascc.ConnectionManager.waitForConnected Client is connected to ZooKeeper
   [junit4]   2> 920090 T3213 oascc.ConnectionManager.waitForConnected Waiting for client to connect to ZooKeeper
   [junit4]   2> 920092 T3269 oascc.ConnectionManager.process Watcher org.apache.solr.common.cloud.ConnectionManager@156a0aa name:ZooKeeperConnection Watcher:127.0.0.1:33223/solr got event WatchedEvent state:SyncConnected type:None path:null path:null type:None
   [junit4]   2> 920092 T3213 oascc.ConnectionManager.waitForConnected Client is connected to ZooKeeper
   [junit4]   2> 920097 T3213 oascc.ZkStateReader.createClusterStateWatchersAndUpdate Updating cluster state from ZooKeeper... 
   [junit4]   2> 921101 T3213 oasc.ZkController.createEphemeralLiveNode Register node as live in ZooKeeper:/live_nodes/127.0.0.1:34390_lg%2Fg
   [junit4]   2> 921103 T3213 oascc.SolrZkClient.makePath makePath: /live_nodes/127.0.0.1:34390_lg%2Fg
   [junit4]   2> 921110 T3213 oass.SolrDispatchFilter.init user.dir=/mnt/ssd/jenkins/workspace/Lucene-Solr-trunk-Linux/solr/build/solr-core/test/J1
   [junit4]   2> 921110 T3213 oass.SolrDispatchFilter.init SolrDispatchFilter.init() done
   [junit4]   2> 921396 T3213 oasc.AbstractFullDistribZkTestBase.createJettys create jetty 3
   [junit4]   2> 921397 T3213 oejs.Server.doStart jetty-8.1.10.v20130312
   [junit4]   2> 921399 T3213 oejs.AbstractConnector.doStart Started SelectChannelConnector@127.0.0.1:38222
   [junit4]   2> 921399 T3213 oass.SolrDispatchFilter.init SolrDispatchFilter.init()
   [junit4]   2> 921400 T3213 oasc.SolrResourceLoader.locateSolrHome JNDI not configured for solr (NoInitialContextEx)
   [junit4]   2> 921400 T3213 oasc.SolrResourceLoader.locateSolrHome using system property solr.solr.home: ./solr.cloud.CollectionsAPIDistributedZkTest-D35961A95B891665-001/tempDir-005
   [junit4]   2> 921401 T3213 oasc.SolrResourceLoader.<init> new SolrResourceLoader for directory: './solr.cloud.CollectionsAPIDistributedZkTest-D35961A95B891665-001/tempDir-005/'
   [junit4]   2> 921423 T3213 oasc.ConfigSolr.fromFile Loading container configuration from /mnt/ssd/jenkins/workspace/Lucene-Solr-trunk-Linux/solr/build/solr-core/test/J1/./solr.cloud.CollectionsAPIDistributedZkTest-D35961A95B891665-001/tempDir-005/solr.xml
   [junit4]   2> 921440 T3213 oasc.CoreContainer.<init> New CoreContainer 18323661
   [junit4]   2> 921441 T3213 oasc.CoreContainer.load Loading cores into CoreContainer [instanceDir=./solr.cloud.CollectionsAPIDistributedZkTest-D35961A95B891665-001/tempDir-005/]
   [junit4]   2> 921441 T3213 oashc.HttpShardHandlerFactory.getParameter Setting socketTimeout to: 120000
   [junit4]   2> 921442 T3213 oashc.HttpShardHandlerFactory.getParameter Setting urlScheme to: null
   [junit4]   2> 921442 T3213 oashc.HttpShardHandlerFactory.getParameter Setting connTimeout to: 15000
   [junit4]   2> 921442 T3213 oashc.HttpShardHandlerFactory.getParameter Setting maxConnectionsPerHost to: 20
   [junit4]   2> 921443 T3213 oashc.HttpShardHandlerFactory.getParameter Setting corePoolSize to: 0
   [junit4]   2> 921443 T3213 oashc.HttpShardHandlerFactory.getParameter Setting maximumPoolSize to: 2147483647
   [junit4]   2> 921443 T3213 oashc.HttpShardHandlerFactory.getParameter Setting maxThreadIdleTime to: 5
   [junit4]   2> 921444 T3213 oashc.HttpShardHandlerFactory.getParameter Setting sizeOfQueue to: -1
   [junit4]   2> 921444 T3213 oashc.HttpShardHandlerFactory.getParameter Setting fairnessPolicy to: false
   [junit4]   2> 921445 T3213 oasl.LogWatcher.createWatcher SLF4J impl is org.slf4j.impl.Log4jLoggerFactory
   [junit4]   2> 921446 T3213 oasl.LogWatcher.newRegisteredLogWatcher Registering Log Listener [Log4j (org.slf4j.impl.Log4jLoggerFactory)]
   [junit4]   2> 921446 T3213 oasc.CoreContainer.load Host Name: 127.0.0.1
   [junit4]   2> 921447 T3213 oasc.ZkContainer.initZooKeeper Zookeeper client=127.0.0.1:33223/solr
   [junit4]   2> 921447 T3213 oasc.ZkController.checkChrootPath zkHost includes chroot
   [junit4]   2> 921448 T3213 oascc.ConnectionManager.waitForConnected Waiting for client to connect to ZooKeeper
   [junit4]   2> 921449 T3281 oascc.ConnectionManager.process Watcher org.apache.solr.common.cloud.ConnectionManager@471a23 name:ZooKeeperConnection Watcher:127.0.0.1:33223 got event WatchedEvent state:SyncConnected type:None path:null path:null type:None
   [junit4]   2> 921450 T3213 oascc.ConnectionManager.waitForConnected Client is connected to ZooKeeper
   [junit4]   2> 921451 T3213 oascc.ConnectionManager.waitForConnected Waiting for client to connect to ZooKeeper
   [junit4]   2> 921452 T3283 oascc.ConnectionManager.process Watcher org.apache.solr.common.cloud.ConnectionManager@8a47ed name:ZooKeeperConnection Watcher:127.0.0.1:33223/solr got event WatchedEvent state:SyncConnected type:None path:null path:null type:None
   [junit4]   2> 921452 T3213 oascc.ConnectionManager.waitForConnected Client is connected to ZooKeeper
   [junit4]   2> 921467 T3213 oascc.ZkStateReader.createClusterStateWatchersAndUpdate Updating cluster state from ZooKeeper... 
   [junit4]   2> 922471 T3213 oasc.ZkController.createEphemeralLiveNode Register node as live in ZooKeeper:/live_nodes/127.0.0.1:38222_lg%2Fg
   [junit4]   2> 922473 T3213 oascc.SolrZkClient.makePath makePath: /live_nodes/127.0.0.1:38222_lg%2Fg
   [junit4]   2> 922484 T3213 oass.SolrDispatchFilter.init user.dir=/mnt/ssd/jenkins/workspace/Lucene-Solr-trunk-Linux/solr/build/solr-core/test/J1
   [junit4]   2> 922485 T3213 oass.SolrDispatchFilter.init SolrDispatchFilter.init() done
   [junit4]   2> 922786 T3213 oasc.AbstractFullDistribZkTestBase.createJettys create jetty 4
   [junit4]   2> 922787 T3213 oejs.Server.doStart jetty-8.1.10.v20130312
   [junit4]   2> 922788 T3213 oejs.AbstractConnector.doStart Started SelectChannelConnector@127.0.0.1:58995
   [junit4]   2> 922789 T3213 oass.SolrDispatchFilter.init SolrDispatchFilter.init()
   [junit4]   2> 922790 T3213 oasc.SolrResourceLoader.locateSolrHome JNDI not configured for solr (NoInitialContextEx)
   [junit4]   2> 922790 T3213 oasc.SolrResourceLoader.locateSolrHome using system property solr.solr.home: ./solr.cloud.CollectionsAPIDistributedZkTest-D35961A95B891665-001/tempDir-006
   [junit4]   2> 922790 T3213 oasc.SolrResourceLoader.<init> new SolrResourceLoader for directory: './solr.cloud.CollectionsAPIDistributedZkTest-D35961A95B891665-001/tempDir-006/'
   [junit4]   2> 922807 T3213 oasc.ConfigSolr.fromFile Loading container configuration from /mnt/ssd/jenkins/workspace/Lucene-Solr-trunk-Linux/solr/build/solr-core/test/J1/./solr.cloud.CollectionsAPIDistributedZkTest-D35961A95B891665-001/tempDir-006/solr.xml
   [junit4]   2> 922819 T3213 oasc.CoreContainer.<init> New CoreContainer 1739202
   [junit4]   2> 922820 T3213 oasc.CoreContainer.load Loading cores into CoreContainer [instanceDir=./solr.cloud.CollectionsAPIDistributedZkTest-D35961A95B891665-001/tempDir-006/]
   [junit4]   2> 922821 T3213 oashc.HttpShardHandlerFactory.getParameter Setting socketTimeout to: 120000
   [junit4]   2> 922821 T3213 oashc.HttpShardHandlerFactory.getParameter Setting urlScheme to: null
   [junit4]   2> 922821 T3213 oashc.HttpShardHandlerFactory.getParameter Setting connTimeout to: 15000
   [junit4]   2> 922821 T3213 oashc.HttpShardHandlerFactory.getParameter Setting maxConnectionsPerHost to: 20
   [junit4]   2> 922822 T3213 oashc.HttpShardHandlerFactory.getParameter Setting corePoolSize to: 0
   [junit4]   2> 922822 T3213 oashc.HttpShardHandlerFactory.getParameter Setting maximumPoolSize to: 2147483647
   [junit4]   2> 922822 T3213 oashc.HttpShardHandlerFactory.getParameter Setting maxThreadIdleTime to: 5
   [junit4]   2> 922823 T3213 oashc.HttpShardHandlerFactory.getParameter Setting sizeOfQueue to: -1
   [junit4]   2> 922823 T3213 oashc.HttpShardHandlerFactory.getParameter Setting fairnessPolicy to: false
   [junit4]   2> 922824 T3213 oasl.LogWatcher.createWatcher SLF4J impl is org.slf4j.impl.Log4jLoggerFactory
   [junit4]   2> 922824 T3213 oasl.LogWatcher.newRegisteredLogWatcher Registering Log Listener [Log4j (org.slf4j.impl.Log4jLoggerFactory)]
   [junit4]   2> 922825 T3213 oasc.CoreContainer.load Host Name: 127.0.0.1
   [junit4]   2> 922825 T3213 oasc.ZkContainer.initZooKeeper Zookeeper client=127.0.0.1:33223/solr
   [junit4]   2> 922825 T3213 oasc.ZkController.checkChrootPath zkHost includes chroot
   [junit4]   2> 922826 T3213 oascc.ConnectionManager.waitForConnected Waiting for client to connect to ZooKeeper
   [junit4]   2> 922827 T3295 oascc.ConnectionManager.process Watcher org.apache.solr.common.cloud.ConnectionManager@1fdd7e4 name:ZooKeeperConnection Watcher:127.0.0.1:33223 got event WatchedEvent state:SyncConnected type:None path:null path:null type:None
   [junit4]   2> 922828 T3213 oascc.ConnectionManager.waitForConnected Client is connected to ZooKeeper
   [junit4]   2> 922830 T3213 oascc.ConnectionManager.waitForConnected Waiting for client to connect to ZooKeeper
   [junit4]   2> 922831 T3297 oascc.ConnectionManager.process Watcher org.apache.solr.common.cloud.ConnectionManager@63c331 name:ZooKeeperConnection Watcher:127.0.0.1:33223/solr got event WatchedEvent state:SyncConnected type:None path:null path:null type:None
   [junit4]   2> 922831 T3213 oascc.ConnectionManager.waitForConnected Client is connected to ZooKeeper
   [junit4]   2> 922836 T3213 oascc.ZkStateReader.createClusterStateWatchersAndUpdate Updating cluster state from ZooKeeper... 
   [junit4]   2> 923840 T3213 oasc.ZkController.createEphemeralLiveNode Register node as live in ZooKeeper:/live_nodes/127.0.0.1:58995_lg%2Fg
   [junit4]   2> 923842 T3213 oascc.SolrZkClient.makePath makePath: /live_nodes/127.0.0.1:58995_lg%2Fg
   [junit4]   2> 923849 T3213 oass.SolrDispatchFilter.init user.dir=/mnt/ssd/jenkins/workspace/Lucene-Solr-trunk-Linux/solr/build/solr-core/test/J1
   [junit4]   2> 923850 T3213 oass.SolrDispatchFilter.init SolrDispatchFilter.init() done
   [junit4]   2> 923859 T3251 oasha.CollectionsHandler.handleCreateAction Creating Collection : replicationFactor=2&collection.configName=conf1&router.field=myOwnField&name=solrj_collection&router.name=compositeId&action=CREATE&numShards=2&wt=javabin&version=2
   [junit4]   2> 923861 T3235 oasc.DistributedQueue$LatchChildWatcher.process LatchChildWatcher fired on path: /overseer/collection-queue-work state: SyncConnected type NodeChildrenChanged
   [junit4]   2> 923862 T3237 oasc.OverseerCollectionProcessor.run Overseer Collection Processor: Get the message id:/overseer/collection-queue-work/qn-0000000000 message:{
   [junit4]   2> 	  "operation":"createcollection",
   [junit4]   2> 	  "fromApi":"true",
   [junit4]   2> 	  "name":"solrj_collection",
   [junit4]   2> 	  "replicationFactor":"2",
   [junit4]   2> 	  "collection.configName":"conf1",
   [junit4]   2> 	  "numShards":"2",
   [junit4]   2> 	  "router.field":"myOwnField",
   [junit4]   2> 	  "router.name":"compositeId"}
   [junit4]   2> 923862 T3237 oasc.OverseerCollectionProcessor.processMessage WARN OverseerCollectionProcessor.processMessage : createcollection , {
   [junit4]   2> 	  "operation":"createcollection",
   [junit4]   2> 	  "fromApi":"true",
   [junit4]   2> 	  "name":"solrj_collection",
   [junit4]   2> 	  "replicationFactor":"2",
   [junit4]   2> 	  "collection.configName":"conf1",
   [junit4]   2> 	  "numShards":"2",
   [junit4]   2> 	  "router.field":"myOwnField",
   [junit4]   2> 	  "router.name":"compositeId"}
   [junit4]   2> 923863 T3237 oasc.OverseerCollectionProcessor.createConfNode creating collections conf node /collections/solrj_collection 
   [junit4]   2> 923863 T3237 oascc.SolrZkClient.makePath makePath: /collections/solrj_collection
   [junit4]   2> 923867 T3235 oasc.DistributedQueue$LatchChildWatcher.process LatchChildWatcher fired on path: /overseer/queue state: SyncConnected type NodeChildrenChanged
   [junit4]   2> 923868 T3236 oascc.ZkStateReader.updateClusterState Updating cloud state from ZooKeeper... 
   [junit4]   2> 923869 T3236 oasc.Overseer$ClusterStateUpdater.buildCollection building a new collection: solrj_collection
   [junit4]   2> 923870 T3236 oasc.Overseer$ClusterStateUpdater.createCollection Create collection solrj_collection with shards [shard1, shard2]
   [junit4]   2> 923870 T3236 oasc.Overseer$ClusterStateUpdater.createCollection _extern solrj_collection false
   [junit4]   2> 923873 T3235 oasc.DistributedQueue$LatchChildWatcher.process LatchChildWatcher fired on path: /overseer/queue state: SyncConnected type NodeChildrenChanged
   [junit4]   2> 923874 T3240 oascc.ZkStateReader$2.process A cluster state change: WatchedEvent state:SyncConnected type:NodeDataChanged path:/clusterstate.json, has occurred - updating... (live nodes size: 5)
   [junit4]   2> 923874 T3283 oascc.ZkStateReader$2.process A cluster state change: WatchedEvent state:SyncConnected type:NodeDataChanged path:/clusterstate.json, has occurred - updating... (live nodes size: 5)
   [junit4]   2> 923874 T3297 oascc.ZkStateReader$2.process A cluster state change: WatchedEvent state:SyncConnected type:NodeDataChanged path:/clusterstate.json, has occurred - updating... (live nodes size: 5)
   [junit4]   2> 923874 T3255 oascc.ZkStateReader$2.process A cluster state change: WatchedEvent state:SyncConnected type:NodeDataChanged path:/clusterstate.json, has occurred - updating... (live nodes size: 5)
   [junit4]   2> 923874 T3235 oascc.ZkStateReader$2.process A cluster state change: WatchedEvent state:SyncConnected type:NodeDataChanged path:/clusterstate.json, has occurred - updating... (live nodes size: 5)
   [junit4]   2> 923874 T3269 oascc.ZkStateReader$2.process A cluster state change: WatchedEvent state:SyncConnected type:NodeDataChanged path:/clusterstate.json, has occurred - updating... (live nodes size: 5)
   [junit4]   2> 923967 T3237 oasc.OverseerCollectionProcessor.createCollection Creating SolrCores for new collection, shardNames [shard1, shard2] , replicationFactor : 2
   [junit4]   2> 923967 T3237 oasc.OverseerCollectionProcessor.createCollection Creating shard solrj_collection_shard1_replica1 as part of slice shard1 of collection solrj_collection on 127.0.0.1:38222_lg%2Fg
   [junit4]   2> 923968 T3237 oasc.OverseerCollectionProcessor.createCollection Creating shard solrj_collection_shard1_replica2 as part of slice shard1 of collection solrj_collection on 127.0.0.1:34390_lg%2Fg
   [junit4]   2> 923969 T3237 oasc.OverseerCollectionProcessor.createCollection Creating shard solrj_collection_shard2_replica1 as part of slice shard2 of collection solrj_collection on 127.0.0.1:37188_lg%2Fg
   [junit4]   2> 923970 T3237 oasc.OverseerCollectionProcessor.createCollection Creating shard solrj_collection_shard2_replica2 as part of slice shard2 of collection solrj_collection on 127.0.0.1:42392_lg%2Fg
   [junit4]   2> 923971 T3276 oasha.CoreAdminHandler.handleCreateAction core create command qt=/admin/cores&collection.configName=conf1&name=solrj_collection_shard1_replica1&action=CREATE&numShards=2&collection=solrj_collection&shard=shard1&wt=javabin&version=2
   [junit4]   2> 923971 T3265 oasha.CoreAdminHandler.handleCreateAction core create command qt=/admin/cores&collection.configName=conf1&name=solrj_collection_shard1_replica2&action=CREATE&numShards=2&collection=solrj_collection&shard=shard1&wt=javabin&version=2
   [junit4]   2> 923971 T3230 oasha.CoreAdminHandler.handleCreateAction core create command qt=/admin/cores&collection.configName=conf1&name=solrj_collection_shard2_replica1&action=CREATE&numShards=2&collection=solrj_collection&shard=shard2&wt=javabin&version=2
   [junit4]   2> 923973 T3249 oasha.CoreAdminHandler.handleCreateAction core create command qt=/admin/cores&collection.configName=conf1&name=solrj_collection_shard2_replica2&action=CREATE&numShards=2&collection=solrj_collection&shard=shard2&wt=javabin&version=2
   [junit4]   2> 923974 T3276 oasc.ZkController.publish publishing core=solrj_collection_shard1_replica1 state=down collection=solrj_collection
   [junit4]   2> 923974 T3249 oasc.ZkController.publish publishing core=solrj_collection_shard2_replica2 state=down collection=solrj_collection
   [junit4]   2> 923974 T3265 oasc.ZkController.publish publishing core=solrj_collection_shard1_replica2 state=down collection=solrj_collection
   [junit4]   2> 923974 T3230 oasc.ZkController.publish publishing core=solrj_collection_shard2_replica1 state=down collection=solrj_collection
   [junit4]   2> 923975 T3276 oasc.ZkController.waitForCoreNodeName look for our core node name
   [junit4]   2> 923975 T3235 oasc.DistributedQueue$LatchChildWatcher.process LatchChildWatcher fired on path: /overseer/queue state: SyncConnected type NodeChildrenChanged
   [junit4]   2> 923990 T3265 oasc.ZkController.waitForCoreNodeName look for our core node name
   [junit4]   2> 923992 T3249 oasc.ZkController.waitForCoreNodeName look for our core node name
   [junit4]   2> 923992 T3230 oasc.ZkController.waitForCoreNodeName look for our core node name
   [junit4]   2> 923993 T3236 oascc.ZkStateReader.updateClusterState Updating cloud state from ZooKeeper... 
   [junit4]   2> 923995 T3236 oasc.Overseer$ClusterStateUpdater.updateState Update state numShards=2 message={
   [junit4]   2> 	  "operation":"state",
   [junit4]   2> 	  "state":"down",
   [junit4]   2> 	  "base_url":"http://127.0.0.1:38222/lg/g",
   [junit4]   2> 	  "core":"solrj_collection_shard1_replica1",
   [junit4]   2> 	  "roles":null,
   [junit4]   2> 	  "node_name":"127.0.0.1:38222_lg%2Fg",
   [junit4]   2> 	  "shard":"shard1",
   [junit4]   2> 	  "collection":"solrj_collection",
   [junit4]   2> 	  "numShards":"2",
   [junit4]   2> 	  "core_node_name":null}
   [junit4]   2> 923997 T3235 oasc.DistributedQueue$LatchChildWatcher.process LatchChildWatcher fired on path: /overseer/queue state: SyncConnected type NodeChildrenChanged
   [junit4]   2> 923998 T3236 oasc.Overseer$ClusterStateUpdater.updateState Update state numShards=2 message={
   [junit4]   2> 	  "operation":"state",
   [junit4]   2> 	  "state":"down",
   [junit4]   2> 	  "base_url":"http://127.0.0.1:34390/lg/g",
   [junit4]   2> 	  "core":"solrj_collection_shard1_replica2",
   [junit4]   2> 	  "roles":null,
   [junit4]   2> 	  "node_name":"127.0.0.1:34390_lg%2Fg",
   [junit4]   2> 	  "shard":"shard1",
   [junit4]   2> 	  "collection":"solrj_collection",
   [junit4]   2> 	  "numShards":"2",
   [junit4]   2> 	  "core_node_name":null}
   [junit4]   2> 924000 T3235 oasc.DistributedQueue$LatchChildWatcher.process LatchChildWatcher fired on path: /overseer/queue state: SyncConnected type NodeChildrenChanged
   [junit4]   2> 924001 T3236 oasc.Overseer$ClusterStateUpdater.updateState Update state numShards=2 message={
   [junit4]   2> 	  "operation":"state",
   [junit4]   2> 	  "state":"down",
   [junit4]   2> 	  "base_url":"http://127.0.0.1:42392/lg/g",
   [junit4]   2> 	  "core":"solrj_collection_shard2_replica2",
   [junit4]   2> 	  "roles":null,
   [junit4]   2> 	  "node_name":"127.0.0.1:42392_lg%2Fg",
   [junit4]   2> 	  "shard":"shard2",
   [junit4]   2> 	  "collection":"solrj_collection",
   [junit4]   2> 	  "numShards":"2",
   [junit4]   2> 	  "core_node_name":null}
   [junit4]   2> 924002 T3235 oasc.DistributedQueue$LatchChildWatcher.process LatchChildWatcher fired on path: /overseer/queue state: SyncConnected type NodeChildrenChanged
   [junit4]   2> 924003 T3236 oasc.Overseer$ClusterStateUpdater.updateState Update state numShards=2 message={
   [junit4]   2> 	  "operation":"state",
   [junit4]   2> 	  "state":"down",
   [junit4]   2> 	  "base_url":"http://127.0.0.1:37188/lg/g",
   [junit4]   2> 	  "core":"solrj_collection_shard2_replica1",
   [junit4]   2> 	  "roles":null,
   [junit4]   2> 	  "node_name":"127.0.0.1:37188_lg%2Fg",
   [junit4]   2> 	  "shard":"shard2",
   [junit4]   2> 	  "collection":"solrj_collection",
   [junit4]   2> 	  "numShards":"2",
   [junit4]   2> 	  "core_node_name":null}
   [junit4]   2> 924005 T3235 oasc.DistributedQueue$LatchChildWatcher.process LatchChildWatcher fired on path: /overseer/queue state: SyncConnected type NodeChildrenChanged
   [junit4]   2> 924108 T3240 oascc.ZkStateReader$2.process A cluster state change: WatchedEvent state:SyncConnected type:NodeDataChanged path:/clusterstate.json, has occurred - updating... (live nodes size: 5)
   [junit4]   2> 924109 T3297 oascc.ZkStateReader$2.process A cluster state change: WatchedEvent state:SyncConnected type:NodeDataChanged path:/clusterstate.json, has occurred - updating... (live nodes size: 5)
   [junit4]   2> 924109 T3255 oascc.ZkStateReader$2.process A cluster state change: WatchedEvent state:SyncConnected type:NodeDataChanged path:/clusterstate.json, has occurred - updating... (live nodes size: 5)
   [junit4]   2> 924108 T3283 oascc.ZkStateReader$2.process A cluster state change: WatchedEvent state:SyncConnected type:NodeDataChanged path:/clusterstate.json, has occurred - updating... (live nodes size: 5)
   [junit4]   2> 924108 T3235 oascc.ZkStateReader$2.process A cluster state change: WatchedEvent state:SyncConnected type:NodeDataChanged path:/clusterstate.json, has occurred - updating... (live nodes size: 5)
   [junit4]   2> 924108 T3269 oascc.ZkStateReader$2.process A cluster state change: WatchedEvent state:SyncConnected type:NodeDataChanged path:/clusterstate.json, has occurred - updating... (live nodes size: 5)
   [junit4]   2> 924976 T3276 oasc.ZkController.waitForShardId waiting to find shard id in clusterstate for solrj_collection_shard1_replica1
   [junit4]   2> 924977 T3276 oasc.SolrXMLCoresLocator.doPersist Persisted core descriptions to /mnt/ssd/jenkins/workspace/Lucene-Solr-trunk-Linux/solr/build/solr-core/test/J1/./solr.cloud.CollectionsAPIDistributedZkTest-D35961A95B891665-001/tempDir-005/solr.xml
   [junit4]   2> 924977 T3276 oasc.ZkController.createCollectionZkNode Check for collection zkNode:solrj_collection
   [junit4]   2> 924978 T3276 oasc.ZkController.createCollectionZkNode Collection zkNode exists
   [junit4]   2> 924978 T3276 oascc.ZkStateReader.readConfigName Load collection config from:/collections/solrj_collection
   [junit4]   2> 924979 T3276 oascc.ZkStateReader.readConfigName path=/collections/solrj_collection configName=conf1 specified config exists in ZooKeeper
   [junit4]   2> 924980 T3276 oasc.SolrResourceLoader.<init> new SolrResourceLoader for directory: './solr.cloud.CollectionsAPIDistributedZkTest-D35961A95B891665-001/tempDir-005/solrj_collection_shard1_replica1/'
   [junit4]   2> 924990 T3265 oasc.ZkController.waitForShardId waiting to find shard id in clusterstate for solrj_collection_shard1_replica2
   [junit4]   2> 924991 T3265 oasc.SolrXMLCoresLocator.doPersist Persisted core descriptions to /mnt/ssd/jenkins/workspace/Lucene-Solr-trunk-Linux/solr/build/solr-core/test/J1/../../../../../../../../../../mnt/ssd/jenkins/workspace/Lucene-Solr-trunk-Linux/solr/build/solr-core/test/J1/./solr.cloud.CollectionsAPIDistributedZkTest-D35961A95B891665-001/tempDir-004/solr.xml
   [junit4]   2> 924992 T3265 oasc.ZkController.createCollectionZkNode Check for collection zkNode:solrj_collection
   [junit4]   2> 924992 T3249 oasc.ZkController.waitForShardId waiting to find shard id in clusterstate for solrj_collection_shard2_replica2
   [junit4]   2> 924993 T3230 oasc.ZkController.waitForShardId waiting to find shard id in clusterstate for solrj_collection_shard2_replica1
   [junit4]   2> 924993 T3249 oasc.SolrXMLCoresLocator.doPersist Persisted core descriptions to /mnt/ssd/jenkins/workspace/Lucene-Solr-trunk-Linux/solr/build/solr-core/test/J1/./solr.cloud.CollectionsAPIDistributedZkTest-D35961A95B891665-001/tempDir-003/solr.xml
   [junit4]   2> 924999 T3249 oasc.ZkController.createCollectionZkNode Check for collection zkNode:solrj_collection
   [junit4]   2> 925000 T3265 oasc.ZkController.createCollectionZkNode Collection zkNode exists
   [junit4]   2> 925000 T3265 oascc.ZkStateReader.readConfigName Load collection config from:/collections/solrj_collection
   [junit4]   2> 925000 T3230 oasc.SolrXMLCoresLocator.doPersist Persisted core descriptions to /mnt/ssd/jenkins/workspace/Lucene-Solr-trunk-Linux/solr/build/solr-core/test/J1/../../../../../../../../../../mnt/ssd/jenkins/workspace/Lucene-Solr-trunk-Linux/solr/build/solr-core/test/J1/./solr.cloud.CollectionsAPIDistributedZkTest-D35961A95B891665-001/tempDir-002/solr.xml
   [junit4]   2> 925000 T3249 oasc.ZkController.createCollectionZkNode Collection zkNode exists
   [junit4]   2> 925001 T3249 oascc.ZkStateReader.readConfigName Load collection config from:/collections/solrj_collection
   [junit4]   2> 925001 T3230 oasc.ZkController.createCollectionZkNode Check for collection zkNode:solrj_collection
   [junit4]   2> 925002 T3265 oascc.ZkStateReader.readConfigName path=/collections/solrj_collection configName=conf1 specified config exists in ZooKeeper
   [junit4]   2> 925003 T3230 oasc.ZkController.createCollectionZkNode Collection zkNode exists
   [junit4]   2> 925003 T3230 oascc.ZkStateReader.readConfigName Load collection config from:/collections/solrj_collection
   [junit4]   2> 925002 T3249 oascc.ZkStateReader.readConfigName path=/collections/solrj_collection configName=conf1 specified config exists in ZooKeeper
   [junit4]   2> 925003 T3265 oasc.SolrResourceLoader.<init> new SolrResourceLoader for directory: '../../../../../../../../../../mnt/ssd/jenkins/workspace/Lucene-Solr-trunk-Linux/solr/build/solr-core/test/J1/./solr.cloud.CollectionsAPIDistributedZkTest-D35961A95B891665-001/tempDir-004/solrj_collection_shard1_replica2/'
   [junit4]   2> 925004 T3230 oascc.ZkStateReader.readConfigName path=/collections/solrj_collection configName=conf1 specified config exists in ZooKeeper
   [junit4]   2> 925004 T3249 oasc.SolrResourceLoader.<init> new SolrResourceLoader for directory: './solr.cloud.CollectionsAPIDistributedZkTest-D35961A95B891665-001/tempDir-003/solrj_collection_shard2_replica2/'
   [junit4]   2> 925004 T3230 oasc.SolrResourceLoader.<init> new SolrResourceLoader for directory: '../../../../../../../../../../mnt/ssd/jenkins/workspace/Lucene-Solr-trunk-Linux/solr/build/solr-core/test/J1/./solr.cloud.CollectionsAPIDistributedZkTest-D35961A95B891665-001/tempDir-002/solrj_collection_shard2_replica1/'
   [junit4]   2> 925028 T3276 oasc.SolrConfig.<init> Using Lucene MatchVersion: LUCENE_50
   [junit4]   2> 925049 T3265 oasc.SolrConfig.<init> Using Lucene MatchVersion: LUCENE_50
   [junit4]   2> 925050 T3276 oasc.SolrConfig.<init> Loaded SolrConfig: solrconfig.xml
   [junit4]   2> 925052 T3276 oass.IndexSchema.readSchema Reading Solr Schema from schema.xml
   [junit4]   2> 925059 T3249 oasc.SolrConfig.<init> Using Lucene MatchVersion: LUCENE_50
   [junit4]   2> 925071 T3265 oasc.SolrConfig.<init> Loaded SolrConfig: solrconfig.xml
   [junit4]   2> 925072 T3249 oasc.SolrConfig.<init> Loaded SolrConfig: solrconfig.xml
   [junit4]   2> 925073 T3265 oass.IndexSchema.readSchema Reading Solr Schema from schema.xml
   [junit4]   2> 925079 T3249 oass.IndexSchema.readSchema Reading Solr Schema from schema.xml
   [junit4]   2> 925082 T3230 oasc.SolrConfig.<init> Using Lucene MatchVersion: LUCENE_50
   [junit4]   2> 925084 T3276 oass.IndexSchema.readSchema [solrj_collection_shard1_replica1] Schema name=test
   [junit4]   2> 925097 T3265 oass.IndexSchema.readSchema [solrj_collection_shard1_replica2] Schema name=test
   [junit4]   2> 925097 T3230 oasc.SolrConfig.<init> Loaded SolrConfig: solrconfig.xml
   [junit4]   2> 925110 T3230 oass.IndexSchema.readSchema Reading Solr Schema from schema.xml
   [junit4]   2> 925123 T3249 oass.IndexSchema.readSchema [solrj_collection_shard2_replica2] Schema name=test
   [junit4]   2> 925138 T3230 oass.IndexSchema.readSchema [solrj_collection_shard2_replica1] Schema name=test
   [junit4]   2> 925336 T3265 oass.OpenExchangeRatesOrgProvider.init Initialized with rates=open-exchange-rates.json, refreshInterval=1440.
   [junit4]   2> 925346 T3265 oass.IndexSchema.readSchema default search field in schema is text
   [junit4]   2> 925348 T3265 oass.IndexSchema.readSchema unique key field: id
   [junit4]   2> 925350 T3276 oass.OpenExchangeRatesOrgProvider.init Initialized with rates=open-exchange-rates.json, refreshInterval=1440.
   [junit4]   2> 925354 T3249 oass.OpenExchangeRatesOrgProvider.init Initialized with rates=open-exchange-rates.json, refreshInterval=1440.
   [junit4]   2> 925358 T3276 oass.IndexSchema.readSchema default search field in schema is text
   [junit4]   2> 925361 T3276 oass.IndexSchema.readSchema unique key field: id
   [junit4]   2> 925361 T3230 oass.OpenExchangeRatesOrgProvider.init Initialized with rates=open-exchange-rates.json, refreshInterval=1440.
   [junit4]   2> 925362 T3249 oass.IndexSchema.readSchema default search field in schema is text
   [junit4]   2> 925364 T3249 oass.IndexSchema.readSchema unique key field: id
   [junit4]   2> 925369 T3230 oass.IndexSchema.readSchema default search field in schema is text
   [junit4]   2> 925371 T3265 oass.FileExchangeRateProvider.reload Reloading exchange rates from file currency.xml
   [junit4]   2> 925373 T3230 oass.IndexSchema.readSchema unique key field: id
   [junit4]   2> 925375 T3265 oass.FileExchangeRateProvider.reload Reloading exchange rates from file currency.xml
   [junit4]   2> 925379 T3265 oass.OpenExchangeRatesOrgProvider.reload Reloading exchange rates from open-exchange-rates.json
   [junit4]   2> 925381 T3265 oass.OpenExchangeRatesOrgProvider$OpenExchangeRates.<init> WARN Unknown key IMPORTANT NOTE
   [junit4]   2> 925382 T3265 oass.OpenExchangeRatesOrgProvider$OpenExchangeRates.<init> WARN Expected key, got STRING
   [junit4]   2> 925382 T3276 oass.FileExchangeRateProvider.reload Reloading exchange rates from file currency.xml
   [junit4]   2> 925382 T3265 oass.OpenExchangeRatesOrgProvider.reload Reloading exchange rates from open-exchange-rates.json
   [junit4]   2> 925384 T3265 oass.OpenExchangeRatesOrgProvider$OpenExchangeRates.<init> WARN Unknown key IMPORTANT NOTE
   [junit4]   2> 925385 T3265 oass.OpenExchangeRatesOrgProvider$OpenExchangeRates.<init> WARN Expected key, got STRING
   [junit4]   2> 925386 T3265 oasc.CoreContainer.create Creating SolrCore 'solrj_collection_shard1_replica2' using configuration from collection solrj_collection
   [junit4]   2> 925386 T3276 oass.FileExchangeRateProvider.reload Reloading exchange rates from file currency.xml
   [junit4]   2> 925386 T3249 oass.FileExchangeRateProvider.reload Reloading exchange rates from file currency.xml
   [junit4]   2> 925386 T3265 oasc.SolrCore.initDirectoryFactory org.apache.solr.core.MockDirectoryFactory
   [junit4]   2> 925388 T3265 oasc.SolrCore.<init> [solrj_collection_shard1_replica2] Opening new SolrCore at ../../../../../../../../../../mnt/ssd/jenkins/workspace/Lucene-Solr-trunk-Linux/solr/build/solr-core/test/J1/./solr.cloud.CollectionsAPIDistributedZkTest-D35961A95B891665-001/tempDir-004/solrj_collection_shard1_replica2/, dataDir=../../../../../../../../../../mnt/ssd/jenkins/workspace/Lucene-Solr-trunk-Linux/solr/build/solr-core/test/J1/./solr.cloud.CollectionsAPIDistributedZkTest-D35961A95B891665-001/tempDir-004/solrj_collection_shard1_replica2/data/
   [junit4]   2> 925388 T3265 oasc.JmxMonitoredMap.<init> JMX monitoring is enabled. Adding Solr mbeans to JMX Server: com.sun.jmx.mbeanserver.JmxMBeanServer@9889e0
   [junit4]   2> 925392 T3276 oass.OpenExchangeRatesOrgProvider.reload Reloading exchange rates from open-exchange-rates.json
   [junit4]   2> 925393 T3276 oass.OpenExchangeRatesOrgProvider$OpenExchangeRates.<init> WARN Unknown key IMPORTANT NOTE
   [junit4]   2> 925394 T3276 oass.OpenExchangeRatesOrgProvider$OpenExchangeRates.<init> WARN Expected key, got STRING
   [junit4]   2> 925393 T3265 oasc.CachingDirectoryFactory.get return new directory for ../../../../../../../../../../mnt/ssd/jenkins/workspace/Lucene-Solr-trunk-Linux/solr/build/solr-core/test/J1/./solr.cloud.CollectionsAPIDistributedZkTest-D35961A95B891665-001/tempDir-004/solrj_collection_shard1_replica2/data
   [junit4]   2> 925394 T3249 oass.FileExchangeRateProvider.reload Reloading exchange rates from file currency.xml
   [junit4]   2> 925394 T3276 oass.OpenExchangeRatesOrgProvider.reload Reloading exchange rates from open-exchange-rates.json
   [junit4]   2> 925395 T3265 oasc.SolrCore.getNewIndexDir New index directory detected: old=null new=../../../../../../../../../../mnt/ssd/jenkins/workspace/Lucene-Solr-trunk-Linux/solr/build/solr-core/test/J1/./solr.cloud.CollectionsAPIDistributedZkTest-D35961A95B891665-001/tempDir-004/solrj_collection_shard1_replica2/data/index/
   [junit4]   2> 925398 T3249 oass.OpenExchangeRatesOrgProvider.reload Reloading exchange rates from open-exchange-rates.json
   [junit4]   2> 925397 T3276 oass.OpenExchangeRatesOrgProvider$OpenExchangeRates.<init> WARN Unknown key IMPORTANT NOTE
   [junit4]   2> 925399 T3276 oass.OpenExchangeRatesOrgProvider$OpenExchangeRates.<init> WARN Expected key, got STRING
   [junit4]   2> 925398 T3265 oasc.SolrCore.initIndex WARN [solrj_collection_shard1_replica2] Solr index directory '../../../../../../../../../../mnt/ssd/jenkins/workspace/Lucene-Solr-trunk-Linux/solr/build/solr-core/test/J1/./solr.cloud.CollectionsAPIDistributedZkTest-D35961A95B891665-001/tempDir-004/solrj_collection_shard1_replica2/data/index' doesn't exist. Creating new index...
   [junit4]   2> 925399 T3276 oasc.CoreContainer.create Creating SolrCore 'solrj_collection_shard1_replica1' using configuration from collection solrj_collection
   [junit4]   2> 925400 T3265 oasc.CachingDirectoryFactory.get return new directory for ../../../../../../../../../../mnt/ssd/jenkins/workspace/Lucene-Solr-trunk-Linux/solr/build/solr-core/test/J1/./solr.cloud.CollectionsAPIDistributedZkTest-D35961A95B891665-001/tempDir-004/solrj_collection_shard1_replica2/data/index
   [junit4]   2> 925399 T3230 oass.FileExchangeRateProvider.reload Reloading exchange rates from file currency.xml
   [junit4]   2> 925399 T3249 oass.OpenExchangeRatesOrgProvider$OpenExchangeRates.<init> WARN Unknown key IMPORTANT NOTE
   [junit4]   2> 925401 T3249 oass.OpenExchangeRatesOrgProvider$OpenExchangeRates.<init> WARN Expected key, got STRING
   [junit4]   2> 925400 T3265 oasu.RandomMergePolicy.<init> RandomMergePolicy wrapping class org.apache.lucene.index.TieredMergePolicy: [TieredMergePolicy: maxMergeAtOnce=16, maxMergeAtOnceExplicit=15, maxMergedSegmentMB=36.529296875, floorSegmentMB=0.396484375, forceMergeDeletesPctAllowed=4.767250435365494, segmentsPerTier=10.0, maxCFSSegmentSizeMB=8.796093022207999E12, noCFSRatio=0.23361234485408655
   [junit4]   2> 925400 T3276 oasc.SolrCore.initDirectoryFactory org.apache.solr.core.MockDirectoryFactory
   [junit4]   2> 925402 T3249 oass.OpenExchangeRatesOrgProvider.reload Reloading exchange rates from open-exchange-rates.json
   [junit4]   2> 925403 T3276 oasc.SolrCore.<init> [solrj_collection_shard1_replica1] Opening new SolrCore at ./solr.cloud.CollectionsAPIDistributedZkTest-D35961A95B891665-001/tempDir-005/solrj_collection_shard1_replica1/, dataDir=./solr.cloud.CollectionsAPIDistributedZkTest-D35961A95B891665-001/tempDir-005/solrj_collection_shard1_replica1/data/
   [junit4]   2> 925403 T3265 oasc.SolrDeletionPolicy.onCommit SolrDeletionPolicy.onCommit: commits: num=1
   [junit4]   2> 		commit{dir=MockDirectoryWrapper(RAMDirectory@1699021 lockFactory=org.apache.lucene.store.SingleInstanceLockFactory@197eec5),segFN=segments_1,generation=1}
   [junit4]   2> 925404 T3265 oasc.SolrDeletionPolicy.updateCommits newest commit generation = 1
   [junit4]   2> 925403 T3249 oass.OpenExchangeRatesOrgProvider$OpenExchangeRates.<init> WARN Unknown key IMPORTANT NOTE
   [junit4]   2> 925403 T3276 oasc.JmxMonitoredMap.<init> JMX monitoring is enabled. Adding Solr mbeans to JMX Server: com.sun.jmx.mbeanserver.JmxMBeanServer@9889e0
   [junit4]   2> 925404 T3249 oass.OpenExchangeRatesOrgProvider$OpenExchangeRates.<init> WARN Expected key, got STRING
   [junit4]   2> 925404 T3230 oass.FileExchangeRateProvider.reload Reloading exchange rates from file currency.xml
   [junit4]   2> 925405 T3249 oasc.CoreContainer.create Creating SolrCore 'solrj_collection_shard2_replica2' using configuration from collection solrj_collection
   [junit4]   2> 925406 T3276 oasc.CachingDirectoryFactory.get return new directory for ./solr.cloud.CollectionsAPIDistributedZkTest-D35961A95B891665-001/tempDir-005/solrj_collection_shard1_replica1/data
   [junit4]   2> 925407 T3249 oasc.SolrCore.initDirectoryFactory org.apache.solr.core.MockDirectoryFactory
   [junit4]   2> 925407 T3276 oasc.SolrCore.getNewIndexDir New index directory detected: old=null new=./solr.cloud.CollectionsAPIDistributedZkTest-D35961A95B891665-001/tempDir-005/solrj_collection_shard1_replica1/data/index/
   [junit4]   2> 925407 T3249 oasc.SolrCore.<init> [solrj_collection_shard2_replica2] Opening new SolrCore at ./solr.cloud.CollectionsAPIDistributedZkTest-D35961A95B891665-001/tempDir-003/solrj_collection_shard2_replica2/, dataDir=./solr.cloud.CollectionsAPIDistributedZkTest-D35961A95B891665-001/tempDir-003/solrj_collection_shard2_replica2/data/
   [junit4]   2> 925408 T3276 oasc.SolrCore.initIndex WARN [solrj_collection_shard1_replica1] Solr index directory './solr.cloud.CollectionsAPIDistributedZkTest-D35961A95B891665-001/tempDir-005/solrj_collection_shard1_replica1/data/index' doesn't exist. Creating new index...
   [junit4]   2> 925408 T3249 oasc.JmxMonitoredMap.<init> JMX monitoring is enabled. Adding Solr mbeans to JMX Server: com.sun.jmx.mbeanserver.JmxMBeanServer@9889e0
   [junit4]   2> 925409 T3276 oasc.CachingDirectoryFactory.get return new directory for ./solr.cloud.CollectionsAPIDistributedZkTest-D35961A95B891665-001/tempDir-005/solrj_collection_shard1_replica1/data/index
   [junit4]   2> 925409 T3265 oasup.UpdateRequestProcessorChain.init creating updateRequestProcessorChain "nodistrib"
   [junit4]   2> 925410 T3276 oasu.RandomMergePolicy.<init> RandomMergePolicy wrapping class org.apache.lucene.index.TieredMergePolicy: [TieredMergePolicy: maxMergeAtOnce=16, maxMergeAtOnceExplicit=15, maxMergedSegmentMB=36.529296875, floorSegmentMB=0.396484375, forceMergeDeletesPctAllowed=4.767250435365494, segmentsPerTier=10.0, maxCFSSegmentSizeMB=8.796093022207999E12, noCFSRatio=0.23361234485408655
   [junit4]   2> 925409 T3230 oass.OpenExchangeRatesOrgProvider.reload Reloading exchange rates from open-exchange-rates.json
   [junit4]   2> 925411 T3276 oasc.SolrDeletionPolicy.onCommit SolrDeletionPolicy.onCommit: commits: num=1
   [junit4]   2> 		commit{dir=MockDirectoryWrapper(RAMDirectory@17952 lockFactory=org.apache.lucene.store.SingleInstanceLockFactory@145dd6),segFN=segments_1,generation=1}
   [junit4]   2> 925410 T3249 oasc.CachingDirectoryFactory.get return new directory for ./solr.cloud.CollectionsAPIDistributedZkTest-D35961A95B891665-001/tempDir-003/solrj_collection_shard2_replica2/data
   [junit4]   2> 925410 T3265 oasup.UpdateRequestProcessorChain.init creating updateRequestProcessorChain "dedupe"
   [junit4]   2> 925412 T3249 oasc.SolrCore.getNewIndexDir New index directory detected: old=null new=./solr.cloud.CollectionsAPIDistributedZkTest-D35961A95B891665-001/tempDir-003/solrj_collection_shard2_replica2/data/index/
   [junit4]   2> 925411 T3230 oass.OpenExchangeRatesOrgProvider$OpenExchangeRates.<init> WARN Unknown key IMPORTANT NOTE
   [junit4]   2> 925411 T3276 oasc.SolrDeletionPolicy.updateCommits newest commit generation = 1
   [junit4]   2> 925413 T3230 oass.OpenExchangeRatesOrgProvider$OpenExchangeRates.<init> WARN Expected key, got STRING
   [junit4]   2> 925412 T3249 oasc.SolrCore.initIndex WARN [solrj_collection_shard2_replica2] Solr index directory './solr.cloud.CollectionsAPIDistributedZkTest-D35961A95B891665-001/tempDir-003/solrj_collection_shard2_replica2/data/index' doesn't exist. Creating new index...
   [junit4]   2> 925412 T3265 oasup.UpdateRequestProcessorChain.init inserting DistributedUpdateProcessorFactory into updateRequestProcessorChain "dedupe"
   [junit4]   2> 925415 T3249 oasc.CachingDirectoryFactory.get return new directory for ./solr.cloud.CollectionsAPIDistributedZkTest-D35961A95B891665-001/tempDir-003/solrj_collection_shard2_replica2/data/index
   [junit4]   2> 925415 T3265 oasup.UpdateRequestProcessorChain.init creating updateRequestProcessorChain "stored_sig"
   [junit4]   2> 925414 T3230 oass.OpenExchangeRatesOrgProvider.reload Reloading exchange rates from open-exchange-rates.json
   [junit4]   2> 925415 T3265 oasup.UpdateRequestProcessorChain.init inserting DistributedUpdateProcessorFactory into updateRequestProcessorChain "stored_sig"
   [junit4]   2> 925415 T3249 oasu.RandomMergePolicy.<init> RandomMergePolicy wrapping class org.apache.lucene.index.TieredMergePolicy: [TieredMergePolicy: maxMergeAtOnce=16, maxMergeAtOnceExplicit=15, maxMergedSegmentMB=36.529296875, floorSegmentMB=0.396484375, forceMergeDeletesPctAllowed=4.767250435365494, segmentsPerTier=10.0, maxCFSSegmentSizeMB=8.796093022207999E12, noCFSRatio=0.23361234485408655
   [junit4]   2> 925417 T3230 oass.OpenExchangeRatesOrgProvider$OpenExchangeRates.<init> WARN Unknown key IMPORTANT NOTE
   [junit4]   2> 925418 T3249 oasc.SolrDeletionPolicy.onCommit SolrDeletionPolicy.onCommit: commits: num=1
   [junit4]   2> 		commit{dir=MockDirectoryWrapper(RAMDirectory@286073 lockFactory=org.apache.lucene.store.SingleInstanceLockFactory@16ad3ab),segFN=segments_1,generation=1}
   [junit4]   2> 925418 T3276 oasup.UpdateRequestProcessorChain.init creating updateRequestProcessorChain "nodistrib"
   [junit4]   2> 925416 T3265 oasup.UpdateRequestProcessorChain.init creating updateRequestProcessorChain "distrib-dup-test-chain-explicit"
   [junit4]   2> 925419 T3276 oasup.UpdateRequestProcessorChain.init creating updateRequestProcessorChain "dedupe"
   [junit4]   2> 925419 T3265 oasup.UpdateRequestProcessorChain.init creating updateRequestProcessorChain "distrib-dup-test-chain-implicit"
   [junit4]   2> 925418 T3249 oasc.SolrDeletionPolicy.updateCommits newest commit generation = 1
   [junit4]   2> 925418 T3230 oass.OpenExchangeRatesOrgProvider$OpenExchangeRates.<init> WARN Expected key, got STRING
   [junit4]   2> 925419 T3265 oasup.UpdateRequestProcessorChain.init inserting DistributedUpdateProcessorFactory into updateRequestProcessorChain "distrib-dup-test-chain-implicit"
   [junit4]   2> 925421 T3265 oasc.SolrCore.loadUpdateProcessorChains no updateRequestProcessorChain defined as default, creating implicit default
   [junit4]   2> 925419 T3276 oasup.UpdateRequestProcessorChain.init inserting DistributedUpdateProcessorFactory into updateRequestProcessorChain "dedupe"
   [junit4]   2> 925421 T3265 oasc.RequestHandlers.initHandlersFromConfig created standard: solr.StandardRequestHandler
   [junit4]   2> 925420 T3230 oasc.CoreContainer.create Creating SolrCore 'solrj_collection_shard2_replica1' using configuration from collection solrj_collection
   [junit4]   2> 925422 T3265 oasc.RequestHandlers.initHandlersFromConfig created /get: solr.RealTimeGetHandler
   [junit4]   2> 925422 T3276 oasup.UpdateRequestProcessorChain.init creating updateRequestProcessorChain "stored_sig"
   [junit4]   2> 925423 T3265 oasc.RequestHandlers.initHandlersFromConfig adding lazy requestHandler: solr.ReplicationHandler
   [junit4]   2> 925422 T3230 oasc.SolrCore.initDirectoryFactory org.apache.solr.core.MockDirectoryFactory
   [junit4]   2> 925424 T3249 oasup.UpdateRequestProcessorChain.init creating updateRequestProcessorChain "nodistrib"
   [junit4]   2> 925424 T3265 oasc.RequestHandlers.initHandlersFromConfig created /replication: solr.ReplicationHandler
   [junit4]   2> 925423 T3276 oasup.UpdateRequestProcessorChain.init inserting DistributedUpdateProcessorFactory into updateRequestProcessorChain "stored_sig"
   [junit4]   2> 925424 T3249 oasup.UpdateRequestProcessorChain.init creating updateRequestProcessorChain "dedupe"
   [junit4]   2> 925424 T3230 oasc.SolrCore.<init> [solrj_collection_shard2_replica1] Opening new SolrCore at ../../../../../../../../../../mnt/ssd/jenkins/workspace/Lucene-Solr-trunk-Linux/solr/build/solr-core/test/J1/./solr.cloud.CollectionsAPIDistributedZkTest-D35961A95B891665-001/tempDir-002/solrj_collection_shard2_replica1/, dataDir=../../../../../../../../../../mnt/ssd/jenkins/workspace/Lucene-Solr-trunk-Linux/solr/build/solr-core/test/J1/./solr.cloud.CollectionsAPIDistributedZkTest-D35961A95B891665-001/tempDir-002/solrj_collection_shard2_replica1/data/
   [junit4]   2> 925425 T3249 oasup.UpdateRequestProcessorChain.init inserting DistributedUpdateProcessorFactory into updateRequestProcessorChain "dedupe"
   [junit4]   2> 925425 T3276 oasup.UpdateRequestProcessorChain.init creating updateRequestProcessorChain "distrib-dup-test-chain-explicit"
   [junit4]   2> 925425 T3265 oasc.RequestHandlers.initHandlersFromConfig created /update: solr.UpdateRequestHandler
   [junit4]   2> 925427 T3276 oasup.UpdateRequestProcessorChain.init creating updateRequestProcessorChain "distrib-dup-test-chain-implicit"
   [junit4]   2> 925426 T3249 oasup.UpdateRequestProcessorChain.init creating updateRequestProcessorChain "stored_sig"
   [junit4]   2> 925426 T3230 oasc.JmxMonitoredMap.<init> JMX monitoring is enabled. Adding Solr mbeans to JMX Server: com.sun.jmx.mbeanserver.JmxMBeanServer@9889e0
   [junit4]   2> 925428 T3249 oasup.UpdateRequestProcessorChain.init inserting DistributedUpdateProcessorFactory into updateRequestProcessorChain "stored_sig"
   [junit4]   2> 925427 T3276 oasup.UpdateRequestProcessorChain.init inserting DistributedUpdateProcessorFactory into updateRequestProcessorChain "distrib-dup-test-chain-implicit"
   [junit4]   2> 925429 T3276 oasc.SolrCore.loadUpdateProcessorChains no updateRequestProcessorChain defined as default, creating implicit default
   [junit4]   2> 925427 T3265 oasc.RequestHandlers.initHandlersFromConfig created /admin/: org.apache.solr.handler.admin.AdminHandlers
   [junit4]   2> 925428 T3249 oasup.UpdateRequestProcessorChain.init creating updateRequestProcessorChain "distrib-dup-test-chain-explicit"
   [junit4]   2> 925429 T3276 oasc.RequestHandlers.initHandlersFromConfig created standard: solr.StandardRequestHandler
   [junit4]   2> 925430 T3249 oasup.UpdateRequestProcessorChain.init creating updateRequestProcessorChain "distrib-dup-test-chain-implicit"
   [junit4]   2> 925430 T3265 oasc.RequestHandlers.initHandlersFromConfig created /admin/file: solr.admin.ShowFileRequestHandler
   [junit4]   2> 925430 T3230 oasc.CachingDirectoryFactory.get return new directory for ../../../../../../../../../../mnt/ssd/jenkins/workspace/Lucene-Solr-trunk-Linux/solr/build/solr-core/test/J1/./solr.cloud.CollectionsAPIDistributedZkTest-D35961A95B891665-001/tempDir-002/solrj_collection_shard2_replica1/data
   [junit4]   2> 925431 T3265 oasc.RequestHandlers.initHandlersFromConfig created /admin/fileedit: solr.admin.EditFileRequestHandler
   [junit4]   2> 925431 T3249 oasup.UpdateRequestProcessorChain.init inserting DistributedUpdateProcessorFactory into updateRequestProcessorChain "distrib-dup-test-chain-implicit"
   [junit4]   2> 925431 T3276 oasc.RequestHandlers.initHandlersFromConfig created /get: solr.RealTimeGetHandler
   [junit4]   2> 925432 T3276 oasc.RequestHandlers.initHandlersFromConfig adding lazy requestHandler: solr.ReplicationHandler
   [junit4]   2> 925432 T3249 oasc.SolrCore.loadUpdateProcessorChains no updateRequestProcessorChain defined as default, creating implicit default
   [junit4]   2> 925432 T3230 oasc.SolrCore.getNewIndexDir New index directory detected: old=null new=../../../../../../../../../../mnt/ssd/jenkins/workspace/Lucene-Solr-trunk-Linux/solr/build/solr-core/test/J1/./solr.cloud.CollectionsAPIDistributedZkTest-D35961A95B891665-001/tempDir-002/solrj_collection_shard2_replica1/data/index/
   [junit4]   2> 925433 T3265 oashl.XMLLoader.init xsltCacheLifetimeSeconds=60
   [junit4]   2> 925433 T3249 oasc.RequestHandlers.initHandlersFromConfig created standard: solr.StandardRequestHandler
   [junit4]   2> 925433 T3276 oasc.RequestHandlers.initHandlersFromConfig created /replication: solr.ReplicationHandler
   [junit4]   2> 925434 T3230 oasc.SolrCore.initIndex WARN [solrj_collection_shard2_replica1] Solr index directory '../../../../../../../../../../mnt/ssd/jenkins/workspace/Lucene-Solr-trunk-Linux/solr/build/solr-core/test/J1/./solr.cloud.CollectionsAPIDistributedZkTest-D35961A95B891665-001/tempDir-002/solrj_collection_shard2_replica1/data/index' doesn't exist. Creating new index...
   [junit4]   2> 925435 T3276 oasc.RequestHandlers.initHandlersFromConfig created /update: solr.UpdateRequestHandler
   [junit4]   2> 925435 T3249 oasc.RequestHandlers.initHandlersFromConfig created /get: solr.RealTimeGetHandler
   [junit4]   2> 925436 T3249 oasc.RequestHandlers.initHandlersFromConfig adding lazy requestHandler: solr.ReplicationHandler
   [junit4]   2> 925436 T3276 oasc.RequestHandlers.initHandlersFromConfig created /admin/: org.apache.solr.handler.admin.AdminHandlers
   [junit4]   2> 925436 T3265 oasu.CommitTracker.<init> Hard AutoCommit: disabled
   [junit4]   2> 925437 T3276 oasc.RequestHandlers.initHandlersFromConfig created /admin/file: solr.admin.ShowFileRequestHandler
   [junit4]   2> 925436 T3230 oasc.CachingDirectoryFactory.get return new directory for ../../../../../../../../../../mnt/ssd/jenkins/workspace/Lucene-Solr-trunk-Linux/solr/build/solr-core/test/J1/./solr.cloud.CollectionsAPIDistributedZkTest-D35961A95B891665-001/tempDir-002/solrj_collection_shard2_replica1/data/index
   [junit4]   2> 925438 T3276 oasc.RequestHandlers.initHandlersFromConfig created /admin/fileedit: solr.admin.EditFileRequestHandler
   [junit4]   2> 925437 T3265 oasu.CommitTracker.<init> Soft AutoCommit: disabled
   [junit4]   2> 925437 T3249 oasc.RequestHandlers.initHandlersFromConfig created /replication: solr.ReplicationHandler
   [junit4]   2> 925438 T3230 oasu.RandomMergePolicy.<init> RandomMergePolicy wrapping class org.apache.lucene.index.TieredMergePolicy: [TieredMergePolicy: maxMergeAtOnce=16, maxMergeAtOnceExplicit=15, maxMergedSegmentMB=36.529296875, floorSegmentMB=0.396484375, forceMergeDeletesPctAllowed=4.767250435365494, segmentsPerTier=10.0, maxCFSSegmentSizeMB=8.796093022207999E12, noCFSRatio=0.23361234485408655
   [junit4]   2> 925440 T3249 oasc.RequestHandlers.initHandlersFromConfig created /update: solr.UpdateRequestHandler
   [junit4]   2> 925440 T3276 oashl.XMLLoader.init xsltCacheLifetimeSeconds=60
   [junit4]   2> 925439 T3265 oasu.RandomMergePolicy.<init> RandomMergePolicy wrapping class org.apache.lucene.index.LogByteSizeMergePolicy: [LogByteSizeMergePolicy: minMergeSize=1677721, mergeFactor=48, maxMergeSize=2147483648, maxMergeSizeForForcedMerge=9223372036854775807, calibrateSizeByDeletes=false, maxMergeDocs=2147483647, maxCFSSegmentSizeMB=8.796093022207999E12, noCFSRatio=1.0]
   [junit4]   2> 925440 T3230 oasc.SolrDeletionPolicy.onCommit SolrDeletionPolicy.onCommit: commits: num=1
   [junit4]   2> 		commit{dir=MockDirectoryWrapper(RAMDirectory@a80a6d lockFactory=org.apache.lucene.store.SingleInstanceLockFactory@1b351e5),segFN=segments_1,generation=1}
   [junit4]   2> 925440 T3249 oasc.RequestHandlers.initHandlersFromConfig created /admin/: org.apache.solr.handler.admin.AdminHandlers
   [junit4]   2> 925441 T3230 oasc.SolrDeletionPolicy.updateCommits newest commit generation = 1
   [junit4]   2> 925442 T3276 oasu.CommitTracker.<init> Hard AutoCommit: disabled
   [junit4]   2> 925441 T3265 oasc.SolrDeletionPolicy.onInit SolrDeletionPolicy.onInit: commits: num=1
   [junit4]   2> 		commit{dir=MockDirectoryWrapper(RAMDirectory@1699021 lockFactory=org.apache.lucene.store.SingleInstanceLockFactory@197eec5),segFN=segments_1,generation=1}
   [junit4]   2> 925443 T3276 oasu.CommitTracker.<init> Soft AutoCommit: disabled
   [junit4]   2> 925442 T3249 oasc.RequestHandlers.initHandlersFromConfig created /admin/file: solr.admin.ShowFileRequestHandler
   [junit4]   2> 925443 T3265 oasc.SolrDeletionPolicy.updateCommits newest commit generation = 1
   [junit4]   2> 925444 T3249 oasc.RequestHandlers.initHandlersFromConfig created /admin/fileedit: solr.admin.EditFileRequestHandler
   [junit4]   2> 925444 T3265 oass.SolrIndexSearcher.<init> Opening Searcher@89e28f[solrj_collection_shard1_replica2] main
   [junit4]   2> 925444 T3276 oasu.RandomMergePolicy.<init> RandomMergePolicy wrapping class org.apache.lucene.index.LogByteSizeMergePolicy: [LogByteSizeMergePolicy: minMergeSize=1677721, mergeFactor=48, maxMergeSize=2147483648, maxMergeSizeForForcedMerge=9223372036854775807, calibrateSizeByDeletes=false, maxMergeDocs=2147483647, maxCFSSegmentSizeMB=8.796093022207999E12, noCFSRatio=1.0]
   [junit4]   2> 925445 T3265 oascc.ZkStateReader.readConfigName Load collection config from:/collections/solrj_collection
   [junit4]   2> 925445 T3276 oasc.SolrDeletionPolicy.onInit SolrDeletionPolicy.onInit: commits: num=1
   [junit4]   2> 		commit{dir=MockDirectoryWrapper(RAMDirectory@17952 lockFactory=org.apache.lucene.store.SingleInstanceLockFactory@145dd6),segFN=segments_1,generation=1}
   [junit4]   2> 925446 T3276 oasc.SolrDeletionPolicy.updateCommits newest commit generation = 1
   [junit4]   2> 925445 T3249 oashl.XMLLoader.init xsltCacheLifetimeSeconds=60
   [junit4]   2> 925446 T3276 oass.SolrIndexSearcher.<init> Opening Searcher@e4a4fb[solrj_collection_shard1_replica1] main
   [junit4]   2> 925446 T3265 oascc.ZkStateReader.readConfigName path=/collections/solrj_collection configName=conf1 specified config exists in ZooKeeper
   [junit4]   2> 925447 T3265 oasr.ManagedResourceStorage.newStorageIO Setting up ZooKeeper-based storage for the RestManager with znodeBase: /configs/conf1
   [junit4]   2> 925447 T3276 oascc.ZkStateReader.readConfigName Load collection config from:/collections/solrj_collection
   [junit4]   2> 925448 T3230 oasup.UpdateRequestProcessorChain.init creating updateRequestProcessorChain "nodistrib"
   [junit4]   2> 925448 T3265 oasr.ManagedResourceStorage$ZooKeeperStorageIO.configure Configured ZooKeeperStorageIO with znodeBase: /configs/conf1
   [junit4]   2> 925449 T3230 oasup.UpdateRequestProcessorChain.init creating updateRequestProcessorChain "dedupe"
   [junit4]   2> 925449 T3276 oascc.ZkStateReader.readConfigName path=/collections/solrj_collection configName=conf1 specified config exists in ZooKeeper
   [junit4]   2> 925450 T3276 oasr.ManagedResourceStorage.newStorageIO Setting up ZooKeeper-based storage for the RestManager with znodeBase: /configs/conf1
   [junit4]   2> 925449 T3249 oasu.CommitTracker.<init> Hard AutoCommit: disabled
   [junit4]   2> 925449 T3230 oasup.UpdateRequestProcessorChain.init inserting DistributedUpdateProcessorFactory into updateRequestProcessorChain "dedupe"
   [junit4]   2> 925449 T3265 oasr.RestManager.init Initializing RestManager with initArgs: {}
   [junit4]   2> 925451 T3230 oasup.UpdateRequestProcessorChain.init creating updateRequestProcessorChain "stored_sig"
   [junit4]   2> 925450 T3276 oasr.ManagedResourceStorage$ZooKeeperStorageIO.configure Configured ZooKeeperStorageIO with znodeBase: /configs/conf1
   [junit4]   2> 925451 T3276 oasr.RestManager.init Initializing RestManager with initArgs: {}
   [junit4]   2> 925450 T3249 oasu.CommitTracker.<init> Soft AutoCommit: disabled
   [junit4]   2> 925452 T3276 oasr.ManagedResourceStorage.load Reading _rest_managed.json using ZooKeeperStorageIO:path=/configs/conf1
   [junit4]   2> 925451 T3230 oasup.UpdateRequestProcessorChain.init inserting DistributedUpdateProcessorFactory into updateRequestProcessorChain "stored_sig"
   [junit4]   2> 925453 T3276 oasr.ManagedResourceStorage$ZooKeeperStorageIO.openInputStream No data found for znode /configs/conf1/_rest_managed.json
   [junit4]   2> 925451 T3265 oasr.ManagedResourceStorage.load

[...truncated too long message...]

ooKeeper.exists(ZooKeeper.java:1045)
   [junit4]   2> 		at org.apache.solr.common.cloud.SolrZkClient$3.execute(SolrZkClient.java:209)
   [junit4]   2> 		at org.apache.solr.common.cloud.SolrZkClient$3.execute(SolrZkClient.java:206)
   [junit4]   2> 		at org.apache.solr.common.cloud.ZkCmdExecutor.retryOperation(ZkCmdExecutor.java:73)
   [junit4]   2> 		at org.apache.solr.common.cloud.SolrZkClient.exists(SolrZkClient.java:206)
   [junit4]   2> 		at org.apache.solr.common.cloud.SolrZkClient.makePath(SolrZkClient.java:417)
   [junit4]   2> 		at org.apache.solr.common.cloud.SolrZkClient.makePath(SolrZkClient.java:386)
   [junit4]   2> 		at org.apache.solr.common.cloud.SolrZkClient.makePath(SolrZkClient.java:373)
   [junit4]   2> 		at org.apache.solr.cloud.ShardLeaderElectionContextBase$1.execute(ElectionContext.java:128)
   [junit4]   2> 		at org.apache.solr.common.util.RetryUtil.retryOnThrowable(RetryUtil.java:31)
   [junit4]   2> 		at org.apache.solr.cloud.ShardLeaderElectionContextBase.runLeaderProcess(ElectionContext.java:123)
   [junit4]   2> 		... 7 more
   [junit4]   2> 	
   [junit4]   2> 1336030 T6707 oascc.ZkStateReader$3.process WARN ZooKeeper watch triggered, but Solr cannot talk to ZK
   [junit4]   2> 1336031 T6721 oascc.ZkStateReader$3.process WARN ZooKeeper watch triggered, but Solr cannot talk to ZK
   [junit4]   2> 1336031 T6707 oasc.LeaderElector$ElectionWatcher.process WARN  org.apache.zookeeper.KeeperException$SessionExpiredException: KeeperErrorCode = Session expired for /collections/testOverseerCol/leader_elect/shard1/election
   [junit4]   2> 	at org.apache.zookeeper.KeeperException.create(KeeperException.java:127)
   [junit4]   2> 	at org.apache.zookeeper.KeeperException.create(KeeperException.java:51)
   [junit4]   2> 	at org.apache.zookeeper.ZooKeeper.getChildren(ZooKeeper.java:1472)
   [junit4]   2> 	at org.apache.solr.common.cloud.SolrZkClient$6.execute(SolrZkClient.java:260)
   [junit4]   2> 	at org.apache.solr.common.cloud.SolrZkClient$6.execute(SolrZkClient.java:257)
   [junit4]   2> 	at org.apache.solr.common.cloud.ZkCmdExecutor.retryOperation(ZkCmdExecutor.java:73)
   [junit4]   2> 	at org.apache.solr.common.cloud.SolrZkClient.getChildren(SolrZkClient.java:257)
   [junit4]   2> 	at org.apache.solr.cloud.LeaderElector.checkIfIamLeader(LeaderElector.java:94)
   [junit4]   2> 	at org.apache.solr.cloud.LeaderElector.access$200(LeaderElector.java:55)
   [junit4]   2> 	at org.apache.solr.cloud.LeaderElector$ElectionWatcher.process(LeaderElector.java:303)
   [junit4]   2> 	at org.apache.zookeeper.ClientCnxn$EventThread.processEvent(ClientCnxn.java:522)
   [junit4]   2> 	at org.apache.zookeeper.ClientCnxn$EventThread.run(ClientCnxn.java:498)
   [junit4]   2> 
   [junit4]   2> 1336032 T6707 oasc.LeaderElector$ElectionWatcher.process This watcher is not active anymore /overseer_elect/election/91653166909030415-127.0.0.1:33789_-n_0000000011
   [junit4]   2> 1336032 T6707 oasc.LeaderElector$ElectionWatcher.process WARN  org.apache.zookeeper.KeeperException$SessionExpiredException: KeeperErrorCode = Session expired for /overseer_elect/election
   [junit4]   2> 	at org.apache.zookeeper.KeeperException.create(KeeperException.java:127)
   [junit4]   2> 	at org.apache.zookeeper.KeeperException.create(KeeperException.java:51)
   [junit4]   2> 	at org.apache.zookeeper.ZooKeeper.getChildren(ZooKeeper.java:1472)
   [junit4]   2> 	at org.apache.solr.common.cloud.SolrZkClient$6.execute(SolrZkClient.java:260)
   [junit4]   2> 	at org.apache.solr.common.cloud.SolrZkClient$6.execute(SolrZkClient.java:257)
   [junit4]   2> 	at org.apache.solr.common.cloud.ZkCmdExecutor.retryOperation(ZkCmdExecutor.java:73)
   [junit4]   2> 	at org.apache.solr.common.cloud.SolrZkClient.getChildren(SolrZkClient.java:257)
   [junit4]   2> 	at org.apache.solr.cloud.LeaderElector.checkIfIamLeader(LeaderElector.java:94)
   [junit4]   2> 	at org.apache.solr.cloud.LeaderElector.access$200(LeaderElector.java:55)
   [junit4]   2> 	at org.apache.solr.cloud.LeaderElector$ElectionWatcher.process(LeaderElector.java:303)
   [junit4]   2> 	at org.apache.zookeeper.ClientCnxn$EventThread.processEvent(ClientCnxn.java:522)
   [junit4]   2> 	at org.apache.zookeeper.ClientCnxn$EventThread.run(ClientCnxn.java:498)
   [junit4]   2> 
   [junit4]   2> NOTE: leaving temporary files on disk at: /mnt/ssd/jenkins/workspace/Lucene-Solr-trunk-Linux/solr/build/solr-core/test/J0/./solr.cloud.OverseerRolesTest-D35961A95B891665-001
   [junit4]   2> NOTE: test params are: codec=Lucene42, sim=RandomSimilarityProvider(queryNorm=true,coord=no): {}, locale=it, timezone=Africa/Gaborone
   [junit4]   2> NOTE: Linux 3.8.0-38-generic i386/Oracle Corporation 1.8.0_20-ea (32-bit)/cpus=8,threads=1,free=84799168,total=201711616
   [junit4]   2> NOTE: All tests run in this JVM: [SyncSliceTest, LeaderElectionTest, RecoveryZkTest, TestCursorMarkWithoutUniqueKey, UUIDFieldTest, LoggingHandlerTest, SolrCoreTest, SampleTest, BadComponentTest, PeerSyncTest, TestSearchPerf, ClusterStateTest, MigrateRouteKeyTest, TestRealTimeGet, TestManagedStopFilterFactory, FieldFacetTest, TestNoOpRegenerator, ExternalFileFieldSortTest, FileBasedSpellCheckerTest, TestModifyConfFiles, TestElisionMultitermQuery, TestCharFilters, TestDynamicFieldCollectionResource, TestFastLRUCache, TestFieldResource, TestClassNameShortening, CircularListTest, TestDefaultSimilarityFactory, IndexSchemaTest, CoreAdminHandlerTest, QueryFacetTest, TestDefaultSearchFieldResource, QueryElevationComponentTest, BasicFunctionalityTest, TestHighlightDedupGrouping, SSLMigrationTest, DocValuesMissingTest, CSVRequestHandlerTest, TestBadConfig, SpellingQueryConverterTest, ReturnFieldsTest, TestStressVersions, TestSerializedLuceneMatchVersion, TestPostingsSolrHighlighter, SuggestComponentTest, BinaryUpdateRequestHandlerTest, TestFreeTextSuggestions, TestExceedMaxTermLength, URLClassifyProcessorTest, SuggesterFSTTest, TestGroupingSearch, TestHighFrequencyDictionaryFactory, TestReplicationHandler, TermVectorComponentTest, OverseerTest, RegexBoostProcessorTest, TestBM25SimilarityFactory, ZkCLITest, HdfsWriteToMultipleCollectionsTest, MoreLikeThisHandlerTest, CollectionsAPIAsyncDistributedZkTest, PrimitiveFieldTypeTest, RemoteQueryErrorTest, TestLFUCache, TestStressUserVersions, SliceStateTest, TestSchemaNameResource, TestManagedSynonymFilterFactory, StatelessScriptUpdateProcessorFactoryTest, TestQueryUtils, TestRequestStatusCollectionAPI, TestJmxMonitoredMap, SliceStateUpdateTest, TestAnalyzeInfixSuggestions, SolrIndexSplitterTest, PreAnalyzedUpdateProcessorTest, BasicDistributedZkTest, DistributedQueryElevationComponentTest, HdfsDirectoryTest, FastVectorHighlighterTest, TestMiniSolrCloudCluster, TestRandomDVFaceting, AnalysisAfterCoreReloadTest, TestConfig, TestCloudManagedSchemaAddField, TestCloudManagedSchema, TestBlendedInfixSuggestions, TestSolrQueryParserDefaultOperatorResource, BadCopyFieldTest, TermsComponentTest, SOLR749Test, TestSearcherReuse, TestRecoveryHdfs, QueryEqualityTest, TestUniqueKeyFieldResource, ChaosMonkeySafeLeaderTest, LeaderElectionIntegrationTest, ZkSolrClientTest, TestDistributedGrouping, TestHashPartitioner, TestReload, DistributedTermsComponentTest, TestRangeQuery, TestCoreContainer, SimpleFacetsTest, StatsComponentTest, SolrCmdDistributorTest, TestSort, OverseerCollectionProcessorTest, ShowFileRequestHandlerTest, CurrencyFieldOpenExchangeTest, TestExtendedDismaxParser, SpellCheckCollatorTest, SolrRequestParserTest, DocValuesTest, SuggesterTSTTest, SpatialFilterTest, SuggesterWFSTTest, PolyFieldTest, NoCacheHeaderTest, SchemaVersionSpecificBehaviorTest, TestUpdate, FieldMutatingUpdateProcessorTest, TestWordDelimiterFilterFactory, DefaultValueUpdateProcessorTest, TestRemoteStreaming, TestSolrDeletionPolicy1, XsltUpdateRequestHandlerTest, IndexBasedSpellCheckerTest, StandardRequestHandlerTest, TestWriterPerf, DirectSolrSpellCheckerTest, DocumentBuilderTest, TestSolrQueryParser, IndexSchemaRuntimeFieldTest, JSONWriterTest, MBeansHandlerTest, TestAnalyzedSuggestions, JsonLoaderTest, PingRequestHandlerTest, CoreContainerCoreInitFailuresTest, UpdateParamsTest, TestSolrIndexConfig, CopyFieldTest, TestMergePolicyConfig, TestDocSet, TestFuzzyAnalyzedSuggestions, TestSolrCoreProperties, TestLuceneMatchVersion, SpellPossibilityIteratorTest, SynonymTokenizerTest, EchoParamsTest, TestPerFieldSimilarity, TestLMJelinekMercerSimilarityFactory, ResourceLoaderTest, DateMathParserTest, ChaosMonkeyNothingIsSafeTest, AssignTest, AsyncMigrateRouteKeyTest, ExternalCollectionsTest, OverseerRolesTest]
   [junit4] Completed on J0 in 50.21s, 1 test, 1 failure <<< FAILURES!

[...truncated 185 lines...]
BUILD FAILED
/mnt/ssd/jenkins/workspace/Lucene-Solr-trunk-Linux/build.xml:467: The following error occurred while executing this line:
/mnt/ssd/jenkins/workspace/Lucene-Solr-trunk-Linux/build.xml:447: The following error occurred while executing this line:
/mnt/ssd/jenkins/workspace/Lucene-Solr-trunk-Linux/build.xml:45: The following error occurred while executing this line:
/mnt/ssd/jenkins/workspace/Lucene-Solr-trunk-Linux/extra-targets.xml:37: The following error occurred while executing this line:
/mnt/ssd/jenkins/workspace/Lucene-Solr-trunk-Linux/solr/build.xml:189: The following error occurred while executing this line:
/mnt/ssd/jenkins/workspace/Lucene-Solr-trunk-Linux/solr/common-build.xml:496: The following error occurred while executing this line:
/mnt/ssd/jenkins/workspace/Lucene-Solr-trunk-Linux/lucene/common-build.xml:1296: The following error occurred while executing this line:
/mnt/ssd/jenkins/workspace/Lucene-Solr-trunk-Linux/lucene/common-build.xml:920: There were test failures: 399 suites, 1670 tests, 1 error, 1 failure, 37 ignored (16 assumptions)

Total time: 61 minutes 8 seconds
Build step 'Invoke Ant' marked build as failure
Description set: Java: 32bit/jdk1.8.0_20-ea-b05 -client -XX:+UseConcMarkSweepGC
Archiving artifacts
Recording test results
Email was triggered for: Failure
Sending email for trigger: Failure



Mime
View raw message