lucene-dev mailing list archives

Site index · List index
Message view « Date » · « Thread »
Top « Date » · « Thread »
From Policeman Jenkins Server <jenk...@thetaphi.de>
Subject [JENKINS] Lucene-Solr-4.x-MacOSX (64bit/jdk1.8.0) - Build # 1434 - Failure!
Date Fri, 04 Apr 2014 18:00:43 GMT
Build: http://jenkins.thetaphi.de/job/Lucene-Solr-4.x-MacOSX/1434/
Java: 64bit/jdk1.8.0 -XX:-UseCompressedOops -XX:+UseParallelGC

28 tests failed.
REGRESSION:  org.apache.solr.hadoop.LineRandomizerMapperReducerTest.testMapReduce2Items

Error Message:
Could not initialize class org.apache.hadoop.util.Shell

Stack Trace:
java.lang.NoClassDefFoundError: Could not initialize class org.apache.hadoop.util.Shell
	at org.apache.hadoop.util.StringUtils.<clinit>(StringUtils.java:76)
	at org.apache.hadoop.conf.Configuration.getStrings(Configuration.java:1514)
	at org.apache.hadoop.io.serializer.SerializationFactory.<init>(SerializationFactory.java:58)
	at org.apache.hadoop.mrunit.internal.io.Serialization.<init>(Serialization.java:37)
	at org.apache.hadoop.mrunit.TestDriver.getSerialization(TestDriver.java:464)
	at org.apache.hadoop.mrunit.TestDriver.copy(TestDriver.java:608)
	at org.apache.hadoop.mrunit.TestDriver.copyPair(TestDriver.java:612)
	at org.apache.hadoop.mrunit.MapReduceDriverBase.addInput(MapReduceDriverBase.java:70)
	at org.apache.hadoop.mrunit.MapReduceDriverBase.addInput(MapReduceDriverBase.java:80)
	at org.apache.hadoop.mrunit.MapReduceDriverBase.addAll(MapReduceDriverBase.java:91)
	at org.apache.hadoop.mrunit.MapReduceDriverBase.withAll(MapReduceDriverBase.java:166)
	at org.apache.solr.hadoop.LineRandomizerMapperReducerTest.testMapReduce2Items(LineRandomizerMapperReducerTest.java:51)
	at sun.reflect.NativeMethodAccessorImpl.invoke0(Native Method)
	at sun.reflect.NativeMethodAccessorImpl.invoke(NativeMethodAccessorImpl.java:62)
	at sun.reflect.DelegatingMethodAccessorImpl.invoke(DelegatingMethodAccessorImpl.java:43)
	at java.lang.reflect.Method.invoke(Method.java:483)
	at org.junit.runners.model.FrameworkMethod$1.runReflectiveCall(FrameworkMethod.java:45)
	at org.junit.internal.runners.model.ReflectiveCallable.run(ReflectiveCallable.java:15)
	at org.junit.runners.model.FrameworkMethod.invokeExplosively(FrameworkMethod.java:42)
	at org.junit.internal.runners.statements.InvokeMethod.evaluate(InvokeMethod.java:20)
	at org.junit.internal.runners.statements.RunBefores.evaluate(RunBefores.java:28)
	at org.junit.runners.ParentRunner.runLeaf(ParentRunner.java:263)
	at org.junit.runners.BlockJUnit4ClassRunner.runChild(BlockJUnit4ClassRunner.java:68)
	at org.junit.runners.BlockJUnit4ClassRunner.runChild(BlockJUnit4ClassRunner.java:47)
	at org.junit.runners.ParentRunner$3.run(ParentRunner.java:231)
	at org.junit.runners.ParentRunner$1.schedule(ParentRunner.java:60)
	at org.junit.runners.ParentRunner.runChildren(ParentRunner.java:229)
	at org.junit.runners.ParentRunner.access$000(ParentRunner.java:50)
	at org.junit.runners.ParentRunner$2.evaluate(ParentRunner.java:222)
	at org.junit.runners.ParentRunner.run(ParentRunner.java:300)
	at com.carrotsearch.ant.tasks.junit4.slave.SlaveMain.execute(SlaveMain.java:180)
	at com.carrotsearch.ant.tasks.junit4.slave.SlaveMain.main(SlaveMain.java:276)
	at com.carrotsearch.ant.tasks.junit4.slave.SlaveMainSafe.main(SlaveMainSafe.java:12)


REGRESSION:  org.apache.solr.hadoop.LineRandomizerMapperReducerTest.testMapReduce1Item

Error Message:
Could not initialize class org.apache.hadoop.util.StringUtils

Stack Trace:
java.lang.NoClassDefFoundError: Could not initialize class org.apache.hadoop.util.StringUtils
	at org.apache.hadoop.conf.Configuration.getStrings(Configuration.java:1514)
	at org.apache.hadoop.io.serializer.SerializationFactory.<init>(SerializationFactory.java:58)
	at org.apache.hadoop.mrunit.internal.io.Serialization.<init>(Serialization.java:37)
	at org.apache.hadoop.mrunit.TestDriver.getSerialization(TestDriver.java:464)
	at org.apache.hadoop.mrunit.TestDriver.copy(TestDriver.java:608)
	at org.apache.hadoop.mrunit.TestDriver.copyPair(TestDriver.java:612)
	at org.apache.hadoop.mrunit.MapReduceDriverBase.addInput(MapReduceDriverBase.java:70)
	at org.apache.hadoop.mrunit.MapReduceDriverBase.withInput(MapReduceDriverBase.java:124)
	at org.apache.solr.hadoop.LineRandomizerMapperReducerTest.testMapReduce1Item(LineRandomizerMapperReducerTest.java:44)
	at sun.reflect.NativeMethodAccessorImpl.invoke0(Native Method)
	at sun.reflect.NativeMethodAccessorImpl.invoke(NativeMethodAccessorImpl.java:62)
	at sun.reflect.DelegatingMethodAccessorImpl.invoke(DelegatingMethodAccessorImpl.java:43)
	at java.lang.reflect.Method.invoke(Method.java:483)
	at org.junit.runners.model.FrameworkMethod$1.runReflectiveCall(FrameworkMethod.java:45)
	at org.junit.internal.runners.model.ReflectiveCallable.run(ReflectiveCallable.java:15)
	at org.junit.runners.model.FrameworkMethod.invokeExplosively(FrameworkMethod.java:42)
	at org.junit.internal.runners.statements.InvokeMethod.evaluate(InvokeMethod.java:20)
	at org.junit.internal.runners.statements.RunBefores.evaluate(RunBefores.java:28)
	at org.junit.runners.ParentRunner.runLeaf(ParentRunner.java:263)
	at org.junit.runners.BlockJUnit4ClassRunner.runChild(BlockJUnit4ClassRunner.java:68)
	at org.junit.runners.BlockJUnit4ClassRunner.runChild(BlockJUnit4ClassRunner.java:47)
	at org.junit.runners.ParentRunner$3.run(ParentRunner.java:231)
	at org.junit.runners.ParentRunner$1.schedule(ParentRunner.java:60)
	at org.junit.runners.ParentRunner.runChildren(ParentRunner.java:229)
	at org.junit.runners.ParentRunner.access$000(ParentRunner.java:50)
	at org.junit.runners.ParentRunner$2.evaluate(ParentRunner.java:222)
	at org.junit.runners.ParentRunner.run(ParentRunner.java:300)
	at com.carrotsearch.ant.tasks.junit4.slave.SlaveMain.execute(SlaveMain.java:180)
	at com.carrotsearch.ant.tasks.junit4.slave.SlaveMain.main(SlaveMain.java:276)
	at com.carrotsearch.ant.tasks.junit4.slave.SlaveMainSafe.main(SlaveMainSafe.java:12)


REGRESSION:  org.apache.solr.hadoop.LineRandomizerMapperReducerTest.testMapReduce4Items

Error Message:
Could not initialize class org.apache.hadoop.util.StringUtils

Stack Trace:
java.lang.NoClassDefFoundError: Could not initialize class org.apache.hadoop.util.StringUtils
	at org.apache.hadoop.conf.Configuration.getStrings(Configuration.java:1514)
	at org.apache.hadoop.io.serializer.SerializationFactory.<init>(SerializationFactory.java:58)
	at org.apache.hadoop.mrunit.internal.io.Serialization.<init>(Serialization.java:37)
	at org.apache.hadoop.mrunit.TestDriver.getSerialization(TestDriver.java:464)
	at org.apache.hadoop.mrunit.TestDriver.copy(TestDriver.java:608)
	at org.apache.hadoop.mrunit.TestDriver.copyPair(TestDriver.java:612)
	at org.apache.hadoop.mrunit.MapReduceDriverBase.addInput(MapReduceDriverBase.java:70)
	at org.apache.hadoop.mrunit.MapReduceDriverBase.addInput(MapReduceDriverBase.java:80)
	at org.apache.hadoop.mrunit.MapReduceDriverBase.addAll(MapReduceDriverBase.java:91)
	at org.apache.hadoop.mrunit.MapReduceDriverBase.withAll(MapReduceDriverBase.java:166)
	at org.apache.solr.hadoop.LineRandomizerMapperReducerTest.testMapReduce4Items(LineRandomizerMapperReducerTest.java:79)
	at sun.reflect.NativeMethodAccessorImpl.invoke0(Native Method)
	at sun.reflect.NativeMethodAccessorImpl.invoke(NativeMethodAccessorImpl.java:62)
	at sun.reflect.DelegatingMethodAccessorImpl.invoke(DelegatingMethodAccessorImpl.java:43)
	at java.lang.reflect.Method.invoke(Method.java:483)
	at org.junit.runners.model.FrameworkMethod$1.runReflectiveCall(FrameworkMethod.java:45)
	at org.junit.internal.runners.model.ReflectiveCallable.run(ReflectiveCallable.java:15)
	at org.junit.runners.model.FrameworkMethod.invokeExplosively(FrameworkMethod.java:42)
	at org.junit.internal.runners.statements.InvokeMethod.evaluate(InvokeMethod.java:20)
	at org.junit.internal.runners.statements.RunBefores.evaluate(RunBefores.java:28)
	at org.junit.runners.ParentRunner.runLeaf(ParentRunner.java:263)
	at org.junit.runners.BlockJUnit4ClassRunner.runChild(BlockJUnit4ClassRunner.java:68)
	at org.junit.runners.BlockJUnit4ClassRunner.runChild(BlockJUnit4ClassRunner.java:47)
	at org.junit.runners.ParentRunner$3.run(ParentRunner.java:231)
	at org.junit.runners.ParentRunner$1.schedule(ParentRunner.java:60)
	at org.junit.runners.ParentRunner.runChildren(ParentRunner.java:229)
	at org.junit.runners.ParentRunner.access$000(ParentRunner.java:50)
	at org.junit.runners.ParentRunner$2.evaluate(ParentRunner.java:222)
	at org.junit.runners.ParentRunner.run(ParentRunner.java:300)
	at com.carrotsearch.ant.tasks.junit4.slave.SlaveMain.execute(SlaveMain.java:180)
	at com.carrotsearch.ant.tasks.junit4.slave.SlaveMain.main(SlaveMain.java:276)
	at com.carrotsearch.ant.tasks.junit4.slave.SlaveMainSafe.main(SlaveMainSafe.java:12)


REGRESSION:  org.apache.solr.hadoop.LineRandomizerMapperReducerTest.testMapReduce3Items

Error Message:
Could not initialize class org.apache.hadoop.util.StringUtils

Stack Trace:
java.lang.NoClassDefFoundError: Could not initialize class org.apache.hadoop.util.StringUtils
	at org.apache.hadoop.conf.Configuration.getStrings(Configuration.java:1514)
	at org.apache.hadoop.io.serializer.SerializationFactory.<init>(SerializationFactory.java:58)
	at org.apache.hadoop.mrunit.internal.io.Serialization.<init>(Serialization.java:37)
	at org.apache.hadoop.mrunit.TestDriver.getSerialization(TestDriver.java:464)
	at org.apache.hadoop.mrunit.TestDriver.copy(TestDriver.java:608)
	at org.apache.hadoop.mrunit.TestDriver.copyPair(TestDriver.java:612)
	at org.apache.hadoop.mrunit.MapReduceDriverBase.addInput(MapReduceDriverBase.java:70)
	at org.apache.hadoop.mrunit.MapReduceDriverBase.addInput(MapReduceDriverBase.java:80)
	at org.apache.hadoop.mrunit.MapReduceDriverBase.addAll(MapReduceDriverBase.java:91)
	at org.apache.hadoop.mrunit.MapReduceDriverBase.withAll(MapReduceDriverBase.java:166)
	at org.apache.solr.hadoop.LineRandomizerMapperReducerTest.testMapReduce3Items(LineRandomizerMapperReducerTest.java:64)
	at sun.reflect.NativeMethodAccessorImpl.invoke0(Native Method)
	at sun.reflect.NativeMethodAccessorImpl.invoke(NativeMethodAccessorImpl.java:62)
	at sun.reflect.DelegatingMethodAccessorImpl.invoke(DelegatingMethodAccessorImpl.java:43)
	at java.lang.reflect.Method.invoke(Method.java:483)
	at org.junit.runners.model.FrameworkMethod$1.runReflectiveCall(FrameworkMethod.java:45)
	at org.junit.internal.runners.model.ReflectiveCallable.run(ReflectiveCallable.java:15)
	at org.junit.runners.model.FrameworkMethod.invokeExplosively(FrameworkMethod.java:42)
	at org.junit.internal.runners.statements.InvokeMethod.evaluate(InvokeMethod.java:20)
	at org.junit.internal.runners.statements.RunBefores.evaluate(RunBefores.java:28)
	at org.junit.runners.ParentRunner.runLeaf(ParentRunner.java:263)
	at org.junit.runners.BlockJUnit4ClassRunner.runChild(BlockJUnit4ClassRunner.java:68)
	at org.junit.runners.BlockJUnit4ClassRunner.runChild(BlockJUnit4ClassRunner.java:47)
	at org.junit.runners.ParentRunner$3.run(ParentRunner.java:231)
	at org.junit.runners.ParentRunner$1.schedule(ParentRunner.java:60)
	at org.junit.runners.ParentRunner.runChildren(ParentRunner.java:229)
	at org.junit.runners.ParentRunner.access$000(ParentRunner.java:50)
	at org.junit.runners.ParentRunner$2.evaluate(ParentRunner.java:222)
	at org.junit.runners.ParentRunner.run(ParentRunner.java:300)
	at com.carrotsearch.ant.tasks.junit4.slave.SlaveMain.execute(SlaveMain.java:180)
	at com.carrotsearch.ant.tasks.junit4.slave.SlaveMain.main(SlaveMain.java:276)
	at com.carrotsearch.ant.tasks.junit4.slave.SlaveMainSafe.main(SlaveMainSafe.java:12)


REGRESSION:  org.apache.solr.hadoop.MapReduceIndexerToolArgumentParserTest.testArgsGoLiveNoZkHostOrSolrUrl

Error Message:
posix_spawn is not a supported process launch mechanism on this platform.

Stack Trace:
java.lang.Error: posix_spawn is not a supported process launch mechanism on this platform.
	at __randomizedtesting.SeedInfo.seed([1D56BFB81BF60C35:C2AB476207A8B042]:0)
	at java.lang.UNIXProcess$1.run(UNIXProcess.java:105)
	at java.lang.UNIXProcess$1.run(UNIXProcess.java:94)
	at java.security.AccessController.doPrivileged(Native Method)
	at java.lang.UNIXProcess.<clinit>(UNIXProcess.java:92)
	at java.lang.ProcessImpl.start(ProcessImpl.java:130)
	at java.lang.ProcessBuilder.start(ProcessBuilder.java:1023)
	at org.apache.hadoop.util.Shell.runCommand(Shell.java:407)
	at org.apache.hadoop.util.Shell.run(Shell.java:379)
	at org.apache.hadoop.util.Shell$ShellCommandExecutor.execute(Shell.java:589)
	at org.apache.hadoop.util.Shell.isSetsidSupported(Shell.java:320)
	at org.apache.hadoop.util.Shell.<clinit>(Shell.java:310)
	at org.apache.hadoop.fs.RawLocalFileSystem$RawLocalFileStatus.loadPermissionInfo(RawLocalFileSystem.java:567)
	at org.apache.hadoop.fs.RawLocalFileSystem$RawLocalFileStatus.getPermission(RawLocalFileSystem.java:542)
	at org.apache.solr.hadoop.PathArgumentType.verifyCanWriteParent(PathArgumentType.java:199)
	at org.apache.solr.hadoop.PathArgumentType.convert(PathArgumentType.java:148)
	at org.apache.solr.hadoop.MapReduceIndexerTool$MyArgumentParser$2.convert(MapReduceIndexerTool.java:247)
	at org.apache.solr.hadoop.MapReduceIndexerTool$MyArgumentParser$2.convert(MapReduceIndexerTool.java:244)
	at net.sourceforge.argparse4j.internal.ArgumentImpl.convert(ArgumentImpl.java:255)
	at net.sourceforge.argparse4j.internal.ArgumentParserImpl.processArg(ArgumentParserImpl.java:964)
	at net.sourceforge.argparse4j.internal.ArgumentParserImpl.parseArgs(ArgumentParserImpl.java:824)
	at net.sourceforge.argparse4j.internal.ArgumentParserImpl.parseArgs(ArgumentParserImpl.java:697)
	at net.sourceforge.argparse4j.internal.ArgumentParserImpl.parseArgs(ArgumentParserImpl.java:591)
	at net.sourceforge.argparse4j.internal.ArgumentParserImpl.parseArgs(ArgumentParserImpl.java:584)
	at org.apache.solr.hadoop.MapReduceIndexerTool$MyArgumentParser.parseArgs(MapReduceIndexerTool.java:476)
	at org.apache.solr.hadoop.MapReduceIndexerToolArgumentParserTest.assertArgumentParserException(MapReduceIndexerToolArgumentParserTest.java:461)
	at org.apache.solr.hadoop.MapReduceIndexerToolArgumentParserTest.testArgsGoLiveNoZkHostOrSolrUrl(MapReduceIndexerToolArgumentParserTest.java:428)
	at sun.reflect.NativeMethodAccessorImpl.invoke0(Native Method)
	at sun.reflect.NativeMethodAccessorImpl.invoke(NativeMethodAccessorImpl.java:62)
	at sun.reflect.DelegatingMethodAccessorImpl.invoke(DelegatingMethodAccessorImpl.java:43)
	at java.lang.reflect.Method.invoke(Method.java:483)
	at com.carrotsearch.randomizedtesting.RandomizedRunner.invoke(RandomizedRunner.java:1618)
	at com.carrotsearch.randomizedtesting.RandomizedRunner$6.evaluate(RandomizedRunner.java:827)
	at com.carrotsearch.randomizedtesting.RandomizedRunner$7.evaluate(RandomizedRunner.java:863)
	at com.carrotsearch.randomizedtesting.RandomizedRunner$8.evaluate(RandomizedRunner.java:877)
	at com.carrotsearch.randomizedtesting.rules.SystemPropertiesRestoreRule$1.evaluate(SystemPropertiesRestoreRule.java:53)
	at org.apache.lucene.util.TestRuleSetupTeardownChained$1.evaluate(TestRuleSetupTeardownChained.java:50)
	at org.apache.lucene.util.TestRuleFieldCacheSanity$1.evaluate(TestRuleFieldCacheSanity.java:51)
	at org.apache.lucene.util.AbstractBeforeAfterRule$1.evaluate(AbstractBeforeAfterRule.java:46)
	at com.carrotsearch.randomizedtesting.rules.SystemPropertiesInvariantRule$1.evaluate(SystemPropertiesInvariantRule.java:55)
	at org.apache.lucene.util.TestRuleThreadAndTestName$1.evaluate(TestRuleThreadAndTestName.java:49)
	at org.apache.lucene.util.TestRuleIgnoreAfterMaxFailures$1.evaluate(TestRuleIgnoreAfterMaxFailures.java:65)
	at org.apache.lucene.util.TestRuleMarkFailure$1.evaluate(TestRuleMarkFailure.java:48)
	at com.carrotsearch.randomizedtesting.rules.StatementAdapter.evaluate(StatementAdapter.java:36)
	at com.carrotsearch.randomizedtesting.ThreadLeakControl$StatementRunner.run(ThreadLeakControl.java:360)
	at com.carrotsearch.randomizedtesting.ThreadLeakControl.forkTimeoutingTask(ThreadLeakControl.java:793)
	at com.carrotsearch.randomizedtesting.ThreadLeakControl$3.evaluate(ThreadLeakControl.java:453)
	at com.carrotsearch.randomizedtesting.RandomizedRunner.runSingleTest(RandomizedRunner.java:836)
	at com.carrotsearch.randomizedtesting.RandomizedRunner$3.evaluate(RandomizedRunner.java:738)
	at com.carrotsearch.randomizedtesting.RandomizedRunner$4.evaluate(RandomizedRunner.java:772)
	at com.carrotsearch.randomizedtesting.RandomizedRunner$5.evaluate(RandomizedRunner.java:783)
	at com.carrotsearch.randomizedtesting.rules.StatementAdapter.evaluate(StatementAdapter.java:36)
	at com.carrotsearch.randomizedtesting.rules.SystemPropertiesRestoreRule$1.evaluate(SystemPropertiesRestoreRule.java:53)
	at org.apache.lucene.util.AbstractBeforeAfterRule$1.evaluate(AbstractBeforeAfterRule.java:46)
	at org.apache.lucene.util.TestRuleStoreClassName$1.evaluate(TestRuleStoreClassName.java:42)
	at com.carrotsearch.randomizedtesting.rules.SystemPropertiesInvariantRule$1.evaluate(SystemPropertiesInvariantRule.java:55)
	at com.carrotsearch.randomizedtesting.rules.NoShadowingOrOverridesOnMethodsRule$1.evaluate(NoShadowingOrOverridesOnMethodsRule.java:39)
	at com.carrotsearch.randomizedtesting.rules.NoShadowingOrOverridesOnMethodsRule$1.evaluate(NoShadowingOrOverridesOnMethodsRule.java:39)
	at com.carrotsearch.randomizedtesting.rules.StatementAdapter.evaluate(StatementAdapter.java:36)
	at org.apache.lucene.util.TestRuleAssertionsRequired$1.evaluate(TestRuleAssertionsRequired.java:43)
	at org.apache.lucene.util.TestRuleMarkFailure$1.evaluate(TestRuleMarkFailure.java:48)
	at org.apache.lucene.util.TestRuleIgnoreAfterMaxFailures$1.evaluate(TestRuleIgnoreAfterMaxFailures.java:65)
	at org.apache.lucene.util.TestRuleIgnoreTestSuites$1.evaluate(TestRuleIgnoreTestSuites.java:55)
	at com.carrotsearch.randomizedtesting.rules.StatementAdapter.evaluate(StatementAdapter.java:36)
	at com.carrotsearch.randomizedtesting.ThreadLeakControl$StatementRunner.run(ThreadLeakControl.java:360)
	at java.lang.Thread.run(Thread.java:744)


REGRESSION:  org.apache.solr.hadoop.MapReduceIndexerToolArgumentParserTest.testArgsZkHostNoGoLive

Error Message:
Could not initialize class org.apache.hadoop.util.Shell

Stack Trace:
java.lang.NoClassDefFoundError: Could not initialize class org.apache.hadoop.util.Shell
	at __randomizedtesting.SeedInfo.seed([1D56BFB81BF60C35:C6EBDF4FA343F3E1]:0)
	at org.apache.hadoop.fs.RawLocalFileSystem$RawLocalFileStatus.loadPermissionInfo(RawLocalFileSystem.java:567)
	at org.apache.hadoop.fs.RawLocalFileSystem$RawLocalFileStatus.getPermission(RawLocalFileSystem.java:542)
	at org.apache.solr.hadoop.PathArgumentType.verifyCanWriteParent(PathArgumentType.java:199)
	at org.apache.solr.hadoop.PathArgumentType.convert(PathArgumentType.java:148)
	at org.apache.solr.hadoop.MapReduceIndexerTool$MyArgumentParser$2.convert(MapReduceIndexerTool.java:247)
	at org.apache.solr.hadoop.MapReduceIndexerTool$MyArgumentParser$2.convert(MapReduceIndexerTool.java:244)
	at net.sourceforge.argparse4j.internal.ArgumentImpl.convert(ArgumentImpl.java:255)
	at net.sourceforge.argparse4j.internal.ArgumentParserImpl.processArg(ArgumentParserImpl.java:964)
	at net.sourceforge.argparse4j.internal.ArgumentParserImpl.parseArgs(ArgumentParserImpl.java:824)
	at net.sourceforge.argparse4j.internal.ArgumentParserImpl.parseArgs(ArgumentParserImpl.java:697)
	at net.sourceforge.argparse4j.internal.ArgumentParserImpl.parseArgs(ArgumentParserImpl.java:591)
	at net.sourceforge.argparse4j.internal.ArgumentParserImpl.parseArgs(ArgumentParserImpl.java:584)
	at org.apache.solr.hadoop.MapReduceIndexerTool$MyArgumentParser.parseArgs(MapReduceIndexerTool.java:476)
	at org.apache.solr.hadoop.MapReduceIndexerToolArgumentParserTest.assertArgumentParserException(MapReduceIndexerToolArgumentParserTest.java:461)
	at org.apache.solr.hadoop.MapReduceIndexerToolArgumentParserTest.testArgsZkHostNoGoLive(MapReduceIndexerToolArgumentParserTest.java:403)
	at sun.reflect.NativeMethodAccessorImpl.invoke0(Native Method)
	at sun.reflect.NativeMethodAccessorImpl.invoke(NativeMethodAccessorImpl.java:62)
	at sun.reflect.DelegatingMethodAccessorImpl.invoke(DelegatingMethodAccessorImpl.java:43)
	at java.lang.reflect.Method.invoke(Method.java:483)
	at com.carrotsearch.randomizedtesting.RandomizedRunner.invoke(RandomizedRunner.java:1618)
	at com.carrotsearch.randomizedtesting.RandomizedRunner$6.evaluate(RandomizedRunner.java:827)
	at com.carrotsearch.randomizedtesting.RandomizedRunner$7.evaluate(RandomizedRunner.java:863)
	at com.carrotsearch.randomizedtesting.RandomizedRunner$8.evaluate(RandomizedRunner.java:877)
	at com.carrotsearch.randomizedtesting.rules.SystemPropertiesRestoreRule$1.evaluate(SystemPropertiesRestoreRule.java:53)
	at org.apache.lucene.util.TestRuleSetupTeardownChained$1.evaluate(TestRuleSetupTeardownChained.java:50)
	at org.apache.lucene.util.TestRuleFieldCacheSanity$1.evaluate(TestRuleFieldCacheSanity.java:51)
	at org.apache.lucene.util.AbstractBeforeAfterRule$1.evaluate(AbstractBeforeAfterRule.java:46)
	at com.carrotsearch.randomizedtesting.rules.SystemPropertiesInvariantRule$1.evaluate(SystemPropertiesInvariantRule.java:55)
	at org.apache.lucene.util.TestRuleThreadAndTestName$1.evaluate(TestRuleThreadAndTestName.java:49)
	at org.apache.lucene.util.TestRuleIgnoreAfterMaxFailures$1.evaluate(TestRuleIgnoreAfterMaxFailures.java:65)
	at org.apache.lucene.util.TestRuleMarkFailure$1.evaluate(TestRuleMarkFailure.java:48)
	at com.carrotsearch.randomizedtesting.rules.StatementAdapter.evaluate(StatementAdapter.java:36)
	at com.carrotsearch.randomizedtesting.ThreadLeakControl$StatementRunner.run(ThreadLeakControl.java:360)
	at com.carrotsearch.randomizedtesting.ThreadLeakControl.forkTimeoutingTask(ThreadLeakControl.java:793)
	at com.carrotsearch.randomizedtesting.ThreadLeakControl$3.evaluate(ThreadLeakControl.java:453)
	at com.carrotsearch.randomizedtesting.RandomizedRunner.runSingleTest(RandomizedRunner.java:836)
	at com.carrotsearch.randomizedtesting.RandomizedRunner$3.evaluate(RandomizedRunner.java:738)
	at com.carrotsearch.randomizedtesting.RandomizedRunner$4.evaluate(RandomizedRunner.java:772)
	at com.carrotsearch.randomizedtesting.RandomizedRunner$5.evaluate(RandomizedRunner.java:783)
	at com.carrotsearch.randomizedtesting.rules.StatementAdapter.evaluate(StatementAdapter.java:36)
	at com.carrotsearch.randomizedtesting.rules.SystemPropertiesRestoreRule$1.evaluate(SystemPropertiesRestoreRule.java:53)
	at org.apache.lucene.util.AbstractBeforeAfterRule$1.evaluate(AbstractBeforeAfterRule.java:46)
	at org.apache.lucene.util.TestRuleStoreClassName$1.evaluate(TestRuleStoreClassName.java:42)
	at com.carrotsearch.randomizedtesting.rules.SystemPropertiesInvariantRule$1.evaluate(SystemPropertiesInvariantRule.java:55)
	at com.carrotsearch.randomizedtesting.rules.NoShadowingOrOverridesOnMethodsRule$1.evaluate(NoShadowingOrOverridesOnMethodsRule.java:39)
	at com.carrotsearch.randomizedtesting.rules.NoShadowingOrOverridesOnMethodsRule$1.evaluate(NoShadowingOrOverridesOnMethodsRule.java:39)
	at com.carrotsearch.randomizedtesting.rules.StatementAdapter.evaluate(StatementAdapter.java:36)
	at org.apache.lucene.util.TestRuleAssertionsRequired$1.evaluate(TestRuleAssertionsRequired.java:43)
	at org.apache.lucene.util.TestRuleMarkFailure$1.evaluate(TestRuleMarkFailure.java:48)
	at org.apache.lucene.util.TestRuleIgnoreAfterMaxFailures$1.evaluate(TestRuleIgnoreAfterMaxFailures.java:65)
	at org.apache.lucene.util.TestRuleIgnoreTestSuites$1.evaluate(TestRuleIgnoreTestSuites.java:55)
	at com.carrotsearch.randomizedtesting.rules.StatementAdapter.evaluate(StatementAdapter.java:36)
	at com.carrotsearch.randomizedtesting.ThreadLeakControl$StatementRunner.run(ThreadLeakControl.java:360)
	at java.lang.Thread.run(Thread.java:744)


REGRESSION:  org.apache.solr.hadoop.MapReduceIndexerToolArgumentParserTest.testArgsParserIntOutOfRange

Error Message:
Could not initialize class org.apache.hadoop.util.Shell

Stack Trace:
java.lang.NoClassDefFoundError: Could not initialize class org.apache.hadoop.util.Shell
	at __randomizedtesting.SeedInfo.seed([1D56BFB81BF60C35:829D70886161433D]:0)
	at org.apache.hadoop.fs.RawLocalFileSystem$RawLocalFileStatus.loadPermissionInfo(RawLocalFileSystem.java:567)
	at org.apache.hadoop.fs.RawLocalFileSystem$RawLocalFileStatus.getPermission(RawLocalFileSystem.java:542)
	at org.apache.solr.hadoop.PathArgumentType.verifyCanWriteParent(PathArgumentType.java:199)
	at org.apache.solr.hadoop.PathArgumentType.convert(PathArgumentType.java:148)
	at org.apache.solr.hadoop.MapReduceIndexerTool$MyArgumentParser$2.convert(MapReduceIndexerTool.java:247)
	at org.apache.solr.hadoop.MapReduceIndexerTool$MyArgumentParser$2.convert(MapReduceIndexerTool.java:244)
	at net.sourceforge.argparse4j.internal.ArgumentImpl.convert(ArgumentImpl.java:255)
	at net.sourceforge.argparse4j.internal.ArgumentParserImpl.processArg(ArgumentParserImpl.java:964)
	at net.sourceforge.argparse4j.internal.ArgumentParserImpl.parseArgs(ArgumentParserImpl.java:824)
	at net.sourceforge.argparse4j.internal.ArgumentParserImpl.parseArgs(ArgumentParserImpl.java:697)
	at net.sourceforge.argparse4j.internal.ArgumentParserImpl.parseArgs(ArgumentParserImpl.java:591)
	at net.sourceforge.argparse4j.internal.ArgumentParserImpl.parseArgs(ArgumentParserImpl.java:584)
	at org.apache.solr.hadoop.MapReduceIndexerTool$MyArgumentParser.parseArgs(MapReduceIndexerTool.java:476)
	at org.apache.solr.hadoop.MapReduceIndexerToolArgumentParserTest.assertArgumentParserException(MapReduceIndexerToolArgumentParserTest.java:461)
	at org.apache.solr.hadoop.MapReduceIndexerToolArgumentParserTest.testArgsParserIntOutOfRange(MapReduceIndexerToolArgumentParserTest.java:276)
	at sun.reflect.NativeMethodAccessorImpl.invoke0(Native Method)
	at sun.reflect.NativeMethodAccessorImpl.invoke(NativeMethodAccessorImpl.java:62)
	at sun.reflect.DelegatingMethodAccessorImpl.invoke(DelegatingMethodAccessorImpl.java:43)
	at java.lang.reflect.Method.invoke(Method.java:483)
	at com.carrotsearch.randomizedtesting.RandomizedRunner.invoke(RandomizedRunner.java:1618)
	at com.carrotsearch.randomizedtesting.RandomizedRunner$6.evaluate(RandomizedRunner.java:827)
	at com.carrotsearch.randomizedtesting.RandomizedRunner$7.evaluate(RandomizedRunner.java:863)
	at com.carrotsearch.randomizedtesting.RandomizedRunner$8.evaluate(RandomizedRunner.java:877)
	at com.carrotsearch.randomizedtesting.rules.SystemPropertiesRestoreRule$1.evaluate(SystemPropertiesRestoreRule.java:53)
	at org.apache.lucene.util.TestRuleSetupTeardownChained$1.evaluate(TestRuleSetupTeardownChained.java:50)
	at org.apache.lucene.util.TestRuleFieldCacheSanity$1.evaluate(TestRuleFieldCacheSanity.java:51)
	at org.apache.lucene.util.AbstractBeforeAfterRule$1.evaluate(AbstractBeforeAfterRule.java:46)
	at com.carrotsearch.randomizedtesting.rules.SystemPropertiesInvariantRule$1.evaluate(SystemPropertiesInvariantRule.java:55)
	at org.apache.lucene.util.TestRuleThreadAndTestName$1.evaluate(TestRuleThreadAndTestName.java:49)
	at org.apache.lucene.util.TestRuleIgnoreAfterMaxFailures$1.evaluate(TestRuleIgnoreAfterMaxFailures.java:65)
	at org.apache.lucene.util.TestRuleMarkFailure$1.evaluate(TestRuleMarkFailure.java:48)
	at com.carrotsearch.randomizedtesting.rules.StatementAdapter.evaluate(StatementAdapter.java:36)
	at com.carrotsearch.randomizedtesting.ThreadLeakControl$StatementRunner.run(ThreadLeakControl.java:360)
	at com.carrotsearch.randomizedtesting.ThreadLeakControl.forkTimeoutingTask(ThreadLeakControl.java:793)
	at com.carrotsearch.randomizedtesting.ThreadLeakControl$3.evaluate(ThreadLeakControl.java:453)
	at com.carrotsearch.randomizedtesting.RandomizedRunner.runSingleTest(RandomizedRunner.java:836)
	at com.carrotsearch.randomizedtesting.RandomizedRunner$3.evaluate(RandomizedRunner.java:738)
	at com.carrotsearch.randomizedtesting.RandomizedRunner$4.evaluate(RandomizedRunner.java:772)
	at com.carrotsearch.randomizedtesting.RandomizedRunner$5.evaluate(RandomizedRunner.java:783)
	at com.carrotsearch.randomizedtesting.rules.StatementAdapter.evaluate(StatementAdapter.java:36)
	at com.carrotsearch.randomizedtesting.rules.SystemPropertiesRestoreRule$1.evaluate(SystemPropertiesRestoreRule.java:53)
	at org.apache.lucene.util.AbstractBeforeAfterRule$1.evaluate(AbstractBeforeAfterRule.java:46)
	at org.apache.lucene.util.TestRuleStoreClassName$1.evaluate(TestRuleStoreClassName.java:42)
	at com.carrotsearch.randomizedtesting.rules.SystemPropertiesInvariantRule$1.evaluate(SystemPropertiesInvariantRule.java:55)
	at com.carrotsearch.randomizedtesting.rules.NoShadowingOrOverridesOnMethodsRule$1.evaluate(NoShadowingOrOverridesOnMethodsRule.java:39)
	at com.carrotsearch.randomizedtesting.rules.NoShadowingOrOverridesOnMethodsRule$1.evaluate(NoShadowingOrOverridesOnMethodsRule.java:39)
	at com.carrotsearch.randomizedtesting.rules.StatementAdapter.evaluate(StatementAdapter.java:36)
	at org.apache.lucene.util.TestRuleAssertionsRequired$1.evaluate(TestRuleAssertionsRequired.java:43)
	at org.apache.lucene.util.TestRuleMarkFailure$1.evaluate(TestRuleMarkFailure.java:48)
	at org.apache.lucene.util.TestRuleIgnoreAfterMaxFailures$1.evaluate(TestRuleIgnoreAfterMaxFailures.java:65)
	at org.apache.lucene.util.TestRuleIgnoreTestSuites$1.evaluate(TestRuleIgnoreTestSuites.java:55)
	at com.carrotsearch.randomizedtesting.rules.StatementAdapter.evaluate(StatementAdapter.java:36)
	at com.carrotsearch.randomizedtesting.ThreadLeakControl$StatementRunner.run(ThreadLeakControl.java:360)
	at java.lang.Thread.run(Thread.java:744)


REGRESSION:  org.apache.solr.hadoop.MapReduceIndexerToolArgumentParserTest.testArgsParserFileNotFound2

Error Message:
Could not initialize class org.apache.hadoop.util.Shell

Stack Trace:
java.lang.NoClassDefFoundError: Could not initialize class org.apache.hadoop.util.Shell
	at __randomizedtesting.SeedInfo.seed([1D56BFB81BF60C35:221D0C94AAF0DA21]:0)
	at org.apache.hadoop.fs.RawLocalFileSystem$RawLocalFileStatus.loadPermissionInfo(RawLocalFileSystem.java:567)
	at org.apache.hadoop.fs.RawLocalFileSystem$RawLocalFileStatus.getPermission(RawLocalFileSystem.java:542)
	at org.apache.solr.hadoop.PathArgumentType.verifyCanWriteParent(PathArgumentType.java:199)
	at org.apache.solr.hadoop.PathArgumentType.convert(PathArgumentType.java:148)
	at org.apache.solr.hadoop.MapReduceIndexerTool$MyArgumentParser$2.convert(MapReduceIndexerTool.java:247)
	at org.apache.solr.hadoop.MapReduceIndexerTool$MyArgumentParser$2.convert(MapReduceIndexerTool.java:244)
	at net.sourceforge.argparse4j.internal.ArgumentImpl.convert(ArgumentImpl.java:255)
	at net.sourceforge.argparse4j.internal.ArgumentParserImpl.processArg(ArgumentParserImpl.java:964)
	at net.sourceforge.argparse4j.internal.ArgumentParserImpl.parseArgs(ArgumentParserImpl.java:824)
	at net.sourceforge.argparse4j.internal.ArgumentParserImpl.parseArgs(ArgumentParserImpl.java:697)
	at net.sourceforge.argparse4j.internal.ArgumentParserImpl.parseArgs(ArgumentParserImpl.java:591)
	at net.sourceforge.argparse4j.internal.ArgumentParserImpl.parseArgs(ArgumentParserImpl.java:584)
	at org.apache.solr.hadoop.MapReduceIndexerTool$MyArgumentParser.parseArgs(MapReduceIndexerTool.java:476)
	at org.apache.solr.hadoop.MapReduceIndexerToolArgumentParserTest.assertArgumentParserException(MapReduceIndexerToolArgumentParserTest.java:461)
	at org.apache.solr.hadoop.MapReduceIndexerToolArgumentParserTest.testArgsParserFileNotFound2(MapReduceIndexerToolArgumentParserTest.java:263)
	at sun.reflect.NativeMethodAccessorImpl.invoke0(Native Method)
	at sun.reflect.NativeMethodAccessorImpl.invoke(NativeMethodAccessorImpl.java:62)
	at sun.reflect.DelegatingMethodAccessorImpl.invoke(DelegatingMethodAccessorImpl.java:43)
	at java.lang.reflect.Method.invoke(Method.java:483)
	at com.carrotsearch.randomizedtesting.RandomizedRunner.invoke(RandomizedRunner.java:1618)
	at com.carrotsearch.randomizedtesting.RandomizedRunner$6.evaluate(RandomizedRunner.java:827)
	at com.carrotsearch.randomizedtesting.RandomizedRunner$7.evaluate(RandomizedRunner.java:863)
	at com.carrotsearch.randomizedtesting.RandomizedRunner$8.evaluate(RandomizedRunner.java:877)
	at com.carrotsearch.randomizedtesting.rules.SystemPropertiesRestoreRule$1.evaluate(SystemPropertiesRestoreRule.java:53)
	at org.apache.lucene.util.TestRuleSetupTeardownChained$1.evaluate(TestRuleSetupTeardownChained.java:50)
	at org.apache.lucene.util.TestRuleFieldCacheSanity$1.evaluate(TestRuleFieldCacheSanity.java:51)
	at org.apache.lucene.util.AbstractBeforeAfterRule$1.evaluate(AbstractBeforeAfterRule.java:46)
	at com.carrotsearch.randomizedtesting.rules.SystemPropertiesInvariantRule$1.evaluate(SystemPropertiesInvariantRule.java:55)
	at org.apache.lucene.util.TestRuleThreadAndTestName$1.evaluate(TestRuleThreadAndTestName.java:49)
	at org.apache.lucene.util.TestRuleIgnoreAfterMaxFailures$1.evaluate(TestRuleIgnoreAfterMaxFailures.java:65)
	at org.apache.lucene.util.TestRuleMarkFailure$1.evaluate(TestRuleMarkFailure.java:48)
	at com.carrotsearch.randomizedtesting.rules.StatementAdapter.evaluate(StatementAdapter.java:36)
	at com.carrotsearch.randomizedtesting.ThreadLeakControl$StatementRunner.run(ThreadLeakControl.java:360)
	at com.carrotsearch.randomizedtesting.ThreadLeakControl.forkTimeoutingTask(ThreadLeakControl.java:793)
	at com.carrotsearch.randomizedtesting.ThreadLeakControl$3.evaluate(ThreadLeakControl.java:453)
	at com.carrotsearch.randomizedtesting.RandomizedRunner.runSingleTest(RandomizedRunner.java:836)
	at com.carrotsearch.randomizedtesting.RandomizedRunner$3.evaluate(RandomizedRunner.java:738)
	at com.carrotsearch.randomizedtesting.RandomizedRunner$4.evaluate(RandomizedRunner.java:772)
	at com.carrotsearch.randomizedtesting.RandomizedRunner$5.evaluate(RandomizedRunner.java:783)
	at com.carrotsearch.randomizedtesting.rules.StatementAdapter.evaluate(StatementAdapter.java:36)
	at com.carrotsearch.randomizedtesting.rules.SystemPropertiesRestoreRule$1.evaluate(SystemPropertiesRestoreRule.java:53)
	at org.apache.lucene.util.AbstractBeforeAfterRule$1.evaluate(AbstractBeforeAfterRule.java:46)
	at org.apache.lucene.util.TestRuleStoreClassName$1.evaluate(TestRuleStoreClassName.java:42)
	at com.carrotsearch.randomizedtesting.rules.SystemPropertiesInvariantRule$1.evaluate(SystemPropertiesInvariantRule.java:55)
	at com.carrotsearch.randomizedtesting.rules.NoShadowingOrOverridesOnMethodsRule$1.evaluate(NoShadowingOrOverridesOnMethodsRule.java:39)
	at com.carrotsearch.randomizedtesting.rules.NoShadowingOrOverridesOnMethodsRule$1.evaluate(NoShadowingOrOverridesOnMethodsRule.java:39)
	at com.carrotsearch.randomizedtesting.rules.StatementAdapter.evaluate(StatementAdapter.java:36)
	at org.apache.lucene.util.TestRuleAssertionsRequired$1.evaluate(TestRuleAssertionsRequired.java:43)
	at org.apache.lucene.util.TestRuleMarkFailure$1.evaluate(TestRuleMarkFailure.java:48)
	at org.apache.lucene.util.TestRuleIgnoreAfterMaxFailures$1.evaluate(TestRuleIgnoreAfterMaxFailures.java:65)
	at org.apache.lucene.util.TestRuleIgnoreTestSuites$1.evaluate(TestRuleIgnoreTestSuites.java:55)
	at com.carrotsearch.randomizedtesting.rules.StatementAdapter.evaluate(StatementAdapter.java:36)
	at com.carrotsearch.randomizedtesting.ThreadLeakControl$StatementRunner.run(ThreadLeakControl.java:360)
	at java.lang.Thread.run(Thread.java:744)


REGRESSION:  org.apache.solr.hadoop.MapReduceIndexerToolArgumentParserTest.testArgsParserUnknownArgName

Error Message:
Could not initialize class java.lang.UNIXProcess

Stack Trace:
java.lang.NoClassDefFoundError: Could not initialize class java.lang.UNIXProcess
	at __randomizedtesting.SeedInfo.seed([1D56BFB81BF60C35:8FE2B9BFC7DF618F]:0)
	at java.lang.ProcessImpl.start(ProcessImpl.java:130)
	at java.lang.ProcessBuilder.start(ProcessBuilder.java:1023)
	at net.sourceforge.argparse4j.internal.TerminalWidth.getTerminalWidth2(TerminalWidth.java:74)
	at net.sourceforge.argparse4j.internal.TerminalWidth.getTerminalWidth(TerminalWidth.java:54)
	at net.sourceforge.argparse4j.ArgumentParsers.getFormatWidth(ArgumentParsers.java:221)
	at net.sourceforge.argparse4j.internal.ArgumentParserImpl.printUsage(ArgumentParserImpl.java:371)
	at net.sourceforge.argparse4j.internal.ArgumentParserImpl.handleError(ArgumentParserImpl.java:1154)
	at org.apache.solr.hadoop.MapReduceIndexerTool$MyArgumentParser.parseArgs(MapReduceIndexerTool.java:480)
	at org.apache.solr.hadoop.MapReduceIndexerToolArgumentParserTest.assertArgumentParserException(MapReduceIndexerToolArgumentParserTest.java:461)
	at org.apache.solr.hadoop.MapReduceIndexerToolArgumentParserTest.testArgsParserUnknownArgName(MapReduceIndexerToolArgumentParserTest.java:239)
	at sun.reflect.NativeMethodAccessorImpl.invoke0(Native Method)
	at sun.reflect.NativeMethodAccessorImpl.invoke(NativeMethodAccessorImpl.java:62)
	at sun.reflect.DelegatingMethodAccessorImpl.invoke(DelegatingMethodAccessorImpl.java:43)
	at java.lang.reflect.Method.invoke(Method.java:483)
	at com.carrotsearch.randomizedtesting.RandomizedRunner.invoke(RandomizedRunner.java:1618)
	at com.carrotsearch.randomizedtesting.RandomizedRunner$6.evaluate(RandomizedRunner.java:827)
	at com.carrotsearch.randomizedtesting.RandomizedRunner$7.evaluate(RandomizedRunner.java:863)
	at com.carrotsearch.randomizedtesting.RandomizedRunner$8.evaluate(RandomizedRunner.java:877)
	at com.carrotsearch.randomizedtesting.rules.SystemPropertiesRestoreRule$1.evaluate(SystemPropertiesRestoreRule.java:53)
	at org.apache.lucene.util.TestRuleSetupTeardownChained$1.evaluate(TestRuleSetupTeardownChained.java:50)
	at org.apache.lucene.util.TestRuleFieldCacheSanity$1.evaluate(TestRuleFieldCacheSanity.java:51)
	at org.apache.lucene.util.AbstractBeforeAfterRule$1.evaluate(AbstractBeforeAfterRule.java:46)
	at com.carrotsearch.randomizedtesting.rules.SystemPropertiesInvariantRule$1.evaluate(SystemPropertiesInvariantRule.java:55)
	at org.apache.lucene.util.TestRuleThreadAndTestName$1.evaluate(TestRuleThreadAndTestName.java:49)
	at org.apache.lucene.util.TestRuleIgnoreAfterMaxFailures$1.evaluate(TestRuleIgnoreAfterMaxFailures.java:65)
	at org.apache.lucene.util.TestRuleMarkFailure$1.evaluate(TestRuleMarkFailure.java:48)
	at com.carrotsearch.randomizedtesting.rules.StatementAdapter.evaluate(StatementAdapter.java:36)
	at com.carrotsearch.randomizedtesting.ThreadLeakControl$StatementRunner.run(ThreadLeakControl.java:360)
	at com.carrotsearch.randomizedtesting.ThreadLeakControl.forkTimeoutingTask(ThreadLeakControl.java:793)
	at com.carrotsearch.randomizedtesting.ThreadLeakControl$3.evaluate(ThreadLeakControl.java:453)
	at com.carrotsearch.randomizedtesting.RandomizedRunner.runSingleTest(RandomizedRunner.java:836)
	at com.carrotsearch.randomizedtesting.RandomizedRunner$3.evaluate(RandomizedRunner.java:738)
	at com.carrotsearch.randomizedtesting.RandomizedRunner$4.evaluate(RandomizedRunner.java:772)
	at com.carrotsearch.randomizedtesting.RandomizedRunner$5.evaluate(RandomizedRunner.java:783)
	at com.carrotsearch.randomizedtesting.rules.StatementAdapter.evaluate(StatementAdapter.java:36)
	at com.carrotsearch.randomizedtesting.rules.SystemPropertiesRestoreRule$1.evaluate(SystemPropertiesRestoreRule.java:53)
	at org.apache.lucene.util.AbstractBeforeAfterRule$1.evaluate(AbstractBeforeAfterRule.java:46)
	at org.apache.lucene.util.TestRuleStoreClassName$1.evaluate(TestRuleStoreClassName.java:42)
	at com.carrotsearch.randomizedtesting.rules.SystemPropertiesInvariantRule$1.evaluate(SystemPropertiesInvariantRule.java:55)
	at com.carrotsearch.randomizedtesting.rules.NoShadowingOrOverridesOnMethodsRule$1.evaluate(NoShadowingOrOverridesOnMethodsRule.java:39)
	at com.carrotsearch.randomizedtesting.rules.NoShadowingOrOverridesOnMethodsRule$1.evaluate(NoShadowingOrOverridesOnMethodsRule.java:39)
	at com.carrotsearch.randomizedtesting.rules.StatementAdapter.evaluate(StatementAdapter.java:36)
	at org.apache.lucene.util.TestRuleAssertionsRequired$1.evaluate(TestRuleAssertionsRequired.java:43)
	at org.apache.lucene.util.TestRuleMarkFailure$1.evaluate(TestRuleMarkFailure.java:48)
	at org.apache.lucene.util.TestRuleIgnoreAfterMaxFailures$1.evaluate(TestRuleIgnoreAfterMaxFailures.java:65)
	at org.apache.lucene.util.TestRuleIgnoreTestSuites$1.evaluate(TestRuleIgnoreTestSuites.java:55)
	at com.carrotsearch.randomizedtesting.rules.StatementAdapter.evaluate(StatementAdapter.java:36)
	at com.carrotsearch.randomizedtesting.ThreadLeakControl$StatementRunner.run(ThreadLeakControl.java:360)
	at java.lang.Thread.run(Thread.java:744)


REGRESSION:  org.apache.solr.hadoop.MapReduceIndexerToolArgumentParserTest.testArgsShardUrlOk

Error Message:
Could not initialize class org.apache.hadoop.util.Shell

Stack Trace:
java.lang.NoClassDefFoundError: Could not initialize class org.apache.hadoop.util.Shell
	at __randomizedtesting.SeedInfo.seed([1D56BFB81BF60C35:E36508CDC8CF4430]:0)
	at org.apache.hadoop.fs.RawLocalFileSystem$RawLocalFileStatus.loadPermissionInfo(RawLocalFileSystem.java:567)
	at org.apache.hadoop.fs.RawLocalFileSystem$RawLocalFileStatus.getPermission(RawLocalFileSystem.java:542)
	at org.apache.solr.hadoop.PathArgumentType.verifyCanWriteParent(PathArgumentType.java:199)
	at org.apache.solr.hadoop.PathArgumentType.convert(PathArgumentType.java:148)
	at org.apache.solr.hadoop.MapReduceIndexerTool$MyArgumentParser$2.convert(MapReduceIndexerTool.java:247)
	at org.apache.solr.hadoop.MapReduceIndexerTool$MyArgumentParser$2.convert(MapReduceIndexerTool.java:244)
	at net.sourceforge.argparse4j.internal.ArgumentImpl.convert(ArgumentImpl.java:255)
	at net.sourceforge.argparse4j.internal.ArgumentParserImpl.processArg(ArgumentParserImpl.java:964)
	at net.sourceforge.argparse4j.internal.ArgumentParserImpl.parseArgs(ArgumentParserImpl.java:824)
	at net.sourceforge.argparse4j.internal.ArgumentParserImpl.parseArgs(ArgumentParserImpl.java:697)
	at net.sourceforge.argparse4j.internal.ArgumentParserImpl.parseArgs(ArgumentParserImpl.java:591)
	at net.sourceforge.argparse4j.internal.ArgumentParserImpl.parseArgs(ArgumentParserImpl.java:584)
	at org.apache.solr.hadoop.MapReduceIndexerTool$MyArgumentParser.parseArgs(MapReduceIndexerTool.java:476)
	at org.apache.solr.hadoop.MapReduceIndexerToolArgumentParserTest.testArgsShardUrlOk(MapReduceIndexerToolArgumentParserTest.java:314)
	at sun.reflect.NativeMethodAccessorImpl.invoke0(Native Method)
	at sun.reflect.NativeMethodAccessorImpl.invoke(NativeMethodAccessorImpl.java:62)
	at sun.reflect.DelegatingMethodAccessorImpl.invoke(DelegatingMethodAccessorImpl.java:43)
	at java.lang.reflect.Method.invoke(Method.java:483)
	at com.carrotsearch.randomizedtesting.RandomizedRunner.invoke(RandomizedRunner.java:1618)
	at com.carrotsearch.randomizedtesting.RandomizedRunner$6.evaluate(RandomizedRunner.java:827)
	at com.carrotsearch.randomizedtesting.RandomizedRunner$7.evaluate(RandomizedRunner.java:863)
	at com.carrotsearch.randomizedtesting.RandomizedRunner$8.evaluate(RandomizedRunner.java:877)
	at com.carrotsearch.randomizedtesting.rules.SystemPropertiesRestoreRule$1.evaluate(SystemPropertiesRestoreRule.java:53)
	at org.apache.lucene.util.TestRuleSetupTeardownChained$1.evaluate(TestRuleSetupTeardownChained.java:50)
	at org.apache.lucene.util.TestRuleFieldCacheSanity$1.evaluate(TestRuleFieldCacheSanity.java:51)
	at org.apache.lucene.util.AbstractBeforeAfterRule$1.evaluate(AbstractBeforeAfterRule.java:46)
	at com.carrotsearch.randomizedtesting.rules.SystemPropertiesInvariantRule$1.evaluate(SystemPropertiesInvariantRule.java:55)
	at org.apache.lucene.util.TestRuleThreadAndTestName$1.evaluate(TestRuleThreadAndTestName.java:49)
	at org.apache.lucene.util.TestRuleIgnoreAfterMaxFailures$1.evaluate(TestRuleIgnoreAfterMaxFailures.java:65)
	at org.apache.lucene.util.TestRuleMarkFailure$1.evaluate(TestRuleMarkFailure.java:48)
	at com.carrotsearch.randomizedtesting.rules.StatementAdapter.evaluate(StatementAdapter.java:36)
	at com.carrotsearch.randomizedtesting.ThreadLeakControl$StatementRunner.run(ThreadLeakControl.java:360)
	at com.carrotsearch.randomizedtesting.ThreadLeakControl.forkTimeoutingTask(ThreadLeakControl.java:793)
	at com.carrotsearch.randomizedtesting.ThreadLeakControl$3.evaluate(ThreadLeakControl.java:453)
	at com.carrotsearch.randomizedtesting.RandomizedRunner.runSingleTest(RandomizedRunner.java:836)
	at com.carrotsearch.randomizedtesting.RandomizedRunner$3.evaluate(RandomizedRunner.java:738)
	at com.carrotsearch.randomizedtesting.RandomizedRunner$4.evaluate(RandomizedRunner.java:772)
	at com.carrotsearch.randomizedtesting.RandomizedRunner$5.evaluate(RandomizedRunner.java:783)
	at com.carrotsearch.randomizedtesting.rules.StatementAdapter.evaluate(StatementAdapter.java:36)
	at com.carrotsearch.randomizedtesting.rules.SystemPropertiesRestoreRule$1.evaluate(SystemPropertiesRestoreRule.java:53)
	at org.apache.lucene.util.AbstractBeforeAfterRule$1.evaluate(AbstractBeforeAfterRule.java:46)
	at org.apache.lucene.util.TestRuleStoreClassName$1.evaluate(TestRuleStoreClassName.java:42)
	at com.carrotsearch.randomizedtesting.rules.SystemPropertiesInvariantRule$1.evaluate(SystemPropertiesInvariantRule.java:55)
	at com.carrotsearch.randomizedtesting.rules.NoShadowingOrOverridesOnMethodsRule$1.evaluate(NoShadowingOrOverridesOnMethodsRule.java:39)
	at com.carrotsearch.randomizedtesting.rules.NoShadowingOrOverridesOnMethodsRule$1.evaluate(NoShadowingOrOverridesOnMethodsRule.java:39)
	at com.carrotsearch.randomizedtesting.rules.StatementAdapter.evaluate(StatementAdapter.java:36)
	at org.apache.lucene.util.TestRuleAssertionsRequired$1.evaluate(TestRuleAssertionsRequired.java:43)
	at org.apache.lucene.util.TestRuleMarkFailure$1.evaluate(TestRuleMarkFailure.java:48)
	at org.apache.lucene.util.TestRuleIgnoreAfterMaxFailures$1.evaluate(TestRuleIgnoreAfterMaxFailures.java:65)
	at org.apache.lucene.util.TestRuleIgnoreTestSuites$1.evaluate(TestRuleIgnoreTestSuites.java:55)
	at com.carrotsearch.randomizedtesting.rules.StatementAdapter.evaluate(StatementAdapter.java:36)
	at com.carrotsearch.randomizedtesting.ThreadLeakControl$StatementRunner.run(ThreadLeakControl.java:360)
	at java.lang.Thread.run(Thread.java:744)


REGRESSION:  org.apache.solr.hadoop.MapReduceIndexerToolArgumentParserTest.testArgsGoLiveZkHostNoCollection

Error Message:
Could not initialize class org.apache.hadoop.util.Shell

Stack Trace:
java.lang.NoClassDefFoundError: Could not initialize class org.apache.hadoop.util.Shell
	at __randomizedtesting.SeedInfo.seed([1D56BFB81BF60C35:1796C3A5420F56AC]:0)
	at org.apache.hadoop.fs.RawLocalFileSystem$RawLocalFileStatus.loadPermissionInfo(RawLocalFileSystem.java:567)
	at org.apache.hadoop.fs.RawLocalFileSystem$RawLocalFileStatus.getPermission(RawLocalFileSystem.java:542)
	at org.apache.solr.hadoop.PathArgumentType.verifyCanWriteParent(PathArgumentType.java:199)
	at org.apache.solr.hadoop.PathArgumentType.convert(PathArgumentType.java:148)
	at org.apache.solr.hadoop.MapReduceIndexerTool$MyArgumentParser$2.convert(MapReduceIndexerTool.java:247)
	at org.apache.solr.hadoop.MapReduceIndexerTool$MyArgumentParser$2.convert(MapReduceIndexerTool.java:244)
	at net.sourceforge.argparse4j.internal.ArgumentImpl.convert(ArgumentImpl.java:255)
	at net.sourceforge.argparse4j.internal.ArgumentParserImpl.processArg(ArgumentParserImpl.java:964)
	at net.sourceforge.argparse4j.internal.ArgumentParserImpl.parseArgs(ArgumentParserImpl.java:824)
	at net.sourceforge.argparse4j.internal.ArgumentParserImpl.parseArgs(ArgumentParserImpl.java:697)
	at net.sourceforge.argparse4j.internal.ArgumentParserImpl.parseArgs(ArgumentParserImpl.java:591)
	at net.sourceforge.argparse4j.internal.ArgumentParserImpl.parseArgs(ArgumentParserImpl.java:584)
	at org.apache.solr.hadoop.MapReduceIndexerTool$MyArgumentParser.parseArgs(MapReduceIndexerTool.java:476)
	at org.apache.solr.hadoop.MapReduceIndexerToolArgumentParserTest.assertArgumentParserException(MapReduceIndexerToolArgumentParserTest.java:461)
	at org.apache.solr.hadoop.MapReduceIndexerToolArgumentParserTest.testArgsGoLiveZkHostNoCollection(MapReduceIndexerToolArgumentParserTest.java:416)
	at sun.reflect.NativeMethodAccessorImpl.invoke0(Native Method)
	at sun.reflect.NativeMethodAccessorImpl.invoke(NativeMethodAccessorImpl.java:62)
	at sun.reflect.DelegatingMethodAccessorImpl.invoke(DelegatingMethodAccessorImpl.java:43)
	at java.lang.reflect.Method.invoke(Method.java:483)
	at com.carrotsearch.randomizedtesting.RandomizedRunner.invoke(RandomizedRunner.java:1618)
	at com.carrotsearch.randomizedtesting.RandomizedRunner$6.evaluate(RandomizedRunner.java:827)
	at com.carrotsearch.randomizedtesting.RandomizedRunner$7.evaluate(RandomizedRunner.java:863)
	at com.carrotsearch.randomizedtesting.RandomizedRunner$8.evaluate(RandomizedRunner.java:877)
	at com.carrotsearch.randomizedtesting.rules.SystemPropertiesRestoreRule$1.evaluate(SystemPropertiesRestoreRule.java:53)
	at org.apache.lucene.util.TestRuleSetupTeardownChained$1.evaluate(TestRuleSetupTeardownChained.java:50)
	at org.apache.lucene.util.TestRuleFieldCacheSanity$1.evaluate(TestRuleFieldCacheSanity.java:51)
	at org.apache.lucene.util.AbstractBeforeAfterRule$1.evaluate(AbstractBeforeAfterRule.java:46)
	at com.carrotsearch.randomizedtesting.rules.SystemPropertiesInvariantRule$1.evaluate(SystemPropertiesInvariantRule.java:55)
	at org.apache.lucene.util.TestRuleThreadAndTestName$1.evaluate(TestRuleThreadAndTestName.java:49)
	at org.apache.lucene.util.TestRuleIgnoreAfterMaxFailures$1.evaluate(TestRuleIgnoreAfterMaxFailures.java:65)
	at org.apache.lucene.util.TestRuleMarkFailure$1.evaluate(TestRuleMarkFailure.java:48)
	at com.carrotsearch.randomizedtesting.rules.StatementAdapter.evaluate(StatementAdapter.java:36)
	at com.carrotsearch.randomizedtesting.ThreadLeakControl$StatementRunner.run(ThreadLeakControl.java:360)
	at com.carrotsearch.randomizedtesting.ThreadLeakControl.forkTimeoutingTask(ThreadLeakControl.java:793)
	at com.carrotsearch.randomizedtesting.ThreadLeakControl$3.evaluate(ThreadLeakControl.java:453)
	at com.carrotsearch.randomizedtesting.RandomizedRunner.runSingleTest(RandomizedRunner.java:836)
	at com.carrotsearch.randomizedtesting.RandomizedRunner$3.evaluate(RandomizedRunner.java:738)
	at com.carrotsearch.randomizedtesting.RandomizedRunner$4.evaluate(RandomizedRunner.java:772)
	at com.carrotsearch.randomizedtesting.RandomizedRunner$5.evaluate(RandomizedRunner.java:783)
	at com.carrotsearch.randomizedtesting.rules.StatementAdapter.evaluate(StatementAdapter.java:36)
	at com.carrotsearch.randomizedtesting.rules.SystemPropertiesRestoreRule$1.evaluate(SystemPropertiesRestoreRule.java:53)
	at org.apache.lucene.util.AbstractBeforeAfterRule$1.evaluate(AbstractBeforeAfterRule.java:46)
	at org.apache.lucene.util.TestRuleStoreClassName$1.evaluate(TestRuleStoreClassName.java:42)
	at com.carrotsearch.randomizedtesting.rules.SystemPropertiesInvariantRule$1.evaluate(SystemPropertiesInvariantRule.java:55)
	at com.carrotsearch.randomizedtesting.rules.NoShadowingOrOverridesOnMethodsRule$1.evaluate(NoShadowingOrOverridesOnMethodsRule.java:39)
	at com.carrotsearch.randomizedtesting.rules.NoShadowingOrOverridesOnMethodsRule$1.evaluate(NoShadowingOrOverridesOnMethodsRule.java:39)
	at com.carrotsearch.randomizedtesting.rules.StatementAdapter.evaluate(StatementAdapter.java:36)
	at org.apache.lucene.util.TestRuleAssertionsRequired$1.evaluate(TestRuleAssertionsRequired.java:43)
	at org.apache.lucene.util.TestRuleMarkFailure$1.evaluate(TestRuleMarkFailure.java:48)
	at org.apache.lucene.util.TestRuleIgnoreAfterMaxFailures$1.evaluate(TestRuleIgnoreAfterMaxFailures.java:65)
	at org.apache.lucene.util.TestRuleIgnoreTestSuites$1.evaluate(TestRuleIgnoreTestSuites.java:55)
	at com.carrotsearch.randomizedtesting.rules.StatementAdapter.evaluate(StatementAdapter.java:36)
	at com.carrotsearch.randomizedtesting.ThreadLeakControl$StatementRunner.run(ThreadLeakControl.java:360)
	at java.lang.Thread.run(Thread.java:744)


REGRESSION:  org.apache.solr.hadoop.MapReduceIndexerToolArgumentParserTest.testArgsParserIllegalFanout

Error Message:
Could not initialize class org.apache.hadoop.util.Shell

Stack Trace:
java.lang.NoClassDefFoundError: Could not initialize class org.apache.hadoop.util.Shell
	at __randomizedtesting.SeedInfo.seed([1D56BFB81BF60C35:A66F4E73A8E8B8DF]:0)
	at org.apache.hadoop.fs.RawLocalFileSystem$RawLocalFileStatus.loadPermissionInfo(RawLocalFileSystem.java:567)
	at org.apache.hadoop.fs.RawLocalFileSystem$RawLocalFileStatus.getPermission(RawLocalFileSystem.java:542)
	at org.apache.solr.hadoop.PathArgumentType.verifyCanWriteParent(PathArgumentType.java:199)
	at org.apache.solr.hadoop.PathArgumentType.convert(PathArgumentType.java:148)
	at org.apache.solr.hadoop.MapReduceIndexerTool$MyArgumentParser$2.convert(MapReduceIndexerTool.java:247)
	at org.apache.solr.hadoop.MapReduceIndexerTool$MyArgumentParser$2.convert(MapReduceIndexerTool.java:244)
	at net.sourceforge.argparse4j.internal.ArgumentImpl.convert(ArgumentImpl.java:255)
	at net.sourceforge.argparse4j.internal.ArgumentParserImpl.processArg(ArgumentParserImpl.java:964)
	at net.sourceforge.argparse4j.internal.ArgumentParserImpl.parseArgs(ArgumentParserImpl.java:824)
	at net.sourceforge.argparse4j.internal.ArgumentParserImpl.parseArgs(ArgumentParserImpl.java:697)
	at net.sourceforge.argparse4j.internal.ArgumentParserImpl.parseArgs(ArgumentParserImpl.java:591)
	at net.sourceforge.argparse4j.internal.ArgumentParserImpl.parseArgs(ArgumentParserImpl.java:584)
	at org.apache.solr.hadoop.MapReduceIndexerTool$MyArgumentParser.parseArgs(MapReduceIndexerTool.java:476)
	at org.apache.solr.hadoop.MapReduceIndexerToolArgumentParserTest.assertArgumentParserException(MapReduceIndexerToolArgumentParserTest.java:461)
	at org.apache.solr.hadoop.MapReduceIndexerToolArgumentParserTest.testArgsParserIllegalFanout(MapReduceIndexerToolArgumentParserTest.java:289)
	at sun.reflect.NativeMethodAccessorImpl.invoke0(Native Method)
	at sun.reflect.NativeMethodAccessorImpl.invoke(NativeMethodAccessorImpl.java:62)
	at sun.reflect.DelegatingMethodAccessorImpl.invoke(DelegatingMethodAccessorImpl.java:43)
	at java.lang.reflect.Method.invoke(Method.java:483)
	at com.carrotsearch.randomizedtesting.RandomizedRunner.invoke(RandomizedRunner.java:1618)
	at com.carrotsearch.randomizedtesting.RandomizedRunner$6.evaluate(RandomizedRunner.java:827)
	at com.carrotsearch.randomizedtesting.RandomizedRunner$7.evaluate(RandomizedRunner.java:863)
	at com.carrotsearch.randomizedtesting.RandomizedRunner$8.evaluate(RandomizedRunner.java:877)
	at com.carrotsearch.randomizedtesting.rules.SystemPropertiesRestoreRule$1.evaluate(SystemPropertiesRestoreRule.java:53)
	at org.apache.lucene.util.TestRuleSetupTeardownChained$1.evaluate(TestRuleSetupTeardownChained.java:50)
	at org.apache.lucene.util.TestRuleFieldCacheSanity$1.evaluate(TestRuleFieldCacheSanity.java:51)
	at org.apache.lucene.util.AbstractBeforeAfterRule$1.evaluate(AbstractBeforeAfterRule.java:46)
	at com.carrotsearch.randomizedtesting.rules.SystemPropertiesInvariantRule$1.evaluate(SystemPropertiesInvariantRule.java:55)
	at org.apache.lucene.util.TestRuleThreadAndTestName$1.evaluate(TestRuleThreadAndTestName.java:49)
	at org.apache.lucene.util.TestRuleIgnoreAfterMaxFailures$1.evaluate(TestRuleIgnoreAfterMaxFailures.java:65)
	at org.apache.lucene.util.TestRuleMarkFailure$1.evaluate(TestRuleMarkFailure.java:48)
	at com.carrotsearch.randomizedtesting.rules.StatementAdapter.evaluate(StatementAdapter.java:36)
	at com.carrotsearch.randomizedtesting.ThreadLeakControl$StatementRunner.run(ThreadLeakControl.java:360)
	at com.carrotsearch.randomizedtesting.ThreadLeakControl.forkTimeoutingTask(ThreadLeakControl.java:793)
	at com.carrotsearch.randomizedtesting.ThreadLeakControl$3.evaluate(ThreadLeakControl.java:453)
	at com.carrotsearch.randomizedtesting.RandomizedRunner.runSingleTest(RandomizedRunner.java:836)
	at com.carrotsearch.randomizedtesting.RandomizedRunner$3.evaluate(RandomizedRunner.java:738)
	at com.carrotsearch.randomizedtesting.RandomizedRunner$4.evaluate(RandomizedRunner.java:772)
	at com.carrotsearch.randomizedtesting.RandomizedRunner$5.evaluate(RandomizedRunner.java:783)
	at com.carrotsearch.randomizedtesting.rules.StatementAdapter.evaluate(StatementAdapter.java:36)
	at com.carrotsearch.randomizedtesting.rules.SystemPropertiesRestoreRule$1.evaluate(SystemPropertiesRestoreRule.java:53)
	at org.apache.lucene.util.AbstractBeforeAfterRule$1.evaluate(AbstractBeforeAfterRule.java:46)
	at org.apache.lucene.util.TestRuleStoreClassName$1.evaluate(TestRuleStoreClassName.java:42)
	at com.carrotsearch.randomizedtesting.rules.SystemPropertiesInvariantRule$1.evaluate(SystemPropertiesInvariantRule.java:55)
	at com.carrotsearch.randomizedtesting.rules.NoShadowingOrOverridesOnMethodsRule$1.evaluate(NoShadowingOrOverridesOnMethodsRule.java:39)
	at com.carrotsearch.randomizedtesting.rules.NoShadowingOrOverridesOnMethodsRule$1.evaluate(NoShadowingOrOverridesOnMethodsRule.java:39)
	at com.carrotsearch.randomizedtesting.rules.StatementAdapter.evaluate(StatementAdapter.java:36)
	at org.apache.lucene.util.TestRuleAssertionsRequired$1.evaluate(TestRuleAssertionsRequired.java:43)
	at org.apache.lucene.util.TestRuleMarkFailure$1.evaluate(TestRuleMarkFailure.java:48)
	at org.apache.lucene.util.TestRuleIgnoreAfterMaxFailures$1.evaluate(TestRuleIgnoreAfterMaxFailures.java:65)
	at org.apache.lucene.util.TestRuleIgnoreTestSuites$1.evaluate(TestRuleIgnoreTestSuites.java:55)
	at com.carrotsearch.randomizedtesting.rules.StatementAdapter.evaluate(StatementAdapter.java:36)
	at com.carrotsearch.randomizedtesting.ThreadLeakControl$StatementRunner.run(ThreadLeakControl.java:360)
	at java.lang.Thread.run(Thread.java:744)


REGRESSION:  org.apache.solr.hadoop.MapReduceIndexerToolArgumentParserTest.testArgsParserHelp

Error Message:
Could not initialize class java.lang.UNIXProcess

Stack Trace:
java.lang.NoClassDefFoundError: Could not initialize class java.lang.UNIXProcess
	at __randomizedtesting.SeedInfo.seed([1D56BFB81BF60C35:818415CF5C986078]:0)
	at java.lang.ProcessImpl.start(ProcessImpl.java:130)
	at java.lang.ProcessBuilder.start(ProcessBuilder.java:1023)
	at net.sourceforge.argparse4j.internal.TerminalWidth.getTerminalWidth2(TerminalWidth.java:74)
	at net.sourceforge.argparse4j.internal.TerminalWidth.getTerminalWidth(TerminalWidth.java:54)
	at net.sourceforge.argparse4j.ArgumentParsers.getFormatWidth(ArgumentParsers.java:221)
	at net.sourceforge.argparse4j.internal.ArgumentParserImpl.printHelp(ArgumentParserImpl.java:270)
	at net.sourceforge.argparse4j.internal.ArgumentParserImpl.printHelp(ArgumentParserImpl.java:264)
	at org.apache.solr.hadoop.MapReduceIndexerTool$MyArgumentParser$1.run(MapReduceIndexerTool.java:185)
	at net.sourceforge.argparse4j.internal.ArgumentImpl.run(ArgumentImpl.java:427)
	at net.sourceforge.argparse4j.internal.ArgumentParserImpl.processArg(ArgumentParserImpl.java:929)
	at net.sourceforge.argparse4j.internal.ArgumentParserImpl.parseArgs(ArgumentParserImpl.java:824)
	at net.sourceforge.argparse4j.internal.ArgumentParserImpl.parseArgs(ArgumentParserImpl.java:697)
	at net.sourceforge.argparse4j.internal.ArgumentParserImpl.parseArgs(ArgumentParserImpl.java:591)
	at net.sourceforge.argparse4j.internal.ArgumentParserImpl.parseArgs(ArgumentParserImpl.java:584)
	at org.apache.solr.hadoop.MapReduceIndexerTool$MyArgumentParser.parseArgs(MapReduceIndexerTool.java:476)
	at org.apache.solr.hadoop.MapReduceIndexerToolArgumentParserTest.testArgsParserHelp(MapReduceIndexerToolArgumentParserTest.java:194)
	at sun.reflect.NativeMethodAccessorImpl.invoke0(Native Method)
	at sun.reflect.NativeMethodAccessorImpl.invoke(NativeMethodAccessorImpl.java:62)
	at sun.reflect.DelegatingMethodAccessorImpl.invoke(DelegatingMethodAccessorImpl.java:43)
	at java.lang.reflect.Method.invoke(Method.java:483)
	at com.carrotsearch.randomizedtesting.RandomizedRunner.invoke(RandomizedRunner.java:1618)
	at com.carrotsearch.randomizedtesting.RandomizedRunner$6.evaluate(RandomizedRunner.java:827)
	at com.carrotsearch.randomizedtesting.RandomizedRunner$7.evaluate(RandomizedRunner.java:863)
	at com.carrotsearch.randomizedtesting.RandomizedRunner$8.evaluate(RandomizedRunner.java:877)
	at com.carrotsearch.randomizedtesting.rules.SystemPropertiesRestoreRule$1.evaluate(SystemPropertiesRestoreRule.java:53)
	at org.apache.lucene.util.TestRuleSetupTeardownChained$1.evaluate(TestRuleSetupTeardownChained.java:50)
	at org.apache.lucene.util.TestRuleFieldCacheSanity$1.evaluate(TestRuleFieldCacheSanity.java:51)
	at org.apache.lucene.util.AbstractBeforeAfterRule$1.evaluate(AbstractBeforeAfterRule.java:46)
	at com.carrotsearch.randomizedtesting.rules.SystemPropertiesInvariantRule$1.evaluate(SystemPropertiesInvariantRule.java:55)
	at org.apache.lucene.util.TestRuleThreadAndTestName$1.evaluate(TestRuleThreadAndTestName.java:49)
	at org.apache.lucene.util.TestRuleIgnoreAfterMaxFailures$1.evaluate(TestRuleIgnoreAfterMaxFailures.java:65)
	at org.apache.lucene.util.TestRuleMarkFailure$1.evaluate(TestRuleMarkFailure.java:48)
	at com.carrotsearch.randomizedtesting.rules.StatementAdapter.evaluate(StatementAdapter.java:36)
	at com.carrotsearch.randomizedtesting.ThreadLeakControl$StatementRunner.run(ThreadLeakControl.java:360)
	at com.carrotsearch.randomizedtesting.ThreadLeakControl.forkTimeoutingTask(ThreadLeakControl.java:793)
	at com.carrotsearch.randomizedtesting.ThreadLeakControl$3.evaluate(ThreadLeakControl.java:453)
	at com.carrotsearch.randomizedtesting.RandomizedRunner.runSingleTest(RandomizedRunner.java:836)
	at com.carrotsearch.randomizedtesting.RandomizedRunner$3.evaluate(RandomizedRunner.java:738)
	at com.carrotsearch.randomizedtesting.RandomizedRunner$4.evaluate(RandomizedRunner.java:772)
	at com.carrotsearch.randomizedtesting.RandomizedRunner$5.evaluate(RandomizedRunner.java:783)
	at com.carrotsearch.randomizedtesting.rules.StatementAdapter.evaluate(StatementAdapter.java:36)
	at com.carrotsearch.randomizedtesting.rules.SystemPropertiesRestoreRule$1.evaluate(SystemPropertiesRestoreRule.java:53)
	at org.apache.lucene.util.AbstractBeforeAfterRule$1.evaluate(AbstractBeforeAfterRule.java:46)
	at org.apache.lucene.util.TestRuleStoreClassName$1.evaluate(TestRuleStoreClassName.java:42)
	at com.carrotsearch.randomizedtesting.rules.SystemPropertiesInvariantRule$1.evaluate(SystemPropertiesInvariantRule.java:55)
	at com.carrotsearch.randomizedtesting.rules.NoShadowingOrOverridesOnMethodsRule$1.evaluate(NoShadowingOrOverridesOnMethodsRule.java:39)
	at com.carrotsearch.randomizedtesting.rules.NoShadowingOrOverridesOnMethodsRule$1.evaluate(NoShadowingOrOverridesOnMethodsRule.java:39)
	at com.carrotsearch.randomizedtesting.rules.StatementAdapter.evaluate(StatementAdapter.java:36)
	at org.apache.lucene.util.TestRuleAssertionsRequired$1.evaluate(TestRuleAssertionsRequired.java:43)
	at org.apache.lucene.util.TestRuleMarkFailure$1.evaluate(TestRuleMarkFailure.java:48)
	at org.apache.lucene.util.TestRuleIgnoreAfterMaxFailures$1.evaluate(TestRuleIgnoreAfterMaxFailures.java:65)
	at org.apache.lucene.util.TestRuleIgnoreTestSuites$1.evaluate(TestRuleIgnoreTestSuites.java:55)
	at com.carrotsearch.randomizedtesting.rules.StatementAdapter.evaluate(StatementAdapter.java:36)
	at com.carrotsearch.randomizedtesting.ThreadLeakControl$StatementRunner.run(ThreadLeakControl.java:360)
	at java.lang.Thread.run(Thread.java:744)


REGRESSION:  org.apache.solr.hadoop.MapReduceIndexerToolArgumentParserTest.testArgsShardUrlNoGoLive

Error Message:
Could not initialize class org.apache.hadoop.util.Shell

Stack Trace:
java.lang.NoClassDefFoundError: Could not initialize class org.apache.hadoop.util.Shell
	at __randomizedtesting.SeedInfo.seed([1D56BFB81BF60C35:41EC1272FA60798F]:0)
	at org.apache.hadoop.fs.RawLocalFileSystem$RawLocalFileStatus.loadPermissionInfo(RawLocalFileSystem.java:567)
	at org.apache.hadoop.fs.RawLocalFileSystem$RawLocalFileStatus.getPermission(RawLocalFileSystem.java:542)
	at org.apache.solr.hadoop.PathArgumentType.verifyCanWriteParent(PathArgumentType.java:199)
	at org.apache.solr.hadoop.PathArgumentType.convert(PathArgumentType.java:148)
	at org.apache.solr.hadoop.MapReduceIndexerTool$MyArgumentParser$2.convert(MapReduceIndexerTool.java:247)
	at org.apache.solr.hadoop.MapReduceIndexerTool$MyArgumentParser$2.convert(MapReduceIndexerTool.java:244)
	at net.sourceforge.argparse4j.internal.ArgumentImpl.convert(ArgumentImpl.java:255)
	at net.sourceforge.argparse4j.internal.ArgumentParserImpl.processArg(ArgumentParserImpl.java:964)
	at net.sourceforge.argparse4j.internal.ArgumentParserImpl.parseArgs(ArgumentParserImpl.java:824)
	at net.sourceforge.argparse4j.internal.ArgumentParserImpl.parseArgs(ArgumentParserImpl.java:697)
	at net.sourceforge.argparse4j.internal.ArgumentParserImpl.parseArgs(ArgumentParserImpl.java:591)
	at net.sourceforge.argparse4j.internal.ArgumentParserImpl.parseArgs(ArgumentParserImpl.java:584)
	at org.apache.solr.hadoop.MapReduceIndexerTool$MyArgumentParser.parseArgs(MapReduceIndexerTool.java:476)
	at org.apache.solr.hadoop.MapReduceIndexerToolArgumentParserTest.testArgsShardUrlNoGoLive(MapReduceIndexerToolArgumentParserTest.java:358)
	at sun.reflect.NativeMethodAccessorImpl.invoke0(Native Method)
	at sun.reflect.NativeMethodAccessorImpl.invoke(NativeMethodAccessorImpl.java:62)
	at sun.reflect.DelegatingMethodAccessorImpl.invoke(DelegatingMethodAccessorImpl.java:43)
	at java.lang.reflect.Method.invoke(Method.java:483)
	at com.carrotsearch.randomizedtesting.RandomizedRunner.invoke(RandomizedRunner.java:1618)
	at com.carrotsearch.randomizedtesting.RandomizedRunner$6.evaluate(RandomizedRunner.java:827)
	at com.carrotsearch.randomizedtesting.RandomizedRunner$7.evaluate(RandomizedRunner.java:863)
	at com.carrotsearch.randomizedtesting.RandomizedRunner$8.evaluate(RandomizedRunner.java:877)
	at com.carrotsearch.randomizedtesting.rules.SystemPropertiesRestoreRule$1.evaluate(SystemPropertiesRestoreRule.java:53)
	at org.apache.lucene.util.TestRuleSetupTeardownChained$1.evaluate(TestRuleSetupTeardownChained.java:50)
	at org.apache.lucene.util.TestRuleFieldCacheSanity$1.evaluate(TestRuleFieldCacheSanity.java:51)
	at org.apache.lucene.util.AbstractBeforeAfterRule$1.evaluate(AbstractBeforeAfterRule.java:46)
	at com.carrotsearch.randomizedtesting.rules.SystemPropertiesInvariantRule$1.evaluate(SystemPropertiesInvariantRule.java:55)
	at org.apache.lucene.util.TestRuleThreadAndTestName$1.evaluate(TestRuleThreadAndTestName.java:49)
	at org.apache.lucene.util.TestRuleIgnoreAfterMaxFailures$1.evaluate(TestRuleIgnoreAfterMaxFailures.java:65)
	at org.apache.lucene.util.TestRuleMarkFailure$1.evaluate(TestRuleMarkFailure.java:48)
	at com.carrotsearch.randomizedtesting.rules.StatementAdapter.evaluate(StatementAdapter.java:36)
	at com.carrotsearch.randomizedtesting.ThreadLeakControl$StatementRunner.run(ThreadLeakControl.java:360)
	at com.carrotsearch.randomizedtesting.ThreadLeakControl.forkTimeoutingTask(ThreadLeakControl.java:793)
	at com.carrotsearch.randomizedtesting.ThreadLeakControl$3.evaluate(ThreadLeakControl.java:453)
	at com.carrotsearch.randomizedtesting.RandomizedRunner.runSingleTest(RandomizedRunner.java:836)
	at com.carrotsearch.randomizedtesting.RandomizedRunner$3.evaluate(RandomizedRunner.java:738)
	at com.carrotsearch.randomizedtesting.RandomizedRunner$4.evaluate(RandomizedRunner.java:772)
	at com.carrotsearch.randomizedtesting.RandomizedRunner$5.evaluate(RandomizedRunner.java:783)
	at com.carrotsearch.randomizedtesting.rules.StatementAdapter.evaluate(StatementAdapter.java:36)
	at com.carrotsearch.randomizedtesting.rules.SystemPropertiesRestoreRule$1.evaluate(SystemPropertiesRestoreRule.java:53)
	at org.apache.lucene.util.AbstractBeforeAfterRule$1.evaluate(AbstractBeforeAfterRule.java:46)
	at org.apache.lucene.util.TestRuleStoreClassName$1.evaluate(TestRuleStoreClassName.java:42)
	at com.carrotsearch.randomizedtesting.rules.SystemPropertiesInvariantRule$1.evaluate(SystemPropertiesInvariantRule.java:55)
	at com.carrotsearch.randomizedtesting.rules.NoShadowingOrOverridesOnMethodsRule$1.evaluate(NoShadowingOrOverridesOnMethodsRule.java:39)
	at com.carrotsearch.randomizedtesting.rules.NoShadowingOrOverridesOnMethodsRule$1.evaluate(NoShadowingOrOverridesOnMethodsRule.java:39)
	at com.carrotsearch.randomizedtesting.rules.StatementAdapter.evaluate(StatementAdapter.java:36)
	at org.apache.lucene.util.TestRuleAssertionsRequired$1.evaluate(TestRuleAssertionsRequired.java:43)
	at org.apache.lucene.util.TestRuleMarkFailure$1.evaluate(TestRuleMarkFailure.java:48)
	at org.apache.lucene.util.TestRuleIgnoreAfterMaxFailures$1.evaluate(TestRuleIgnoreAfterMaxFailures.java:65)
	at org.apache.lucene.util.TestRuleIgnoreTestSuites$1.evaluate(TestRuleIgnoreTestSuites.java:55)
	at com.carrotsearch.randomizedtesting.rules.StatementAdapter.evaluate(StatementAdapter.java:36)
	at com.carrotsearch.randomizedtesting.ThreadLeakControl$StatementRunner.run(ThreadLeakControl.java:360)
	at java.lang.Thread.run(Thread.java:744)


REGRESSION:  org.apache.solr.hadoop.MapReduceIndexerToolArgumentParserTest.testArgsShardUrlMustHaveAParam

Error Message:
Could not initialize class org.apache.hadoop.util.Shell

Stack Trace:
java.lang.NoClassDefFoundError: Could not initialize class org.apache.hadoop.util.Shell
	at __randomizedtesting.SeedInfo.seed([1D56BFB81BF60C35:8DD1A89807D9C042]:0)
	at org.apache.hadoop.fs.RawLocalFileSystem$RawLocalFileStatus.loadPermissionInfo(RawLocalFileSystem.java:567)
	at org.apache.hadoop.fs.RawLocalFileSystem$RawLocalFileStatus.getPermission(RawLocalFileSystem.java:542)
	at org.apache.solr.hadoop.PathArgumentType.verifyCanWriteParent(PathArgumentType.java:199)
	at org.apache.solr.hadoop.PathArgumentType.convert(PathArgumentType.java:148)
	at org.apache.solr.hadoop.MapReduceIndexerTool$MyArgumentParser$2.convert(MapReduceIndexerTool.java:247)
	at org.apache.solr.hadoop.MapReduceIndexerTool$MyArgumentParser$2.convert(MapReduceIndexerTool.java:244)
	at net.sourceforge.argparse4j.internal.ArgumentImpl.convert(ArgumentImpl.java:255)
	at net.sourceforge.argparse4j.internal.ArgumentParserImpl.processArg(ArgumentParserImpl.java:964)
	at net.sourceforge.argparse4j.internal.ArgumentParserImpl.parseArgs(ArgumentParserImpl.java:824)
	at net.sourceforge.argparse4j.internal.ArgumentParserImpl.parseArgs(ArgumentParserImpl.java:697)
	at net.sourceforge.argparse4j.internal.ArgumentParserImpl.parseArgs(ArgumentParserImpl.java:591)
	at net.sourceforge.argparse4j.internal.ArgumentParserImpl.parseArgs(ArgumentParserImpl.java:584)
	at org.apache.solr.hadoop.MapReduceIndexerTool$MyArgumentParser.parseArgs(MapReduceIndexerTool.java:476)
	at org.apache.solr.hadoop.MapReduceIndexerToolArgumentParserTest.assertArgumentParserException(MapReduceIndexerToolArgumentParserTest.java:461)
	at org.apache.solr.hadoop.MapReduceIndexerToolArgumentParserTest.testArgsShardUrlMustHaveAParam(MapReduceIndexerToolArgumentParserTest.java:332)
	at sun.reflect.NativeMethodAccessorImpl.invoke0(Native Method)
	at sun.reflect.NativeMethodAccessorImpl.invoke(NativeMethodAccessorImpl.java:62)
	at sun.reflect.DelegatingMethodAccessorImpl.invoke(DelegatingMethodAccessorImpl.java:43)
	at java.lang.reflect.Method.invoke(Method.java:483)
	at com.carrotsearch.randomizedtesting.RandomizedRunner.invoke(RandomizedRunner.java:1618)
	at com.carrotsearch.randomizedtesting.RandomizedRunner$6.evaluate(RandomizedRunner.java:827)
	at com.carrotsearch.randomizedtesting.RandomizedRunner$7.evaluate(RandomizedRunner.java:863)
	at com.carrotsearch.randomizedtesting.RandomizedRunner$8.evaluate(RandomizedRunner.java:877)
	at com.carrotsearch.randomizedtesting.rules.SystemPropertiesRestoreRule$1.evaluate(SystemPropertiesRestoreRule.java:53)
	at org.apache.lucene.util.TestRuleSetupTeardownChained$1.evaluate(TestRuleSetupTeardownChained.java:50)
	at org.apache.lucene.util.TestRuleFieldCacheSanity$1.evaluate(TestRuleFieldCacheSanity.java:51)
	at org.apache.lucene.util.AbstractBeforeAfterRule$1.evaluate(AbstractBeforeAfterRule.java:46)
	at com.carrotsearch.randomizedtesting.rules.SystemPropertiesInvariantRule$1.evaluate(SystemPropertiesInvariantRule.java:55)
	at org.apache.lucene.util.TestRuleThreadAndTestName$1.evaluate(TestRuleThreadAndTestName.java:49)
	at org.apache.lucene.util.TestRuleIgnoreAfterMaxFailures$1.evaluate(TestRuleIgnoreAfterMaxFailures.java:65)
	at org.apache.lucene.util.TestRuleMarkFailure$1.evaluate(TestRuleMarkFailure.java:48)
	at com.carrotsearch.randomizedtesting.rules.StatementAdapter.evaluate(StatementAdapter.java:36)
	at com.carrotsearch.randomizedtesting.ThreadLeakControl$StatementRunner.run(ThreadLeakControl.java:360)
	at com.carrotsearch.randomizedtesting.ThreadLeakControl.forkTimeoutingTask(ThreadLeakControl.java:793)
	at com.carrotsearch.randomizedtesting.ThreadLeakControl$3.evaluate(ThreadLeakControl.java:453)
	at com.carrotsearch.randomizedtesting.RandomizedRunner.runSingleTest(RandomizedRunner.java:836)
	at com.carrotsearch.randomizedtesting.RandomizedRunner$3.evaluate(RandomizedRunner.java:738)
	at com.carrotsearch.randomizedtesting.RandomizedRunner$4.evaluate(RandomizedRunner.java:772)
	at com.carrotsearch.randomizedtesting.RandomizedRunner$5.evaluate(RandomizedRunner.java:783)
	at com.carrotsearch.randomizedtesting.rules.StatementAdapter.evaluate(StatementAdapter.java:36)
	at com.carrotsearch.randomizedtesting.rules.SystemPropertiesRestoreRule$1.evaluate(SystemPropertiesRestoreRule.java:53)
	at org.apache.lucene.util.AbstractBeforeAfterRule$1.evaluate(AbstractBeforeAfterRule.java:46)
	at org.apache.lucene.util.TestRuleStoreClassName$1.evaluate(TestRuleStoreClassName.java:42)
	at com.carrotsearch.randomizedtesting.rules.SystemPropertiesInvariantRule$1.evaluate(SystemPropertiesInvariantRule.java:55)
	at com.carrotsearch.randomizedtesting.rules.NoShadowingOrOverridesOnMethodsRule$1.evaluate(NoShadowingOrOverridesOnMethodsRule.java:39)
	at com.carrotsearch.randomizedtesting.rules.NoShadowingOrOverridesOnMethodsRule$1.evaluate(NoShadowingOrOverridesOnMethodsRule.java:39)
	at com.carrotsearch.randomizedtesting.rules.StatementAdapter.evaluate(StatementAdapter.java:36)
	at org.apache.lucene.util.TestRuleAssertionsRequired$1.evaluate(TestRuleAssertionsRequired.java:43)
	at org.apache.lucene.util.TestRuleMarkFailure$1.evaluate(TestRuleMarkFailure.java:48)
	at org.apache.lucene.util.TestRuleIgnoreAfterMaxFailures$1.evaluate(TestRuleIgnoreAfterMaxFailures.java:65)
	at org.apache.lucene.util.TestRuleIgnoreTestSuites$1.evaluate(TestRuleIgnoreTestSuites.java:55)
	at com.carrotsearch.randomizedtesting.rules.StatementAdapter.evaluate(StatementAdapter.java:36)
	at com.carrotsearch.randomizedtesting.ThreadLeakControl$StatementRunner.run(ThreadLeakControl.java:360)
	at java.lang.Thread.run(Thread.java:744)


REGRESSION:  org.apache.solr.hadoop.MapReduceIndexerToolArgumentParserTest.testArgsParserFileNotFound1

Error Message:
Could not initialize class java.lang.UNIXProcess

Stack Trace:
java.lang.NoClassDefFoundError: Could not initialize class java.lang.UNIXProcess
	at __randomizedtesting.SeedInfo.seed([1D56BFB81BF60C35:A7C2109E9081F40]:0)
	at java.lang.ProcessImpl.start(ProcessImpl.java:130)
	at java.lang.ProcessBuilder.start(ProcessBuilder.java:1023)
	at net.sourceforge.argparse4j.internal.TerminalWidth.getTerminalWidth2(TerminalWidth.java:74)
	at net.sourceforge.argparse4j.internal.TerminalWidth.getTerminalWidth(TerminalWidth.java:54)
	at net.sourceforge.argparse4j.ArgumentParsers.getFormatWidth(ArgumentParsers.java:221)
	at net.sourceforge.argparse4j.internal.ArgumentParserImpl.printUsage(ArgumentParserImpl.java:371)
	at net.sourceforge.argparse4j.internal.ArgumentParserImpl.handleError(ArgumentParserImpl.java:1154)
	at org.apache.solr.hadoop.MapReduceIndexerTool$MyArgumentParser.parseArgs(MapReduceIndexerTool.java:480)
	at org.apache.solr.hadoop.MapReduceIndexerToolArgumentParserTest.assertArgumentParserException(MapReduceIndexerToolArgumentParserTest.java:461)
	at org.apache.solr.hadoop.MapReduceIndexerToolArgumentParserTest.testArgsParserFileNotFound1(MapReduceIndexerToolArgumentParserTest.java:251)
	at sun.reflect.NativeMethodAccessorImpl.invoke0(Native Method)
	at sun.reflect.NativeMethodAccessorImpl.invoke(NativeMethodAccessorImpl.java:62)
	at sun.reflect.DelegatingMethodAccessorImpl.invoke(DelegatingMethodAccessorImpl.java:43)
	at java.lang.reflect.Method.invoke(Method.java:483)
	at com.carrotsearch.randomizedtesting.RandomizedRunner.invoke(RandomizedRunner.java:1618)
	at com.carrotsearch.randomizedtesting.RandomizedRunner$6.evaluate(RandomizedRunner.java:827)
	at com.carrotsearch.randomizedtesting.RandomizedRunner$7.evaluate(RandomizedRunner.java:863)
	at com.carrotsearch.randomizedtesting.RandomizedRunner$8.evaluate(RandomizedRunner.java:877)
	at com.carrotsearch.randomizedtesting.rules.SystemPropertiesRestoreRule$1.evaluate(SystemPropertiesRestoreRule.java:53)
	at org.apache.lucene.util.TestRuleSetupTeardownChained$1.evaluate(TestRuleSetupTeardownChained.java:50)
	at org.apache.lucene.util.TestRuleFieldCacheSanity$1.evaluate(TestRuleFieldCacheSanity.java:51)
	at org.apache.lucene.util.AbstractBeforeAfterRule$1.evaluate(AbstractBeforeAfterRule.java:46)
	at com.carrotsearch.randomizedtesting.rules.SystemPropertiesInvariantRule$1.evaluate(SystemPropertiesInvariantRule.java:55)
	at org.apache.lucene.util.TestRuleThreadAndTestName$1.evaluate(TestRuleThreadAndTestName.java:49)
	at org.apache.lucene.util.TestRuleIgnoreAfterMaxFailures$1.evaluate(TestRuleIgnoreAfterMaxFailures.java:65)
	at org.apache.lucene.util.TestRuleMarkFailure$1.evaluate(TestRuleMarkFailure.java:48)
	at com.carrotsearch.randomizedtesting.rules.StatementAdapter.evaluate(StatementAdapter.java:36)
	at com.carrotsearch.randomizedtesting.ThreadLeakControl$StatementRunner.run(ThreadLeakControl.java:360)
	at com.carrotsearch.randomizedtesting.ThreadLeakControl.forkTimeoutingTask(ThreadLeakControl.java:793)
	at com.carrotsearch.randomizedtesting.ThreadLeakControl$3.evaluate(ThreadLeakControl.java:453)
	at com.carrotsearch.randomizedtesting.RandomizedRunner.runSingleTest(RandomizedRunner.java:836)
	at com.carrotsearch.randomizedtesting.RandomizedRunner$3.evaluate(RandomizedRunner.java:738)
	at com.carrotsearch.randomizedtesting.RandomizedRunner$4.evaluate(RandomizedRunner.java:772)
	at com.carrotsearch.randomizedtesting.RandomizedRunner$5.evaluate(RandomizedRunner.java:783)
	at com.carrotsearch.randomizedtesting.rules.StatementAdapter.evaluate(StatementAdapter.java:36)
	at com.carrotsearch.randomizedtesting.rules.SystemPropertiesRestoreRule$1.evaluate(SystemPropertiesRestoreRule.java:53)
	at org.apache.lucene.util.AbstractBeforeAfterRule$1.evaluate(AbstractBeforeAfterRule.java:46)
	at org.apache.lucene.util.TestRuleStoreClassName$1.evaluate(TestRuleStoreClassName.java:42)
	at com.carrotsearch.randomizedtesting.rules.SystemPropertiesInvariantRule$1.evaluate(SystemPropertiesInvariantRule.java:55)
	at com.carrotsearch.randomizedtesting.rules.NoShadowingOrOverridesOnMethodsRule$1.evaluate(NoShadowingOrOverridesOnMethodsRule.java:39)
	at com.carrotsearch.randomizedtesting.rules.NoShadowingOrOverridesOnMethodsRule$1.evaluate(NoShadowingOrOverridesOnMethodsRule.java:39)
	at com.carrotsearch.randomizedtesting.rules.StatementAdapter.evaluate(StatementAdapter.java:36)
	at org.apache.lucene.util.TestRuleAssertionsRequired$1.evaluate(TestRuleAssertionsRequired.java:43)
	at org.apache.lucene.util.TestRuleMarkFailure$1.evaluate(TestRuleMarkFailure.java:48)
	at org.apache.lucene.util.TestRuleIgnoreAfterMaxFailures$1.evaluate(TestRuleIgnoreAfterMaxFailures.java:65)
	at org.apache.lucene.util.TestRuleIgnoreTestSuites$1.evaluate(TestRuleIgnoreTestSuites.java:55)
	at com.carrotsearch.randomizedtesting.rules.StatementAdapter.evaluate(StatementAdapter.java:36)
	at com.carrotsearch.randomizedtesting.ThreadLeakControl$StatementRunner.run(ThreadLeakControl.java:360)
	at java.lang.Thread.run(Thread.java:744)


REGRESSION:  org.apache.solr.hadoop.MapReduceIndexerToolArgumentParserTest.testArgsShardUrlsAndZkhostAreMutuallyExclusive

Error Message:
Could not initialize class org.apache.hadoop.util.Shell

Stack Trace:
java.lang.NoClassDefFoundError: Could not initialize class org.apache.hadoop.util.Shell
	at __randomizedtesting.SeedInfo.seed([1D56BFB81BF60C35:D434DF883D572596]:0)
	at org.apache.hadoop.fs.RawLocalFileSystem$RawLocalFileStatus.loadPermissionInfo(RawLocalFileSystem.java:567)
	at org.apache.hadoop.fs.RawLocalFileSystem$RawLocalFileStatus.getPermission(RawLocalFileSystem.java:542)
	at org.apache.solr.hadoop.PathArgumentType.verifyCanWriteParent(PathArgumentType.java:199)
	at org.apache.solr.hadoop.PathArgumentType.convert(PathArgumentType.java:148)
	at org.apache.solr.hadoop.MapReduceIndexerTool$MyArgumentParser$2.convert(MapReduceIndexerTool.java:247)
	at org.apache.solr.hadoop.MapReduceIndexerTool$MyArgumentParser$2.convert(MapReduceIndexerTool.java:244)
	at net.sourceforge.argparse4j.internal.ArgumentImpl.convert(ArgumentImpl.java:255)
	at net.sourceforge.argparse4j.internal.ArgumentParserImpl.processArg(ArgumentParserImpl.java:964)
	at net.sourceforge.argparse4j.internal.ArgumentParserImpl.parseArgs(ArgumentParserImpl.java:824)
	at net.sourceforge.argparse4j.internal.ArgumentParserImpl.parseArgs(ArgumentParserImpl.java:697)
	at net.sourceforge.argparse4j.internal.ArgumentParserImpl.parseArgs(ArgumentParserImpl.java:591)
	at net.sourceforge.argparse4j.internal.ArgumentParserImpl.parseArgs(ArgumentParserImpl.java:584)
	at org.apache.solr.hadoop.MapReduceIndexerTool$MyArgumentParser.parseArgs(MapReduceIndexerTool.java:476)
	at org.apache.solr.hadoop.MapReduceIndexerToolArgumentParserTest.assertArgumentParserException(MapReduceIndexerToolArgumentParserTest.java:461)
	at org.apache.solr.hadoop.MapReduceIndexerToolArgumentParserTest.testArgsShardUrlsAndZkhostAreMutuallyExclusive(MapReduceIndexerToolArgumentParserTest.java:375)
	at sun.reflect.NativeMethodAccessorImpl.invoke0(Native Method)
	at sun.reflect.NativeMethodAccessorImpl.invoke(NativeMethodAccessorImpl.java:62)
	at sun.reflect.DelegatingMethodAccessorImpl.invoke(DelegatingMethodAccessorImpl.java:43)
	at java.lang.reflect.Method.invoke(Method.java:483)
	at com.carrotsearch.randomizedtesting.RandomizedRunner.invoke(RandomizedRunner.java:1618)
	at com.carrotsearch.randomizedtesting.RandomizedRunner$6.evaluate(RandomizedRunner.java:827)
	at com.carrotsearch.randomizedtesting.RandomizedRunner$7.evaluate(RandomizedRunner.java:863)
	at com.carrotsearch.randomizedtesting.RandomizedRunner$8.evaluate(RandomizedRunner.java:877)
	at com.carrotsearch.randomizedtesting.rules.SystemPropertiesRestoreRule$1.evaluate(SystemPropertiesRestoreRule.java:53)
	at org.apache.lucene.util.TestRuleSetupTeardownChained$1.evaluate(TestRuleSetupTeardownChained.java:50)
	at org.apache.lucene.util.TestRuleFieldCacheSanity$1.evaluate(TestRuleFieldCacheSanity.java:51)
	at org.apache.lucene.util.AbstractBeforeAfterRule$1.evaluate(AbstractBeforeAfterRule.java:46)
	at com.carrotsearch.randomizedtesting.rules.SystemPropertiesInvariantRule$1.evaluate(SystemPropertiesInvariantRule.java:55)
	at org.apache.lucene.util.TestRuleThreadAndTestName$1.evaluate(TestRuleThreadAndTestName.java:49)
	at org.apache.lucene.util.TestRuleIgnoreAfterMaxFailures$1.evaluate(TestRuleIgnoreAfterMaxFailures.java:65)
	at org.apache.lucene.util.TestRuleMarkFailure$1.evaluate(TestRuleMarkFailure.java:48)
	at com.carrotsearch.randomizedtesting.rules.StatementAdapter.evaluate(StatementAdapter.java:36)
	at com.carrotsearch.randomizedtesting.ThreadLeakControl$StatementRunner.run(ThreadLeakControl.java:360)
	at com.carrotsearch.randomizedtesting.ThreadLeakControl.forkTimeoutingTask(ThreadLeakControl.java:793)
	at com.carrotsearch.randomizedtesting.ThreadLeakControl$3.evaluate(ThreadLeakControl.java:453)
	at com.carrotsearch.randomizedtesting.RandomizedRunner.runSingleTest(RandomizedRunner.java:836)
	at com.carrotsearch.randomizedtesting.RandomizedRunner$3.evaluate(RandomizedRunner.java:738)
	at com.carrotsearch.randomizedtesting.RandomizedRunner$4.evaluate(RandomizedRunner.java:772)
	at com.carrotsearch.randomizedtesting.RandomizedRunner$5.evaluate(RandomizedRunner.java:783)
	at com.carrotsearch.randomizedtesting.rules.StatementAdapter.evaluate(StatementAdapter.java:36)
	at com.carrotsearch.randomizedtesting.rules.SystemPropertiesRestoreRule$1.evaluate(SystemPropertiesRestoreRule.java:53)
	at org.apache.lucene.util.AbstractBeforeAfterRule$1.evaluate(AbstractBeforeAfterRule.java:46)
	at org.apache.lucene.util.TestRuleStoreClassName$1.evaluate(TestRuleStoreClassName.java:42)
	at com.carrotsearch.randomizedtesting.rules.SystemPropertiesInvariantRule$1.evaluate(SystemPropertiesInvariantRule.java:55)
	at com.carrotsearch.randomizedtesting.rules.NoShadowingOrOverridesOnMethodsRule$1.evaluate(NoShadowingOrOverridesOnMethodsRule.java:39)
	at com.carrotsearch.randomizedtesting.rules.NoShadowingOrOverridesOnMethodsRule$1.evaluate(NoShadowingOrOverridesOnMethodsRule.java:39)
	at com.carrotsearch.randomizedtesting.rules.StatementAdapter.evaluate(StatementAdapter.java:36)
	at org.apache.lucene.util.TestRuleAssertionsRequired$1.evaluate(TestRuleAssertionsRequired.java:43)
	at org.apache.lucene.util.TestRuleMarkFailure$1.evaluate(TestRuleMarkFailure.java:48)
	at org.apache.lucene.util.TestRuleIgnoreAfterMaxFailures$1.evaluate(TestRuleIgnoreAfterMaxFailures.java:65)
	at org.apache.lucene.util.TestRuleIgnoreTestSuites$1.evaluate(TestRuleIgnoreTestSuites.java:55)
	at com.carrotsearch.randomizedtesting.rules.StatementAdapter.evaluate(StatementAdapter.java:36)
	at com.carrotsearch.randomizedtesting.ThreadLeakControl$StatementRunner.run(ThreadLeakControl.java:360)
	at java.lang.Thread.run(Thread.java:744)


REGRESSION:  org.apache.solr.hadoop.MapReduceIndexerToolArgumentParserTest.testArgsParserMultipleSpecsOfSameKindWithEqualsSign

Error Message:
Could not initialize class org.apache.hadoop.util.Shell

Stack Trace:
java.lang.NoClassDefFoundError: Could not initialize class org.apache.hadoop.util.Shell
	at __randomizedtesting.SeedInfo.seed([1D56BFB81BF60C35:5F9BA1F256EAA25F]:0)
	at org.apache.hadoop.fs.RawLocalFileSystem$RawLocalFileStatus.loadPermissionInfo(RawLocalFileSystem.java:567)
	at org.apache.hadoop.fs.RawLocalFileSystem$RawLocalFileStatus.getPermission(RawLocalFileSystem.java:542)
	at org.apache.solr.hadoop.PathArgumentType.verifyCanWriteParent(PathArgumentType.java:199)
	at org.apache.solr.hadoop.PathArgumentType.convert(PathArgumentType.java:148)
	at org.apache.solr.hadoop.MapReduceIndexerTool$MyArgumentParser$2.convert(MapReduceIndexerTool.java:247)
	at org.apache.solr.hadoop.MapReduceIndexerTool$MyArgumentParser$2.convert(MapReduceIndexerTool.java:244)
	at net.sourceforge.argparse4j.internal.ArgumentImpl.convert(ArgumentImpl.java:255)
	at net.sourceforge.argparse4j.internal.ArgumentParserImpl.processArg(ArgumentParserImpl.java:964)
	at net.sourceforge.argparse4j.internal.ArgumentParserImpl.parseArgs(ArgumentParserImpl.java:824)
	at net.sourceforge.argparse4j.internal.ArgumentParserImpl.parseArgs(ArgumentParserImpl.java:697)
	at net.sourceforge.argparse4j.internal.ArgumentParserImpl.parseArgs(ArgumentParserImpl.java:591)
	at net.sourceforge.argparse4j.internal.ArgumentParserImpl.parseArgs(ArgumentParserImpl.java:584)
	at org.apache.solr.hadoop.MapReduceIndexerTool$MyArgumentParser.parseArgs(MapReduceIndexerTool.java:476)
	at org.apache.solr.hadoop.MapReduceIndexerToolArgumentParserTest.testArgsParserMultipleSpecsOfSameKindWithEqualsSign(MapReduceIndexerToolArgumentParserTest.java:183)
	at sun.reflect.NativeMethodAccessorImpl.invoke0(Native Method)
	at sun.reflect.NativeMethodAccessorImpl.invoke(NativeMethodAccessorImpl.java:62)
	at sun.reflect.DelegatingMethodAccessorImpl.invoke(DelegatingMethodAccessorImpl.java:43)
	at java.lang.reflect.Method.invoke(Method.java:483)
	at com.carrotsearch.randomizedtesting.RandomizedRunner.invoke(RandomizedRunner.java:1618)
	at com.carrotsearch.randomizedtesting.RandomizedRunner$6.evaluate(RandomizedRunner.java:827)
	at com.carrotsearch.randomizedtesting.RandomizedRunner$7.evaluate(RandomizedRunner.java:863)
	at com.carrotsearch.randomizedtesting.RandomizedRunner$8.evaluate(RandomizedRunner.java:877)
	at com.carrotsearch.randomizedtesting.rules.SystemPropertiesRestoreRule$1.evaluate(SystemPropertiesRestoreRule.java:53)
	at org.apache.lucene.util.TestRuleSetupTeardownChained$1.evaluate(TestRuleSetupTeardownChained.java:50)
	at org.apache.lucene.util.TestRuleFieldCacheSanity$1.evaluate(TestRuleFieldCacheSanity.java:51)
	at org.apache.lucene.util.AbstractBeforeAfterRule$1.evaluate(AbstractBeforeAfterRule.java:46)
	at com.carrotsearch.randomizedtesting.rules.SystemPropertiesInvariantRule$1.evaluate(SystemPropertiesInvariantRule.java:55)
	at org.apache.lucene.util.TestRuleThreadAndTestName$1.evaluate(TestRuleThreadAndTestName.java:49)
	at org.apache.lucene.util.TestRuleIgnoreAfterMaxFailures$1.evaluate(TestRuleIgnoreAfterMaxFailures.java:65)
	at org.apache.lucene.util.TestRuleMarkFailure$1.evaluate(TestRuleMarkFailure.java:48)
	at com.carrotsearch.randomizedtesting.rules.StatementAdapter.evaluate(StatementAdapter.java:36)
	at com.carrotsearch.randomizedtesting.ThreadLeakControl$StatementRunner.run(ThreadLeakControl.java:360)
	at com.carrotsearch.randomizedtesting.ThreadLeakControl.forkTimeoutingTask(ThreadLeakControl.java:793)
	at com.carrotsearch.randomizedtesting.ThreadLeakControl$3.evaluate(ThreadLeakControl.java:453)
	at com.carrotsearch.randomizedtesting.RandomizedRunner.runSingleTest(RandomizedRunner.java:836)
	at com.carrotsearch.randomizedtesting.RandomizedRunner$3.evaluate(RandomizedRunner.java:738)
	at com.carrotsearch.randomizedtesting.RandomizedRunner$4.evaluate(RandomizedRunner.java:772)
	at com.carrotsearch.randomizedtesting.RandomizedRunner$5.evaluate(RandomizedRunner.java:783)
	at com.carrotsearch.randomizedtesting.rules.StatementAdapter.evaluate(StatementAdapter.java:36)
	at com.carrotsearch.randomizedtesting.rules.SystemPropertiesRestoreRule$1.evaluate(SystemPropertiesRestoreRule.java:53)
	at org.apache.lucene.util.AbstractBeforeAfterRule$1.evaluate(AbstractBeforeAfterRule.java:46)
	at org.apache.lucene.util.TestRuleStoreClassName$1.evaluate(TestRuleStoreClassName.java:42)
	at com.carrotsearch.randomizedtesting.rules.SystemPropertiesInvariantRule$1.evaluate(SystemPropertiesInvariantRule.java:55)
	at com.carrotsearch.randomizedtesting.rules.NoShadowingOrOverridesOnMethodsRule$1.evaluate(NoShadowingOrOverridesOnMethodsRule.java:39)
	at com.carrotsearch.randomizedtesting.rules.NoShadowingOrOverridesOnMethodsRule$1.

[...truncated too long message...]

erToolArgumentParserTest.testArgsParserOk(MapReduceIndexerToolArgumentParserTest.java:210)
   [junit4]    > 	at java.lang.Thread.run(Thread.java:744)
   [junit4]   2> 17509 T10 oas.SolrTestCaseJ4.setUp ###Starting testArgsParserMultipleSpecsOfSameKind
   [junit4]   2> 18028 T10 oas.SolrTestCaseJ4.tearDown ###Ending testArgsParserMultipleSpecsOfSameKind
   [junit4]   2> NOTE: reproduce with: ant test  -Dtestcase=MapReduceIndexerToolArgumentParserTest -Dtests.method=testArgsParserMultipleSpecsOfSameKind -Dtests.seed=1D56BFB81BF60C35 -Dtests.slow=true -Dtests.locale=tr_TR -Dtests.timezone=Australia/Lord_Howe -Dtests.file.encoding=UTF-8
   [junit4] ERROR   0.54s | MapReduceIndexerToolArgumentParserTest.testArgsParserMultipleSpecsOfSameKind <<<
   [junit4]    > Throwable #1: java.lang.NoClassDefFoundError: Could not initialize class org.apache.hadoop.util.Shell
   [junit4]    > 	at __randomizedtesting.SeedInfo.seed([1D56BFB81BF60C35:42FDBB18E11B4568]:0)
   [junit4]    > 	at org.apache.hadoop.fs.RawLocalFileSystem$RawLocalFileStatus.loadPermissionInfo(RawLocalFileSystem.java:567)
   [junit4]    > 	at org.apache.hadoop.fs.RawLocalFileSystem$RawLocalFileStatus.getPermission(RawLocalFileSystem.java:542)
   [junit4]    > 	at org.apache.solr.hadoop.PathArgumentType.verifyCanWriteParent(PathArgumentType.java:199)
   [junit4]    > 	at org.apache.solr.hadoop.PathArgumentType.convert(PathArgumentType.java:148)
   [junit4]    > 	at org.apache.solr.hadoop.MapReduceIndexerTool$MyArgumentParser$2.convert(MapReduceIndexerTool.java:247)
   [junit4]    > 	at org.apache.solr.hadoop.MapReduceIndexerTool$MyArgumentParser$2.convert(MapReduceIndexerTool.java:244)
   [junit4]    > 	at net.sourceforge.argparse4j.internal.ArgumentImpl.convert(ArgumentImpl.java:255)
   [junit4]    > 	at net.sourceforge.argparse4j.internal.ArgumentParserImpl.processArg(ArgumentParserImpl.java:964)
   [junit4]    > 	at net.sourceforge.argparse4j.internal.ArgumentParserImpl.parseArgs(ArgumentParserImpl.java:824)
   [junit4]    > 	at net.sourceforge.argparse4j.internal.ArgumentParserImpl.parseArgs(ArgumentParserImpl.java:697)
   [junit4]    > 	at net.sourceforge.argparse4j.internal.ArgumentParserImpl.parseArgs(ArgumentParserImpl.java:591)
   [junit4]    > 	at net.sourceforge.argparse4j.internal.ArgumentParserImpl.parseArgs(ArgumentParserImpl.java:584)
   [junit4]    > 	at org.apache.solr.hadoop.MapReduceIndexerTool$MyArgumentParser.parseArgs(MapReduceIndexerTool.java:476)
   [junit4]    > 	at org.apache.solr.hadoop.MapReduceIndexerToolArgumentParserTest.testArgsParserMultipleSpecsOfSameKind(MapReduceIndexerToolArgumentParserTest.java:138)
   [junit4]    > 	at java.lang.Thread.run(Thread.java:744)
   [junit4]   2> 18034 T10 oas.SolrTestCaseJ4.deleteCore ###deleteCore
   [junit4]   2> NOTE: test params are: codec=Lucene3x, sim=DefaultSimilarity, locale=tr_TR, timezone=Australia/Lord_Howe
   [junit4]   2> NOTE: Mac OS X 10.8.5 x86_64/Oracle Corporation 1.8.0 (64-bit)/cpus=2,threads=1,free=31712672,total=51904512
   [junit4]   2> NOTE: All tests run in this JVM: [MapReduceIndexerToolArgumentParserTest]
   [junit4] Completed in 19.00s, 24 tests, 24 errors <<< FAILURES!

[...truncated 1 lines...]
   [junit4] Suite: org.apache.solr.hadoop.LineRandomizerMapperReducerTest
   [junit4] ERROR   0.56s | LineRandomizerMapperReducerTest.testMapReduce2Items <<<
   [junit4]    > Throwable #1: java.lang.NoClassDefFoundError: Could not initialize class org.apache.hadoop.util.Shell
   [junit4]    > 	at org.apache.hadoop.util.StringUtils.<clinit>(StringUtils.java:76)
   [junit4]    > 	at org.apache.hadoop.conf.Configuration.getStrings(Configuration.java:1514)
   [junit4]    > 	at org.apache.hadoop.io.serializer.SerializationFactory.<init>(SerializationFactory.java:58)
   [junit4]    > 	at org.apache.hadoop.mrunit.internal.io.Serialization.<init>(Serialization.java:37)
   [junit4]    > 	at org.apache.hadoop.mrunit.TestDriver.getSerialization(TestDriver.java:464)
   [junit4]    > 	at org.apache.hadoop.mrunit.TestDriver.copy(TestDriver.java:608)
   [junit4]    > 	at org.apache.hadoop.mrunit.TestDriver.copyPair(TestDriver.java:612)
   [junit4]    > 	at org.apache.hadoop.mrunit.MapReduceDriverBase.addInput(MapReduceDriverBase.java:70)
   [junit4]    > 	at org.apache.hadoop.mrunit.MapReduceDriverBase.addInput(MapReduceDriverBase.java:80)
   [junit4]    > 	at org.apache.hadoop.mrunit.MapReduceDriverBase.addAll(MapReduceDriverBase.java:91)
   [junit4]    > 	at org.apache.hadoop.mrunit.MapReduceDriverBase.withAll(MapReduceDriverBase.java:166)
   [junit4]    > 	at org.apache.solr.hadoop.LineRandomizerMapperReducerTest.testMapReduce2Items(LineRandomizerMapperReducerTest.java:51)
   [junit4] ERROR   0.06s | LineRandomizerMapperReducerTest.testMapReduce1Item <<<
   [junit4]    > Throwable #1: java.lang.NoClassDefFoundError: Could not initialize class org.apache.hadoop.util.StringUtils
   [junit4]    > 	at org.apache.hadoop.conf.Configuration.getStrings(Configuration.java:1514)
   [junit4]    > 	at org.apache.hadoop.io.serializer.SerializationFactory.<init>(SerializationFactory.java:58)
   [junit4]    > 	at org.apache.hadoop.mrunit.internal.io.Serialization.<init>(Serialization.java:37)
   [junit4]    > 	at org.apache.hadoop.mrunit.TestDriver.getSerialization(TestDriver.java:464)
   [junit4]    > 	at org.apache.hadoop.mrunit.TestDriver.copy(TestDriver.java:608)
   [junit4]    > 	at org.apache.hadoop.mrunit.TestDriver.copyPair(TestDriver.java:612)
   [junit4]    > 	at org.apache.hadoop.mrunit.MapReduceDriverBase.addInput(MapReduceDriverBase.java:70)
   [junit4]    > 	at org.apache.hadoop.mrunit.MapReduceDriverBase.withInput(MapReduceDriverBase.java:124)
   [junit4]    > 	at org.apache.solr.hadoop.LineRandomizerMapperReducerTest.testMapReduce1Item(LineRandomizerMapperReducerTest.java:44)
   [junit4] ERROR   0.05s | LineRandomizerMapperReducerTest.testMapReduce4Items <<<
   [junit4]    > Throwable #1: java.lang.NoClassDefFoundError: Could not initialize class org.apache.hadoop.util.StringUtils
   [junit4]    > 	at org.apache.hadoop.conf.Configuration.getStrings(Configuration.java:1514)
   [junit4]    > 	at org.apache.hadoop.io.serializer.SerializationFactory.<init>(SerializationFactory.java:58)
   [junit4]    > 	at org.apache.hadoop.mrunit.internal.io.Serialization.<init>(Serialization.java:37)
   [junit4]    > 	at org.apache.hadoop.mrunit.TestDriver.getSerialization(TestDriver.java:464)
   [junit4]    > 	at org.apache.hadoop.mrunit.TestDriver.copy(TestDriver.java:608)
   [junit4]    > 	at org.apache.hadoop.mrunit.TestDriver.copyPair(TestDriver.java:612)
   [junit4]    > 	at org.apache.hadoop.mrunit.MapReduceDriverBase.addInput(MapReduceDriverBase.java:70)
   [junit4]    > 	at org.apache.hadoop.mrunit.MapReduceDriverBase.addInput(MapReduceDriverBase.java:80)
   [junit4]    > 	at org.apache.hadoop.mrunit.MapReduceDriverBase.addAll(MapReduceDriverBase.java:91)
   [junit4]    > 	at org.apache.hadoop.mrunit.MapReduceDriverBase.withAll(MapReduceDriverBase.java:166)
   [junit4]    > 	at org.apache.solr.hadoop.LineRandomizerMapperReducerTest.testMapReduce4Items(LineRandomizerMapperReducerTest.java:79)
   [junit4] ERROR   0.05s | LineRandomizerMapperReducerTest.testMapReduce3Items <<<
   [junit4]    > Throwable #1: java.lang.NoClassDefFoundError: Could not initialize class org.apache.hadoop.util.StringUtils
   [junit4]    > 	at org.apache.hadoop.conf.Configuration.getStrings(Configuration.java:1514)
   [junit4]    > 	at org.apache.hadoop.io.serializer.SerializationFactory.<init>(SerializationFactory.java:58)
   [junit4]    > 	at org.apache.hadoop.mrunit.internal.io.Serialization.<init>(Serialization.java:37)
   [junit4]    > 	at org.apache.hadoop.mrunit.TestDriver.getSerialization(TestDriver.java:464)
   [junit4]    > 	at org.apache.hadoop.mrunit.TestDriver.copy(TestDriver.java:608)
   [junit4]    > 	at org.apache.hadoop.mrunit.TestDriver.copyPair(TestDriver.java:612)
   [junit4]    > 	at org.apache.hadoop.mrunit.MapReduceDriverBase.addInput(MapReduceDriverBase.java:70)
   [junit4]    > 	at org.apache.hadoop.mrunit.MapReduceDriverBase.addInput(MapReduceDriverBase.java:80)
   [junit4]    > 	at org.apache.hadoop.mrunit.MapReduceDriverBase.addAll(MapReduceDriverBase.java:91)
   [junit4]    > 	at org.apache.hadoop.mrunit.MapReduceDriverBase.withAll(MapReduceDriverBase.java:166)
   [junit4]    > 	at org.apache.solr.hadoop.LineRandomizerMapperReducerTest.testMapReduce3Items(LineRandomizerMapperReducerTest.java:64)
   [junit4] Completed in 0.76s, 4 tests, 4 errors <<< FAILURES!

[...truncated 33 lines...]
BUILD FAILED
/Users/jenkins/workspace/Lucene-Solr-4.x-MacOSX/build.xml:467: The following error occurred while executing this line:
/Users/jenkins/workspace/Lucene-Solr-4.x-MacOSX/build.xml:447: The following error occurred while executing this line:
/Users/jenkins/workspace/Lucene-Solr-4.x-MacOSX/build.xml:45: The following error occurred while executing this line:
/Users/jenkins/workspace/Lucene-Solr-4.x-MacOSX/extra-targets.xml:37: The following error occurred while executing this line:
/Users/jenkins/workspace/Lucene-Solr-4.x-MacOSX/solr/build.xml:209: The following error occurred while executing this line:
/Users/jenkins/workspace/Lucene-Solr-4.x-MacOSX/solr/common-build.xml:440: The following error occurred while executing this line:
/Users/jenkins/workspace/Lucene-Solr-4.x-MacOSX/solr/common-build.xml:496: The following error occurred while executing this line:
/Users/jenkins/workspace/Lucene-Solr-4.x-MacOSX/lucene/common-build.xml:1276: The following error occurred while executing this line:
/Users/jenkins/workspace/Lucene-Solr-4.x-MacOSX/lucene/common-build.xml:908: There were test failures: 7 suites, 35 tests, 28 errors, 6 ignored

Total time: 95 minutes 47 seconds
Build step 'Invoke Ant' marked build as failure
Description set: Java: 64bit/jdk1.8.0 -XX:-UseCompressedOops -XX:+UseParallelGC
Archiving artifacts
Recording test results
Email was triggered for: Failure
Sending email for trigger: Failure



Mime
View raw message