lucene-dev mailing list archives

Site index · List index
Message view « Date » · « Thread »
Top « Date » · « Thread »
From Policeman Jenkins Server <jenk...@thetaphi.de>
Subject [JENKINS] Lucene-Solr-4.x-MacOSX (64bit/jdk1.8.0) - Build # 1501 - Still Failing!
Date Mon, 28 Apr 2014 23:06:21 GMT
Build: http://jenkins.thetaphi.de/job/Lucene-Solr-4.x-MacOSX/1501/
Java: 64bit/jdk1.8.0 -XX:+UseCompressedOops -XX:+UseG1GC

1 tests failed.
REGRESSION:  org.apache.solr.core.TestNonNRTOpen.testReaderIsNotNRT

Error Message:
SOLR-5815? : wrong maxDoc: core=org.apache.solr.core.SolrCore@5f03737d searcher=Searcher@606c7a7b[collection1] main{StandardDirectoryReader(segments_8:16 _4(4.9):c1 _5(4.9):c1)} expected:<3> but was:<2>

Stack Trace:
java.lang.AssertionError: SOLR-5815? : wrong maxDoc: core=org.apache.solr.core.SolrCore@5f03737d searcher=Searcher@606c7a7b[collection1] main{StandardDirectoryReader(segments_8:16 _4(4.9):c1 _5(4.9):c1)} expected:<3> but was:<2>
	at __randomizedtesting.SeedInfo.seed([142A2837964C5631:A1AC49B0298DE4C5]:0)
	at org.junit.Assert.fail(Assert.java:93)
	at org.junit.Assert.failNotEquals(Assert.java:647)
	at org.junit.Assert.assertEquals(Assert.java:128)
	at org.junit.Assert.assertEquals(Assert.java:472)
	at org.apache.solr.core.TestNonNRTOpen.assertNotNRT(TestNonNRTOpen.java:142)
	at org.apache.solr.core.TestNonNRTOpen.testReaderIsNotNRT(TestNonNRTOpen.java:100)
	at sun.reflect.NativeMethodAccessorImpl.invoke0(Native Method)
	at sun.reflect.NativeMethodAccessorImpl.invoke(NativeMethodAccessorImpl.java:62)
	at sun.reflect.DelegatingMethodAccessorImpl.invoke(DelegatingMethodAccessorImpl.java:43)
	at java.lang.reflect.Method.invoke(Method.java:483)
	at com.carrotsearch.randomizedtesting.RandomizedRunner.invoke(RandomizedRunner.java:1618)
	at com.carrotsearch.randomizedtesting.RandomizedRunner$6.evaluate(RandomizedRunner.java:827)
	at com.carrotsearch.randomizedtesting.RandomizedRunner$7.evaluate(RandomizedRunner.java:863)
	at com.carrotsearch.randomizedtesting.RandomizedRunner$8.evaluate(RandomizedRunner.java:877)
	at com.carrotsearch.randomizedtesting.rules.SystemPropertiesRestoreRule$1.evaluate(SystemPropertiesRestoreRule.java:53)
	at org.apache.lucene.util.TestRuleSetupTeardownChained$1.evaluate(TestRuleSetupTeardownChained.java:50)
	at org.apache.lucene.util.TestRuleFieldCacheSanity$1.evaluate(TestRuleFieldCacheSanity.java:51)
	at org.apache.lucene.util.AbstractBeforeAfterRule$1.evaluate(AbstractBeforeAfterRule.java:46)
	at com.carrotsearch.randomizedtesting.rules.SystemPropertiesInvariantRule$1.evaluate(SystemPropertiesInvariantRule.java:55)
	at org.apache.lucene.util.TestRuleThreadAndTestName$1.evaluate(TestRuleThreadAndTestName.java:49)
	at org.apache.lucene.util.TestRuleIgnoreAfterMaxFailures$1.evaluate(TestRuleIgnoreAfterMaxFailures.java:65)
	at org.apache.lucene.util.TestRuleMarkFailure$1.evaluate(TestRuleMarkFailure.java:48)
	at com.carrotsearch.randomizedtesting.rules.StatementAdapter.evaluate(StatementAdapter.java:36)
	at com.carrotsearch.randomizedtesting.ThreadLeakControl$StatementRunner.run(ThreadLeakControl.java:360)
	at com.carrotsearch.randomizedtesting.ThreadLeakControl.forkTimeoutingTask(ThreadLeakControl.java:793)
	at com.carrotsearch.randomizedtesting.ThreadLeakControl$3.evaluate(ThreadLeakControl.java:453)
	at com.carrotsearch.randomizedtesting.RandomizedRunner.runSingleTest(RandomizedRunner.java:836)
	at com.carrotsearch.randomizedtesting.RandomizedRunner$3.evaluate(RandomizedRunner.java:738)
	at com.carrotsearch.randomizedtesting.RandomizedRunner$4.evaluate(RandomizedRunner.java:772)
	at com.carrotsearch.randomizedtesting.RandomizedRunner$5.evaluate(RandomizedRunner.java:783)
	at com.carrotsearch.randomizedtesting.rules.StatementAdapter.evaluate(StatementAdapter.java:36)
	at com.carrotsearch.randomizedtesting.rules.SystemPropertiesRestoreRule$1.evaluate(SystemPropertiesRestoreRule.java:53)
	at org.apache.lucene.util.AbstractBeforeAfterRule$1.evaluate(AbstractBeforeAfterRule.java:46)
	at org.apache.lucene.util.TestRuleStoreClassName$1.evaluate(TestRuleStoreClassName.java:42)
	at com.carrotsearch.randomizedtesting.rules.SystemPropertiesInvariantRule$1.evaluate(SystemPropertiesInvariantRule.java:55)
	at com.carrotsearch.randomizedtesting.rules.NoShadowingOrOverridesOnMethodsRule$1.evaluate(NoShadowingOrOverridesOnMethodsRule.java:39)
	at com.carrotsearch.randomizedtesting.rules.NoShadowingOrOverridesOnMethodsRule$1.evaluate(NoShadowingOrOverridesOnMethodsRule.java:39)
	at com.carrotsearch.randomizedtesting.rules.StatementAdapter.evaluate(StatementAdapter.java:36)
	at com.carrotsearch.randomizedtesting.rules.StatementAdapter.evaluate(StatementAdapter.java:36)
	at org.apache.lucene.util.TestRuleAssertionsRequired$1.evaluate(TestRuleAssertionsRequired.java:43)
	at org.apache.lucene.util.TestRuleMarkFailure$1.evaluate(TestRuleMarkFailure.java:48)
	at org.apache.lucene.util.TestRuleIgnoreAfterMaxFailures$1.evaluate(TestRuleIgnoreAfterMaxFailures.java:65)
	at org.apache.lucene.util.TestRuleIgnoreTestSuites$1.evaluate(TestRuleIgnoreTestSuites.java:55)
	at com.carrotsearch.randomizedtesting.rules.StatementAdapter.evaluate(StatementAdapter.java:36)
	at com.carrotsearch.randomizedtesting.ThreadLeakControl$StatementRunner.run(ThreadLeakControl.java:360)
	at java.lang.Thread.run(Thread.java:745)




Build Log:
[...truncated 11698 lines...]
   [junit4] Suite: org.apache.solr.core.TestNonNRTOpen
   [junit4]   2> Creating dataDir: /Users/jenkins/workspace/Lucene-Solr-4.x-MacOSX/solr/build/solr-core/test/J0/./solr.core.TestNonNRTOpen-142A2837964C5631-001/init-core-data-001
   [junit4]   2> 3066958 T12233 oas.SolrTestCaseJ4.buildSSLConfig Randomized ssl (true) and clientAuth (false)
   [junit4]   2> 3066960 T12233 oas.SolrTestCaseJ4.initCore ####initCore
   [junit4]   2> 3066960 T12233 oasc.SolrResourceLoader.<init> new SolrResourceLoader for directory: '/Users/jenkins/workspace/Lucene-Solr-4.x-MacOSX/solr/core/src/test-files/solr/collection1/'
   [junit4]   2> 3066961 T12233 oasc.SolrResourceLoader.replaceClassLoader Adding 'file:/Users/jenkins/workspace/Lucene-Solr-4.x-MacOSX/solr/core/src/test-files/solr/collection1/lib/.svn/' to classloader
   [junit4]   2> 3066962 T12233 oasc.SolrResourceLoader.replaceClassLoader Adding 'file:/Users/jenkins/workspace/Lucene-Solr-4.x-MacOSX/solr/core/src/test-files/solr/collection1/lib/classes/' to classloader
   [junit4]   2> 3066962 T12233 oasc.SolrResourceLoader.replaceClassLoader Adding 'file:/Users/jenkins/workspace/Lucene-Solr-4.x-MacOSX/solr/core/src/test-files/solr/collection1/lib/README' to classloader
   [junit4]   2> 3067057 T12233 oasc.SolrConfig.<init> Using Lucene MatchVersion: LUCENE_49
   [junit4]   2> 3067067 T12233 oasc.SolrConfig.<init> Loaded SolrConfig: solrconfig-basic.xml
   [junit4]   2> 3067069 T12233 oass.IndexSchema.readSchema Reading Solr Schema from schema-minimal.xml
   [junit4]   2> 3067074 T12233 oass.IndexSchema.readSchema [null] Schema name=minimal
   [junit4]   2> 3067081 T12233 oass.IndexSchema.readSchema WARN no uniqueKey specified in schema.
   [junit4]   2> 3067081 T12233 oasc.SolrResourceLoader.locateSolrHome JNDI not configured for solr (NoInitialContextEx)
   [junit4]   2> 3067082 T12233 oasc.SolrResourceLoader.locateSolrHome using system property solr.solr.home: /Users/jenkins/workspace/Lucene-Solr-4.x-MacOSX/solr/core/src/test-files/solr
   [junit4]   2> 3067082 T12233 oasc.SolrResourceLoader.<init> new SolrResourceLoader for directory: '/Users/jenkins/workspace/Lucene-Solr-4.x-MacOSX/solr/core/src/test-files/solr/'
   [junit4]   2> 3067145 T12233 oasc.CoreContainer.<init> New CoreContainer 774998359
   [junit4]   2> 3067146 T12233 oasc.CoreContainer.load Loading cores into CoreContainer [instanceDir=/Users/jenkins/workspace/Lucene-Solr-4.x-MacOSX/solr/core/src/test-files/solr/]
   [junit4]   2> 3067147 T12233 oashc.HttpShardHandlerFactory.getParameter Setting socketTimeout to: 0
   [junit4]   2> 3067147 T12233 oashc.HttpShardHandlerFactory.getParameter Setting urlScheme to: null
   [junit4]   2> 3067148 T12233 oashc.HttpShardHandlerFactory.getParameter Setting connTimeout to: 0
   [junit4]   2> 3067148 T12233 oashc.HttpShardHandlerFactory.getParameter Setting maxConnectionsPerHost to: 20
   [junit4]   2> 3067149 T12233 oashc.HttpShardHandlerFactory.getParameter Setting corePoolSize to: 0
   [junit4]   2> 3067149 T12233 oashc.HttpShardHandlerFactory.getParameter Setting maximumPoolSize to: 2147483647
   [junit4]   2> 3067149 T12233 oashc.HttpShardHandlerFactory.getParameter Setting maxThreadIdleTime to: 5
   [junit4]   2> 3067150 T12233 oashc.HttpShardHandlerFactory.getParameter Setting sizeOfQueue to: -1
   [junit4]   2> 3067150 T12233 oashc.HttpShardHandlerFactory.getParameter Setting fairnessPolicy to: false
   [junit4]   2> 3067158 T12233 oasl.LogWatcher.createWatcher SLF4J impl is org.slf4j.impl.Log4jLoggerFactory
   [junit4]   2> 3067158 T12233 oasl.LogWatcher.newRegisteredLogWatcher Registering Log Listener [Log4j (org.slf4j.impl.Log4jLoggerFactory)]
   [junit4]   2> 3067159 T12233 oasc.CoreContainer.load Host Name: 
   [junit4]   2> 3067163 T12234 oasc.SolrResourceLoader.<init> new SolrResourceLoader for directory: '/Users/jenkins/workspace/Lucene-Solr-4.x-MacOSX/solr/core/src/test-files/solr/collection1/'
   [junit4]   2> 3067165 T12234 oasc.SolrResourceLoader.replaceClassLoader Adding 'file:/Users/jenkins/workspace/Lucene-Solr-4.x-MacOSX/solr/core/src/test-files/solr/collection1/lib/.svn/' to classloader
   [junit4]   2> 3067165 T12234 oasc.SolrResourceLoader.replaceClassLoader Adding 'file:/Users/jenkins/workspace/Lucene-Solr-4.x-MacOSX/solr/core/src/test-files/solr/collection1/lib/classes/' to classloader
   [junit4]   2> 3067165 T12234 oasc.SolrResourceLoader.replaceClassLoader Adding 'file:/Users/jenkins/workspace/Lucene-Solr-4.x-MacOSX/solr/core/src/test-files/solr/collection1/lib/README' to classloader
   [junit4]   2> 3067226 T12234 oasc.SolrConfig.<init> Using Lucene MatchVersion: LUCENE_49
   [junit4]   2> 3067234 T12234 oasc.SolrConfig.<init> Loaded SolrConfig: solrconfig-basic.xml
   [junit4]   2> 3067236 T12234 oass.IndexSchema.readSchema Reading Solr Schema from schema-minimal.xml
   [junit4]   2> 3067239 T12234 oass.IndexSchema.readSchema [collection1] Schema name=minimal
   [junit4]   2> 3067276 T12234 oass.IndexSchema.readSchema WARN no uniqueKey specified in schema.
   [junit4]   2> 3067277 T12234 oasc.CoreContainer.create Creating SolrCore 'collection1' using configuration from instancedir /Users/jenkins/workspace/Lucene-Solr-4.x-MacOSX/solr/core/src/test-files/solr/collection1/
   [junit4]   2> 3067278 T12234 oasc.SolrCore.initDirectoryFactory solr.StandardDirectoryFactory
   [junit4]   2> 3067279 T12234 oasc.SolrCore.<init> [collection1] Opening new SolrCore at /Users/jenkins/workspace/Lucene-Solr-4.x-MacOSX/solr/core/src/test-files/solr/collection1/, dataDir=/Users/jenkins/workspace/Lucene-Solr-4.x-MacOSX/solr/build/solr-core/test/J0/./solr.core.TestNonNRTOpen-142A2837964C5631-001/init-core-data-001/
   [junit4]   2> 3067279 T12234 oasc.SolrCore.<init> JMX monitoring not detected for core: collection1
   [junit4]   2> 3067280 T12234 oasc.CachingDirectoryFactory.get return new directory for /Users/jenkins/workspace/Lucene-Solr-4.x-MacOSX/solr/build/solr-core/test/J0/solr.core.TestNonNRTOpen-142A2837964C5631-001/init-core-data-001
   [junit4]   2> 3067281 T12234 oasc.SolrCore.getNewIndexDir New index directory detected: old=null new=/Users/jenkins/workspace/Lucene-Solr-4.x-MacOSX/solr/build/solr-core/test/J0/./solr.core.TestNonNRTOpen-142A2837964C5631-001/init-core-data-001/index/
   [junit4]   2> 3067281 T12234 oasc.SolrCore.initIndex WARN [collection1] Solr index directory '/Users/jenkins/workspace/Lucene-Solr-4.x-MacOSX/solr/build/solr-core/test/J0/./solr.core.TestNonNRTOpen-142A2837964C5631-001/init-core-data-001/index' doesn't exist. Creating new index...
   [junit4]   2> 3067282 T12234 oasc.CachingDirectoryFactory.get return new directory for /Users/jenkins/workspace/Lucene-Solr-4.x-MacOSX/solr/build/solr-core/test/J0/solr.core.TestNonNRTOpen-142A2837964C5631-001/init-core-data-001/index
   [junit4]   2> 3067289 T12234 oasc.SolrDeletionPolicy.onCommit SolrDeletionPolicy.onCommit: commits: num=1
   [junit4]   2> 		commit{dir=/Users/jenkins/workspace/Lucene-Solr-4.x-MacOSX/solr/build/solr-core/test/J0/solr.core.TestNonNRTOpen-142A2837964C5631-001/init-core-data-001/index,segFN=segments_1,generation=1}
   [junit4]   2> 3067290 T12234 oasc.SolrDeletionPolicy.updateCommits newest commit generation = 1
   [junit4]   2> 3067292 T12234 oasc.SolrCore.loadUpdateProcessorChains no updateRequestProcessorChain defined as default, creating implicit default
   [junit4]   2> 3067292 T12234 oasc.RequestHandlers.initHandlersFromConfig created standard: solr.StandardRequestHandler
   [junit4]   2> 3067293 T12234 oasc.RequestHandlers.initHandlersFromConfig created /update: solr.UpdateRequestHandler
   [junit4]   2> 3067304 T12234 oashl.XMLLoader.init xsltCacheLifetimeSeconds=60
   [junit4]   2> 3067306 T12234 oasu.CommitTracker.<init> Hard AutoCommit: disabled
   [junit4]   2> 3067306 T12234 oasu.CommitTracker.<init> Soft AutoCommit: disabled
   [junit4]   2> 3067308 T12234 oass.SolrIndexSearcher.<init> Opening Searcher@4a8635f5[collection1] main
   [junit4]   2> 3067309 T12234 oasr.ManagedResourceStorage$FileStorageIO.configure File-based storage initialized to use dir: /Users/jenkins/workspace/Lucene-Solr-4.x-MacOSX/solr/core/src/test-files/solr/collection1/conf
   [junit4]   2> 3067309 T12234 oasr.RestManager.init Initializing RestManager with initArgs: {storageDir=/Users/jenkins/workspace/Lucene-Solr-4.x-MacOSX/solr/core/src/test-files/solr/collection1/conf/}
   [junit4]   2> 3067309 T12234 oasr.ManagedResourceStorage.load Reading _rest_managed.json using file:dir=/Users/jenkins/workspace/Lucene-Solr-4.x-MacOSX/solr/core/src/test-files/solr/collection1/conf
   [junit4]   2> 3067311 T12234 oasr.ManagedResource.reloadFromStorage WARN No stored data found for /rest/managed
   [junit4]   2> 3067311 T12234 oasr.ManagedResource.notifyObserversDuringInit WARN No registered observers for /rest/managed
   [junit4]   2> 3067312 T12234 oasr.RestManager.init Initializing 0 registered ManagedResources
   [junit4]   2> 3067313 T12235 oasc.SolrCore.registerSearcher [collection1] Registered new searcher Searcher@4a8635f5[collection1] main{StandardDirectoryReader(segments_1:1)}
   [junit4]   2> 3067313 T12234 oasc.CoreContainer.registerCore registering core: collection1
   [junit4]   2> 3067317 T12233 oas.SolrTestCaseJ4.initCore ####initCore end
   [junit4]   2> ASYNC  NEW_CORE C2170 name=collection1 org.apache.solr.core.SolrCore@76e924cd
   [junit4]   2> 3067323 T12233 C2170 oasc.SolrDeletionPolicy.onInit SolrDeletionPolicy.onInit: commits: num=1
   [junit4]   2> 		commit{dir=/Users/jenkins/workspace/Lucene-Solr-4.x-MacOSX/solr/build/solr-core/test/J0/solr.core.TestNonNRTOpen-142A2837964C5631-001/init-core-data-001/index,segFN=segments_1,generation=1}
   [junit4]   2> 3067323 T12233 C2170 oasc.SolrDeletionPolicy.updateCommits newest commit generation = 1
   [junit4]   2> 3067326 T12233 C2170 oasup.LogUpdateProcessor.finish [collection1] webapp=null path=null params={} {add=[(null)]} 0 8
   [junit4]   2> 3067331 T12233 C2170 oasu.DirectUpdateHandler2.commit start commit{,optimize=false,openSearcher=true,waitSearcher=true,expungeDeletes=false,softCommit=false,prepareCommit=false}
   [junit4]   2> 3067359 T12233 C2170 oasc.SolrDeletionPolicy.onCommit SolrDeletionPolicy.onCommit: commits: num=2
   [junit4]   2> 		commit{dir=/Users/jenkins/workspace/Lucene-Solr-4.x-MacOSX/solr/build/solr-core/test/J0/solr.core.TestNonNRTOpen-142A2837964C5631-001/init-core-data-001/index,segFN=segments_1,generation=1}
   [junit4]   2> 		commit{dir=/Users/jenkins/workspace/Lucene-Solr-4.x-MacOSX/solr/build/solr-core/test/J0/solr.core.TestNonNRTOpen-142A2837964C5631-001/init-core-data-001/index,segFN=segments_2,generation=2}
   [junit4]   2> 3067360 T12233 C2170 oasc.SolrDeletionPolicy.updateCommits newest commit generation = 2
   [junit4]   2> 3067368 T12233 C2170 oass.SolrIndexSearcher.<init> Opening Searcher@77942e74[collection1] main
   [junit4]   2> 3067369 T12233 C2170 oasu.DirectUpdateHandler2.commit end_commit_flush
   [junit4]   2> 3067369 T12235 oasc.SolrCore.registerSearcher [collection1] Registered new searcher Searcher@77942e74[collection1] main{StandardDirectoryReader(segments_2:3 _0(4.9):c1)}
   [junit4]   2> 3067371 T12233 C2170 oasup.LogUpdateProcessor.finish [collection1] webapp=null path=null params={} {commit=} 0 40
   [junit4]   2> 3067371 T12233 oas.SolrTestCaseJ4.deleteCore ###deleteCore
   [junit4]   2> 3067372 T12233 oasc.CoreContainer.shutdown Shutting down CoreContainer instance=774998359
   [junit4]   2> 3067372 T12233 oasc.SolrCore.close [collection1]  CLOSING SolrCore org.apache.solr.core.SolrCore@76e924cd
   [junit4]   2> 3067373 T12233 oasu.DirectUpdateHandler2.close closing DirectUpdateHandler2{commits=1,autocommits=0,soft autocommits=0,optimizes=0,rollbacks=0,expungeDeletes=0,docsPending=0,adds=0,deletesById=0,deletesByQuery=0,errors=0,cumulative_adds=1,cumulative_deletesById=0,cumulative_deletesByQuery=0,cumulative_errors=0}
   [junit4]   2> 3067373 T12233 oasu.SolrCoreState.decrefSolrCoreState Closing SolrCoreState
   [junit4]   2> 3067373 T12233 oasu.DefaultSolrCoreState.closeIndexWriter SolrCoreState ref count has reached 0 - closing IndexWriter
   [junit4]   2> 3067373 T12233 oasu.DefaultSolrCoreState.closeIndexWriter closing IndexWriter with IndexWriterCloser
   [junit4]   2> 3067374 T12233 oasc.SolrCore.closeSearcher [collection1] Closing main searcher on request.
   [junit4]   2> 3067375 T12233 oasc.CachingDirectoryFactory.close Closing StandardDirectoryFactory - 2 directories currently being tracked
   [junit4]   2> 3067375 T12233 oasc.CachingDirectoryFactory.closeCacheValue looking to close /Users/jenkins/workspace/Lucene-Solr-4.x-MacOSX/solr/build/solr-core/test/J0/solr.core.TestNonNRTOpen-142A2837964C5631-001/init-core-data-001/index [CachedDir<<refCount=0;path=/Users/jenkins/workspace/Lucene-Solr-4.x-MacOSX/solr/build/solr-core/test/J0/solr.core.TestNonNRTOpen-142A2837964C5631-001/init-core-data-001/index;done=false>>]
   [junit4]   2> 3067376 T12233 oasc.CachingDirectoryFactory.close Closing directory: /Users/jenkins/workspace/Lucene-Solr-4.x-MacOSX/solr/build/solr-core/test/J0/solr.core.TestNonNRTOpen-142A2837964C5631-001/init-core-data-001/index
   [junit4]   2> 3067376 T12233 oasc.CachingDirectoryFactory.closeCacheValue looking to close /Users/jenkins/workspace/Lucene-Solr-4.x-MacOSX/solr/build/solr-core/test/J0/solr.core.TestNonNRTOpen-142A2837964C5631-001/init-core-data-001 [CachedDir<<refCount=0;path=/Users/jenkins/workspace/Lucene-Solr-4.x-MacOSX/solr/build/solr-core/test/J0/solr.core.TestNonNRTOpen-142A2837964C5631-001/init-core-data-001;done=false>>]
   [junit4]   2> 3067377 T12233 oasc.CachingDirectoryFactory.close Closing directory: /Users/jenkins/workspace/Lucene-Solr-4.x-MacOSX/solr/build/solr-core/test/J0/solr.core.TestNonNRTOpen-142A2837964C5631-001/init-core-data-001
   [junit4]   2> 3067378 T12233 oas.SolrTestCaseJ4.initCore ####initCore
   [junit4]   2> 3067379 T12233 oasc.SolrResourceLoader.<init> new SolrResourceLoader for directory: '/Users/jenkins/workspace/Lucene-Solr-4.x-MacOSX/solr/core/src/test-files/solr/collection1/'
   [junit4]   2> 3067381 T12233 oasc.SolrResourceLoader.replaceClassLoader Adding 'file:/Users/jenkins/workspace/Lucene-Solr-4.x-MacOSX/solr/core/src/test-files/solr/collection1/lib/.svn/' to classloader
   [junit4]   2> 3067381 T12233 oasc.SolrResourceLoader.replaceClassLoader Adding 'file:/Users/jenkins/workspace/Lucene-Solr-4.x-MacOSX/solr/core/src/test-files/solr/collection1/lib/classes/' to classloader
   [junit4]   2> 3067382 T12233 oasc.SolrResourceLoader.replaceClassLoader Adding 'file:/Users/jenkins/workspace/Lucene-Solr-4.x-MacOSX/solr/core/src/test-files/solr/collection1/lib/README' to classloader
   [junit4]   2> 3067475 T12233 oasc.SolrConfig.<init> Using Lucene MatchVersion: LUCENE_49
   [junit4]   2> 3067482 T12233 oasc.SolrConfig.<init> Loaded SolrConfig: solrconfig-basic.xml
   [junit4]   2> 3067484 T12233 oass.IndexSchema.readSchema Reading Solr Schema from schema-minimal.xml
   [junit4]   2> 3067489 T12233 oass.IndexSchema.readSchema [null] Schema name=minimal
   [junit4]   2> 3067497 T12233 oass.IndexSchema.readSchema WARN no uniqueKey specified in schema.
   [junit4]   2> 3067498 T12233 oasc.SolrResourceLoader.locateSolrHome JNDI not configured for solr (NoInitialContextEx)
   [junit4]   2> 3067498 T12233 oasc.SolrResourceLoader.locateSolrHome using system property solr.solr.home: /Users/jenkins/workspace/Lucene-Solr-4.x-MacOSX/solr/core/src/test-files/solr
   [junit4]   2> 3067498 T12233 oasc.SolrResourceLoader.<init> new SolrResourceLoader for directory: '/Users/jenkins/workspace/Lucene-Solr-4.x-MacOSX/solr/core/src/test-files/solr/'
   [junit4]   2> 3067551 T12233 oasc.CoreContainer.<init> New CoreContainer 1708702172
   [junit4]   2> 3067552 T12233 oasc.CoreContainer.load Loading cores into CoreContainer [instanceDir=/Users/jenkins/workspace/Lucene-Solr-4.x-MacOSX/solr/core/src/test-files/solr/]
   [junit4]   2> 3067553 T12233 oashc.HttpShardHandlerFactory.getParameter Setting socketTimeout to: 0
   [junit4]   2> 3067554 T12233 oashc.HttpShardHandlerFactory.getParameter Setting urlScheme to: null
   [junit4]   2> 3067554 T12233 oashc.HttpShardHandlerFactory.getParameter Setting connTimeout to: 0
   [junit4]   2> 3067554 T12233 oashc.HttpShardHandlerFactory.getParameter Setting maxConnectionsPerHost to: 20
   [junit4]   2> 3067555 T12233 oashc.HttpShardHandlerFactory.getParameter Setting corePoolSize to: 0
   [junit4]   2> 3067555 T12233 oashc.HttpShardHandlerFactory.getParameter Setting maximumPoolSize to: 2147483647
   [junit4]   2> 3067555 T12233 oashc.HttpShardHandlerFactory.getParameter Setting maxThreadIdleTime to: 5
   [junit4]   2> 3067556 T12233 oashc.HttpShardHandlerFactory.getParameter Setting sizeOfQueue to: -1
   [junit4]   2> 3067556 T12233 oashc.HttpShardHandlerFactory.getParameter Setting fairnessPolicy to: false
   [junit4]   2> 3067560 T12233 oasl.LogWatcher.createWatcher SLF4J impl is org.slf4j.impl.Log4jLoggerFactory
   [junit4]   2> 3067561 T12233 oasl.LogWatcher.newRegisteredLogWatcher Registering Log Listener [Log4j (org.slf4j.impl.Log4jLoggerFactory)]
   [junit4]   2> 3067561 T12233 oasc.CoreContainer.load Host Name: 
   [junit4]   2> 3067567 T12237 oasc.SolrResourceLoader.<init> new SolrResourceLoader for directory: '/Users/jenkins/workspace/Lucene-Solr-4.x-MacOSX/solr/core/src/test-files/solr/collection1/'
   [junit4]   2> 3067569 T12237 oasc.SolrResourceLoader.replaceClassLoader Adding 'file:/Users/jenkins/workspace/Lucene-Solr-4.x-MacOSX/solr/core/src/test-files/solr/collection1/lib/.svn/' to classloader
   [junit4]   2> 3067569 T12237 oasc.SolrResourceLoader.replaceClassLoader Adding 'file:/Users/jenkins/workspace/Lucene-Solr-4.x-MacOSX/solr/core/src/test-files/solr/collection1/lib/classes/' to classloader
   [junit4]   2> 3067569 T12237 oasc.SolrResourceLoader.replaceClassLoader Adding 'file:/Users/jenkins/workspace/Lucene-Solr-4.x-MacOSX/solr/core/src/test-files/solr/collection1/lib/README' to classloader
   [junit4]   2> 3067620 T12237 oasc.SolrConfig.<init> Using Lucene MatchVersion: LUCENE_49
   [junit4]   2> 3067628 T12237 oasc.SolrConfig.<init> Loaded SolrConfig: solrconfig-basic.xml
   [junit4]   2> 3067629 T12237 oass.IndexSchema.readSchema Reading Solr Schema from schema-minimal.xml
   [junit4]   2> 3067632 T12237 oass.IndexSchema.readSchema [collection1] Schema name=minimal
   [junit4]   2> 3067635 T12237 oass.IndexSchema.readSchema WARN no uniqueKey specified in schema.
   [junit4]   2> 3067637 T12237 oasc.CoreContainer.create Creating SolrCore 'collection1' using configuration from instancedir /Users/jenkins/workspace/Lucene-Solr-4.x-MacOSX/solr/core/src/test-files/solr/collection1/
   [junit4]   2> 3067637 T12237 oasc.SolrCore.initDirectoryFactory solr.StandardDirectoryFactory
   [junit4]   2> 3067638 T12237 oasc.SolrCore.<init> [collection1] Opening new SolrCore at /Users/jenkins/workspace/Lucene-Solr-4.x-MacOSX/solr/core/src/test-files/solr/collection1/, dataDir=/Users/jenkins/workspace/Lucene-Solr-4.x-MacOSX/solr/build/solr-core/test/J0/./solr.core.TestNonNRTOpen-142A2837964C5631-001/init-core-data-001/
   [junit4]   2> 3067639 T12237 oasc.SolrCore.<init> JMX monitoring not detected for core: collection1
   [junit4]   2> 3067639 T12237 oasc.CachingDirectoryFactory.get return new directory for /Users/jenkins/workspace/Lucene-Solr-4.x-MacOSX/solr/build/solr-core/test/J0/solr.core.TestNonNRTOpen-142A2837964C5631-001/init-core-data-001
   [junit4]   2> 3067640 T12237 oasc.SolrCore.getNewIndexDir New index directory detected: old=null new=/Users/jenkins/workspace/Lucene-Solr-4.x-MacOSX/solr/build/solr-core/test/J0/./solr.core.TestNonNRTOpen-142A2837964C5631-001/init-core-data-001/index/
   [junit4]   2> 3067642 T12237 oasc.SolrCore.loadUpdateProcessorChains no updateRequestProcessorChain defined as default, creating implicit default
   [junit4]   2> 3067643 T12237 oasc.RequestHandlers.initHandlersFromConfig created standard: solr.StandardRequestHandler
   [junit4]   2> 3067644 T12237 oasc.RequestHandlers.initHandlersFromConfig created /update: solr.UpdateRequestHandler
   [junit4]   2> 3067652 T12237 oashl.XMLLoader.init xsltCacheLifetimeSeconds=60
   [junit4]   2> 3067654 T12237 oasu.CommitTracker.<init> Hard AutoCommit: disabled
   [junit4]   2> 3067654 T12237 oasu.CommitTracker.<init> Soft AutoCommit: disabled
   [junit4]   2> 3067655 T12237 oasc.CachingDirectoryFactory.get return new directory for /Users/jenkins/workspace/Lucene-Solr-4.x-MacOSX/solr/build/solr-core/test/J0/solr.core.TestNonNRTOpen-142A2837964C5631-001/init-core-data-001/index
   [junit4]   2> 3067657 T12237 oass.SolrIndexSearcher.<init> Opening Searcher@7f26da20[collection1] main
   [junit4]   2> 3067657 T12237 oasr.ManagedResourceStorage$FileStorageIO.configure File-based storage initialized to use dir: /Users/jenkins/workspace/Lucene-Solr-4.x-MacOSX/solr/core/src/test-files/solr/collection1/conf
   [junit4]   2> 3067658 T12237 oasr.RestManager.init Initializing RestManager with initArgs: {storageDir=/Users/jenkins/workspace/Lucene-Solr-4.x-MacOSX/solr/core/src/test-files/solr/collection1/conf/}
   [junit4]   2> 3067658 T12237 oasr.ManagedResourceStorage.load Reading _rest_managed.json using file:dir=/Users/jenkins/workspace/Lucene-Solr-4.x-MacOSX/solr/core/src/test-files/solr/collection1/conf
   [junit4]   2> 3067659 T12237 oasr.ManagedResource.reloadFromStorage WARN No stored data found for /rest/managed
   [junit4]   2> 3067659 T12237 oasr.ManagedResource.notifyObserversDuringInit WARN No registered observers for /rest/managed
   [junit4]   2> 3067659 T12237 oasr.RestManager.init Initializing 0 registered ManagedResources
   [junit4]   2> 3067660 T12237 oasc.CoreContainer.registerCore registering core: collection1
   [junit4]   2> 3067661 T12238 oasc.SolrCore.registerSearcher [collection1] Registered new searcher Searcher@7f26da20[collection1] main{StandardDirectoryReader(segments_2:3 _0(4.9):c1)}
   [junit4]   2> 3067664 T12233 oas.SolrTestCaseJ4.initCore ####initCore end
   [junit4]   2> 3067666 T12233 oasc.TestNonNRTOpen.assertNotNRT Checking notNRT & maxDoc=1 of core=org.apache.solr.core.SolrCore@58f48670
   [junit4]   2> 3067674 T12233 oas.SolrTestCaseJ4.setUp ###Starting testSharedCores
   [junit4]   2> ASYNC  NEW_CORE C2171 name=collection1 org.apache.solr.core.SolrCore@58f48670
   [junit4]   2> 3067675 T12233 C2171 oasu.DirectUpdateHandler2.deleteAll [collection1] REMOVING ALL DOCUMENTS FROM INDEX
   [junit4]   2> 3067681 T12233 C2171 oasc.SolrDeletionPolicy.onInit SolrDeletionPolicy.onInit: commits: num=1
   [junit4]   2> 		commit{dir=/Users/jenkins/workspace/Lucene-Solr-4.x-MacOSX/solr/build/solr-core/test/J0/solr.core.TestNonNRTOpen-142A2837964C5631-001/init-core-data-001/index,segFN=segments_2,generation=2}
   [junit4]   2> 3067682 T12233 C2171 oasc.SolrDeletionPolicy.updateCommits newest commit generation = 2
   [junit4]   2> 3067683 T12233 C2171 oasup.LogUpdateProcessor.finish [collection1] webapp=null path=null params={} {deleteByQuery=*:*} 0 9
   [junit4]   2> 3067688 T12233 C2171 oasup.LogUpdateProcessor.finish [collection1] webapp=null path=null params={} {add=[(null)]} 0 4
   [junit4]   2> 3067689 T12233 C2171 oasu.DirectUpdateHandler2.commit start commit{,optimize=false,openSearcher=true,waitSearcher=true,expungeDeletes=false,softCommit=false,prepareCommit=false}
   [junit4]   2> 3067716 T12233 C2171 oasc.SolrDeletionPolicy.onCommit SolrDeletionPolicy.onCommit: commits: num=2
   [junit4]   2> 		commit{dir=/Users/jenkins/workspace/Lucene-Solr-4.x-MacOSX/solr/build/solr-core/test/J0/solr.core.TestNonNRTOpen-142A2837964C5631-001/init-core-data-001/index,segFN=segments_2,generation=2}
   [junit4]   2> 		commit{dir=/Users/jenkins/workspace/Lucene-Solr-4.x-MacOSX/solr/build/solr-core/test/J0/solr.core.TestNonNRTOpen-142A2837964C5631-001/init-core-data-001/index,segFN=segments_3,generation=3}
   [junit4]   2> 3067717 T12233 C2171 oasc.SolrDeletionPolicy.updateCommits newest commit generation = 3
   [junit4]   2> 3067726 T12233 C2171 oass.SolrIndexSearcher.<init> Opening Searcher@37843443[collection1] main
   [junit4]   2> 3067728 T12233 C2171 oasu.DirectUpdateHandler2.commit end_commit_flush
   [junit4]   2> 3067728 T12238 oasc.SolrCore.registerSearcher [collection1] Registered new searcher Searcher@37843443[collection1] main{StandardDirectoryReader(segments_3:6 _1(4.9):c1)}
   [junit4]   2> 3067730 T12233 C2171 oasup.LogUpdateProcessor.finish [collection1] webapp=null path=null params={} {commit=} 0 41
   [junit4]   2> 3067731 T12233 C2171 oasu.DirectUpdateHandler2.commit start commit{,optimize=true,openSearcher=true,waitSearcher=true,expungeDeletes=false,softCommit=false,prepareCommit=false}
   [junit4]   2> 3067731 T12233 C2171 oasu.DirectUpdateHandler2.commit No uncommitted changes. Skipping IW.commit.
   [junit4]   2> 3067733 T12233 C2171 oasc.SolrCore.openNewSearcher SolrIndexSearcher has not changed - not re-opening: org.apache.solr.search.SolrIndexSearcher
   [junit4]   2> 3067733 T12233 C2171 oasu.DirectUpdateHandler2.commit end_commit_flush
   [junit4]   2> 3067734 T12233 C2171 oasup.LogUpdateProcessor.finish [collection1] webapp=null path=null params={} {optimize=} 0 3
   [junit4]   2> 3067738 T12233 C2171 oasup.LogUpdateProcessor.finish [collection1] webapp=null path=null params={} {add=[(null)]} 0 2
   [junit4]   2> 3067740 T12233 C2171 oasu.DirectUpdateHandler2.commit start commit{,optimize=false,openSearcher=true,waitSearcher=true,expungeDeletes=false,softCommit=false,prepareCommit=false}
   [junit4]   2> 3067776 T12233 C2171 oasc.SolrDeletionPolicy.onCommit SolrDeletionPolicy.onCommit: commits: num=2
   [junit4]   2> 		commit{dir=/Users/jenkins/workspace/Lucene-Solr-4.x-MacOSX/solr/build/solr-core/test/J0/solr.core.TestNonNRTOpen-142A2837964C5631-001/init-core-data-001/index,segFN=segments_3,generation=3}
   [junit4]   2> 		commit{dir=/Users/jenkins/workspace/Lucene-Solr-4.x-MacOSX/solr/build/solr-core/test/J0/solr.core.TestNonNRTOpen-142A2837964C5631-001/init-core-data-001/index,segFN=segments_4,generation=4}
   [junit4]   2> 3067776 T12233 C2171 oasc.SolrDeletionPolicy.updateCommits newest commit generation = 4
   [junit4]   2> 3067787 T12233 C2171 oass.SolrIndexSearcher.<init> Opening Searcher@139ed5e4[collection1] main
   [junit4]   2> 3067788 T12233 C2171 oasu.DirectUpdateHandler2.commit end_commit_flush
   [junit4]   2> 3067788 T12238 oasc.SolrCore.registerSearcher [collection1] Registered new searcher Searcher@139ed5e4[collection1] main{StandardDirectoryReader(segments_4:8 _1(4.9):c1 _2(4.9):c1)}
   [junit4]   2> 3067789 T12233 C2171 oasup.LogUpdateProcessor.finish [collection1] webapp=null path=null params={} {commit=} 0 49
   [junit4]   2> 3067793 T12233 C2171 oasup.LogUpdateProcessor.finish [collection1] webapp=null path=null params={} {add=[(null)]} 0 3
   [junit4]   2> 3067794 T12233 C2171 oasup.LogUpdateProcessor.finish [collection1] webapp=null path=null params={} {add=[(null)]} 0 0
   [junit4]   2> 3067795 T12233 C2171 oasu.DirectUpdateHandler2.commit start commit{,optimize=false,openSearcher=true,waitSearcher=true,expungeDeletes=false,softCommit=false,prepareCommit=false}
   [junit4]   2> 3067827 T12233 C2171 oasc.SolrDeletionPolicy.onCommit SolrDeletionPolicy.onCommit: commits: num=2
   [junit4]   2> 		commit{dir=/Users/jenkins/workspace/Lucene-Solr-4.x-MacOSX/solr/build/solr-core/test/J0/solr.core.TestNonNRTOpen-142A2837964C5631-001/init-core-data-001/index,segFN=segments_4,generation=4}
   [junit4]   2> 		commit{dir=/Users/jenkins/workspace/Lucene-Solr-4.x-MacOSX/solr/build/solr-core/test/J0/solr.core.TestNonNRTOpen-142A2837964C5631-001/init-core-data-001/index,segFN=segments_5,generation=5}
   [junit4]   2> 3067827 T12233 C2171 oasc.SolrDeletionPolicy.updateCommits newest commit generation = 5
   [junit4]   2> 3067837 T12233 C2171 oass.SolrIndexSearcher.<init> Opening Searcher@2ed1e87c[collection1] main
   [junit4]   2> 3067838 T12233 C2171 oasu.DirectUpdateHandler2.commit end_commit_flush
   [junit4]   2> 3067838 T12238 oasc.SolrCore.registerSearcher [collection1] Registered new searcher Searcher@2ed1e87c[collection1] main{StandardDirectoryReader(segments_5:10 _1(4.9):c1 _2(4.9):c1 _3(4.9):c2)}
   [junit4]   2> 3067840 T12233 C2171 oasup.LogUpdateProcessor.finish [collection1] webapp=null path=null params={} {commit=} 0 45
   [junit4]   2> 3067841 T12233 C2171 oasup.LogUpdateProcessor.finish [collection1] webapp=null path=null params={} {deleteByQuery=foo2:doc} 0 0
   [junit4]   2> 3067842 T12233 C2171 oasu.DirectUpdateHandler2.commit start commit{,optimize=false,openSearcher=true,waitSearcher=true,expungeDeletes=false,softCommit=false,prepareCommit=false}
   [junit4]   2> 3067854 T12233 C2171 oasc.SolrDeletionPolicy.onCommit SolrDeletionPolicy.onCommit: commits: num=2
   [junit4]   2> 		commit{dir=/Users/jenkins/workspace/Lucene-Solr-4.x-MacOSX/solr/build/solr-core/test/J0/solr.core.TestNonNRTOpen-142A2837964C5631-001/init-core-data-001/index,segFN=segments_5,generation=5}
   [junit4]   2> 		commit{dir=/Users/jenkins/workspace/Lucene-Solr-4.x-MacOSX/solr/build/solr-core/test/J0/solr.core.TestNonNRTOpen-142A2837964C5631-001/init-core-data-001/index,segFN=segments_6,generation=6}
   [junit4]   2> 3067855 T12233 C2171 oasc.SolrDeletionPolicy.updateCommits newest commit generation = 6
   [junit4]   2> 3067864 T12233 C2171 oass.SolrIndexSearcher.<init> Opening Searcher@3adabd58[collection1] main
   [junit4]   2> 3067865 T12233 C2171 oasu.DirectUpdateHandler2.commit end_commit_flush
   [junit4]   2> 3067865 T12238 oasc.SolrCore.registerSearcher [collection1] Registered new searcher Searcher@3adabd58[collection1] main{StandardDirectoryReader(segments_6:11 _1(4.9):c1 _2(4.9):c1 _3(4.9):c2/1:delGen=1)}
   [junit4]   2> 3067866 T12233 C2171 oasup.LogUpdateProcessor.finish [collection1] webapp=null path=null params={} {commit=} 0 24
   [junit4]   2> 3067868 T12233 oas.SolrTestCaseJ4.tearDown ###Ending testSharedCores
   [junit4]   2> 3067875 T12233 oas.SolrTestCaseJ4.setUp ###Starting testReaderIsNotNRT
   [junit4]   2> 3067875 T12233 C2171 oasu.DirectUpdateHandler2.deleteAll [collection1] REMOVING ALL DOCUMENTS FROM INDEX
   [junit4]   2> 3067876 T12233 C2171 oasup.LogUpdateProcessor.finish [collection1] webapp=null path=null params={} {deleteByQuery=*:*} 0 1
   [junit4]   2> 3067880 T12233 C2171 oasup.LogUpdateProcessor.finish [collection1] webapp=null path=null params={} {add=[(null)]} 0 2
   [junit4]   2> 3067881 T12233 C2171 oasu.DirectUpdateHandler2.commit start commit{,optimize=false,openSearcher=true,waitSearcher=true,expungeDeletes=false,softCommit=false,prepareCommit=false}
   [junit4]   2> 3067907 T12233 C2171 oasc.SolrDeletionPolicy.onCommit SolrDeletionPolicy.onCommit: commits: num=2
   [junit4]   2> 		commit{dir=/Users/jenkins/workspace/Lucene-Solr-4.x-MacOSX/solr/build/solr-core/test/J0/solr.core.TestNonNRTOpen-142A2837964C5631-001/init-core-data-001/index,segFN=segments_6,generation=6}
   [junit4]   2> 		commit{dir=/Users/jenkins/workspace/Lucene-Solr-4.x-MacOSX/solr/build/solr-core/test/J0/solr.core.TestNonNRTOpen-142A2837964C5631-001/init-core-data-001/index,segFN=segments_7,generation=7}
   [junit4]   2> 3067908 T12233 C2171 oasc.SolrDeletionPolicy.updateCommits newest commit generation = 7
   [junit4]   2> 3067921 T12233 C2171 oass.SolrIndexSearcher.<init> Opening Searcher@4a51073a[collection1] main
   [junit4]   2> 3067922 T12233 C2171 oasu.DirectUpdateHandler2.commit end_commit_flush
   [junit4]   2> 3067922 T12238 oasc.SolrCore.registerSearcher [collection1] Registered new searcher Searcher@4a51073a[collection1] main{StandardDirectoryReader(segments_7:14 _4(4.9):c1)}
   [junit4]   2> 3067924 T12233 C2171 oasup.LogUpdateProcessor.finish [collection1] webapp=null path=null params={} {commit=} 0 43
   [junit4]   2> 3067925 T12233 oasc.TestNonNRTOpen.assertNotNRT Checking notNRT & maxDoc=1 of core=org.apache.solr.core.SolrCore@58f48670
   [junit4]   2> 3067926 T12233 oasc.TestNonNRTOpen.testReaderIsNotNRT Reloading core: org.apache.solr.core.SolrCore@58f48670
   [junit4]   2> 3067926 T12233 oasc.SolrResourceLoader.<init> new SolrResourceLoader for directory: '/Users/jenkins/workspace/Lucene-Solr-4.x-MacOSX/solr/core/src/test-files/solr/collection1/'
   [junit4]   2> 3067927 T12233 oasc.SolrResourceLoader.replaceClassLoader Adding 'file:/Users/jenkins/workspace/Lucene-Solr-4.x-MacOSX/solr/core/src/test-files/solr/collection1/lib/.svn/' to classloader
   [junit4]   2> 3067928 T12233 oasc.SolrResourceLoader.replaceClassLoader Adding 'file:/Users/jenkins/workspace/Lucene-Solr-4.x-MacOSX/solr/core/src/test-files/solr/collection1/lib/classes/' to classloader
   [junit4]   2> 3067928 T12233 oasc.SolrResourceLoader.replaceClassLoader Adding 'file:/Users/jenkins/workspace/Lucene-Solr-4.x-MacOSX/solr/core/src/test-files/solr/collection1/lib/README' to classloader
   [junit4]   2> 3068009 T12233 oasc.SolrConfig.<init> Using Lucene MatchVersion: LUCENE_49
   [junit4]   2> 3068017 T12233 oasc.SolrConfig.<init> Loaded SolrConfig: solrconfig-basic.xml
   [junit4]   2> 3068018 T12233 oass.IndexSchema.readSchema Reading Solr Schema from schema-minimal.xml
   [junit4]   2> 3068022 T12233 oass.IndexSchema.readSchema [collection1] Schema name=minimal
   [junit4]   2> 3068027 T12233 oass.IndexSchema.readSchema WARN no uniqueKey specified in schema.
   [junit4]   2> 3068030 T12233 oasc.CoreContainer.reload Reloading SolrCore 'collection1' using configuration from instancedir /Users/jenkins/workspace/Lucene-Solr-4.x-MacOSX/solr/core/src/test-files/solr/collection1/
   [junit4]   2> 3068030 T12233 oasc.SolrCore.<init> [collection1] Opening new SolrCore at /Users/jenkins/workspace/Lucene-Solr-4.x-MacOSX/solr/core/src/test-files/solr/collection1/, dataDir=/Users/jenkins/workspace/Lucene-Solr-4.x-MacOSX/solr/build/solr-core/test/J0/./solr.core.TestNonNRTOpen-142A2837964C5631-001/init-core-data-001/
   [junit4]   2> 3068031 T12233 oasc.SolrCore.<init> JMX monitoring not detected for core: collection1
   [junit4]   2> 3068031 T12233 oasc.SolrCore.getNewIndexDir New index directory detected: old=null new=/Users/jenkins/workspace/Lucene-Solr-4.x-MacOSX/solr/build/solr-core/test/J0/./solr.core.TestNonNRTOpen-142A2837964C5631-001/init-core-data-001/index/
   [junit4]   2> 3068034 T12233 oasc.SolrCore.loadUpdateProcessorChains no updateRequestProcessorChain defined as default, creating implicit default
   [junit4]   2> 3068035 T12233 oasc.RequestHandlers.initHandlersFromConfig created standard: solr.StandardRequestHandler
   [junit4]   2> 3068036 T12233 oasc.RequestHandlers.initHandlersFromConfig created /update: solr.UpdateRequestHandler
   [junit4]   2> 3068042 T12233 oashl.XMLLoader.init xsltCacheLifetimeSeconds=60
   [junit4]   2> 3068044 T12233 oasu.CommitTracker.<init> Hard AutoCommit: disabled
   [junit4]   2> 3068044 T12233 oasu.CommitTracker.<init> Soft AutoCommit: disabled
   [junit4]   2> 3068047 T12233 oass.SolrIndexSearcher.<init> Opening Searcher@1388cbb8[collection1] main
   [junit4]   2> 3068047 T12233 oasr.ManagedResourceStorage$FileStorageIO.configure File-based storage initialized to use dir: /Users/jenkins/workspace/Lucene-Solr-4.x-MacOSX/solr/core/src/test-files/solr/collection1/conf
   [junit4]   2> 3068048 T12233 oasr.RestManager.init Initializing RestManager with initArgs: {storageDir=/Users/jenkins/workspace/Lucene-Solr-4.x-MacOSX/solr/core/src/test-files/solr/collection1/conf/}
   [junit4]   2> 3068048 T12233 oasr.ManagedResourceStorage.load Reading _rest_managed.json using file:dir=/Users/jenkins/workspace/Lucene-Solr-4.x-MacOSX/solr/core/src/test-files/solr/collection1/conf
   [junit4]   2> 3068049 T12233 oasr.ManagedResource.reloadFromStorage WARN No stored data found for /rest/managed
   [junit4]   2> 3068049 T12233 oasr.ManagedResource.notifyObserversDuringInit WARN No registered observers for /rest/managed
   [junit4]   2> 3068049 T12233 oasr.RestManager.init Initializing 0 registered ManagedResources
   [junit4]   2> 3068050 T12233 oasu.DefaultSolrCoreState.newIndexWriter Creating new IndexWriter...
   [junit4]   2> 3068051 T12233 oasu.DefaultSolrCoreState.newIndexWriter Waiting until IndexWriter is unused... core=collection1
   [junit4]   2> 3068051 T12233 oasu.DefaultSolrCoreState.closeIndexWriter Closing old IndexWriter... core=collection1
   [junit4]   2> 3068050 T12240 oasc.SolrCore.registerSearcher [collection1] Registered new searcher Searcher@1388cbb8[collection1] main{StandardDirectoryReader(segments_7:14 _4(4.9):c1)}
   [junit4]   2> 3068055 T12233 oasc.SolrDeletionPolicy.onInit SolrDeletionPolicy.onInit: commits: num=1
   [junit4]   2> 		commit{dir=/Users/jenkins/workspace/Lucene-Solr-4.x-MacOSX/solr/build/solr-core/test/J0/solr.core.TestNonNRTOpen-142A2837964C5631-001/init-core-data-001/index,segFN=segments_7,generation=7}
   [junit4]   2> 3068055 T12233 oasc.SolrDeletionPolicy.updateCommits newest commit generation = 7
   [junit4]   2> 3068056 T12233 oasu.DefaultSolrCoreState.newIndexWriter New IndexWriter is ready to be used.
   [junit4]   2> 3068057 T12233 oasc.SolrCore.openNewSearcher SolrIndexSearcher has not changed - not re-opening: org.apache.solr.search.SolrIndexSearcher
   [junit4]   2> 3068057 T12233 oasc.CoreContainer.registerCore replacing core: collection1
   [junit4]   2> 3068058 T12233 oasc.SolrCore.close [collection1]  CLOSING SolrCore org.apache.solr.core.SolrCore@58f48670
   [junit4]   2> 3068058 T12233 oasu.DirectUpdateHandler2.close closing DirectUpdateHandler2{commits=5,autocommits=0,soft autocommits=0,optimizes=1,rollbacks=0,expungeDeletes=0,docsPending=0,adds=0,deletesById=0,deletesByQuery=0,errors=0,cumulative_adds=5,cumulative_deletesById=0,cumulative_deletesByQuery=3,cumulative_errors=0}
   [junit4]   2> 3068059 T12233 oasc.SolrCore.closeSearcher [collection1] Closing main searcher on request.
   [junit4]   2> 3068059 T12233 oasc.TestNonNRTOpen.assertNotNRT Checking notNRT & maxDoc=1 of core=org.apache.solr.core.SolrCore@6a744607
   [junit4]   2> ASYNC  NEW_CORE C2172 name=collection1 org.apache.solr.core.SolrCore@6a744607
   [junit4]   2> 3068061 T12233 C2172 oasup.LogUpdateProcessor.finish [collection1] webapp=null path=null params={} {add=[(null)]} 0 1
   [junit4]   2> 3068062 T12233 C2172 oasu.DirectUpdateHandler2.commit start commit{,optimize=false,openSearcher=true,waitSearcher=true,expungeDeletes=false,softCommit=false,prepareCommit=false}
   [junit4]   2> 3068090 T12233 C2172 oasc.SolrDeletionPolicy.onCommit SolrDeletionPolicy.onCommit: commits: num=2
   [junit4]   2> 		commit{dir=/Users/jenkins/workspace/Lucene-Solr-4.x-MacOSX/solr/build/solr-core/test/J0/solr.core.TestNonNRTOpen-142A2837964C5631-001/init-core-data-001/index,segFN=segments_7,generation=7}
   [junit4]   2> 		commit{dir=/Users/jenkins/workspace/Lucene-Solr-4.x-MacOSX/solr/build/solr-core/test/J0/solr.core.TestNonNRTOpen-142A2837964C5631-001/init-core-data-001/index,segFN=segments_8,generation=8}
   [junit4]   2> 3068091 T12233 C2172 oasc.SolrDeletionPolicy.updateCommits newest commit generation = 8
   [junit4]   2> 3068100 T12233 C2172 oass.SolrIndexSearcher.<init> Opening Searcher@38b34cba[collection1] main
   [junit4]   2> 3068101 T12233 C2172 oasu.DirectUpdateHandler2.commit end_commit_flush
   [junit4]   2> 3068101 T12240 oasc.SolrCore.registerSearcher [collection1] Registered new searcher Searcher@38b34cba[collection1] main{StandardDirectoryReader(segments_8:16 _4(4.9):c1 _5(4.9):c1)}
   [junit4]   2> 3068103 T12233 C2172 oasup.LogUpdateProcessor.finish [collection1] webapp=null path=null params={} {commit=} 0 42
   [junit4]   2> 3068103 T12233 oasc.TestNonNRTOpen.assertNotNRT Checking notNRT & maxDoc=2 of core=org.apache.solr.core.SolrCore@6a744607
   [junit4]   2> 3068105 T12233 C2172 oasup.LogUpdateProcessor.finish [collection1] webapp=null path=null params={} {add=[(null)]} 0 1
   [junit4]   2> 3068106 T12233 oasc.TestNonNRTOpen.testReaderIsNotNRT Reloading core: org.apache.solr.core.SolrCore@6a744607
   [junit4]   2> 3068106 T12233 oasc.SolrResourceLoader.<init> new SolrResourceLoader for directory: '/Users/jenkins/workspace/Lucene-Solr-4.x-MacOSX/solr/core/src/test-files/solr/collection1/'
   [junit4]   2> 3068107 T12233 oasc.SolrResourceLoader.replaceClassLoader Adding 'file:/Users/jenkins/workspace/Lucene-Solr-4.x-MacOSX/solr/core/src/test-files/solr/collection1/lib/.svn/' to classloader
   [junit4]   2> 3068108 T12233 oasc.SolrResourceLoader.replaceClassLoader Adding 'file:/Users/jenkins/workspace/Lucene-Solr-4.x-MacOSX/solr/core/src/test-files/solr/collection1/lib/classes/' to classloader
   [junit4]   2> 3068108 T12233 oasc.SolrResourceLoader.replaceClassLoader Adding 'file:/Users/jenkins/workspace/Lucene-Solr-4.x-MacOSX/solr/core/src/test-files/solr/collection1/lib/README' to classloader
   [junit4]   2> 3068185 T12233 oasc.SolrConfig.<init> Using Lucene MatchVersion: LUCENE_49
   [junit4]   2> 3068192 T12233 oasc.SolrConfig.<init> Loaded SolrConfig: solrconfig-basic.xml
   [junit4]   2> 3068194 T12233 oass.IndexSchema.readSchema Reading Solr Schema from schema-minimal.xml
   [junit4]   2> 3068197 T12233 oass.IndexSchema.readSchema [collection1] Schema name=minimal
   [junit4]   2> 3068202 T12233 oass.IndexSchema.readSchema WARN no uniqueKey specified in schema.
   [junit4]   2> 3068203 T12233 oasc.CoreContainer.reload Reloading SolrCore 'collection1' using configuration from instancedir /Users/jenkins/workspace/Lucene-Solr-4.x-MacOSX/solr/core/src/test-files/solr/collection1/
   [junit4]   2> 3068204 T12233 oasc.SolrCore.<init> [collection1] Opening new SolrCore at /Users/jenkins/workspace/Lucene-Solr-4.x-MacOSX/solr/core/src/test-files/solr/collection1/, dataDir=/Users/jenkins/workspace/Lucene-Solr-4.x-MacOSX/solr/build/solr-core/test/J0/./solr.core.TestNonNRTOpen-142A2837964C5631-001/init-core-data-001/
   [junit4]   2> 3068205 T12233 oasc.SolrCore.<init> JMX monitoring not detected for core: collection1
   [junit4]   2> 3068206 T12233 oasc.SolrCore.getNewIndexDir New index directory detected: old=null new=/Users/jenkins/workspace/Lucene-Solr-4.x-MacOSX/solr/build/solr-core/test/J0/./solr.core.TestNonNRTOpen-142A2837964C5631-001/init-core-data-001/index/
   [junit4]   2> 3068209 T12233 oasc.SolrCore.loadUpdateProcessorChains no updateRequestProcessorChain defined as default, creating implicit default
   [junit4]   2> 3068210 T12233 oasc.RequestHandlers.initHandlersFromConfig created standard: solr.StandardRequestHandler
   [junit4]   2> 3068210 T12233 oasc.RequestHandlers.initHandlersFromConfig created /update: solr.UpdateRequestHandler
   [junit4]   2> 3068221 T12233 oashl.XMLLoader.init xsltCacheLifetimeSeconds=60
   [junit4]   2> 3068223 T12233 oasu.CommitTracker.<init> Hard AutoCommit: disabled
   [junit4]   2> 3068224 T12233 oasu.CommitTracker.<init> Soft AutoCommit: disabled
   [junit4]   2> 3068227 T12233 oass.SolrIndexSearcher.<init> Opening Searcher@606c7a7b[collection1] main
   [junit4]   2> 3068228 T12233 oasr.ManagedResourceStorage$FileStorageIO.configure File-based storage initialized to use dir: /Users/jenkins/workspace/Lucene-Solr-4.x-MacOSX/solr/core/src/test-files/solr/collection1/conf
   [junit4]   2> 3068228 T12233 oasr.RestManager.init Initializing RestManager with initArgs: {storageDir=/Users/jenkins/workspace/Lucene-Solr-4.x-MacOSX/solr/core/src/test-files/solr/collection1/conf/}
   [junit4]   2> 3068229 T12233 oasr.ManagedResourceStorage.load Reading _rest_managed.json using file:dir=/Users/jenkins/workspace/Lucene-Solr-4.x-MacOSX/solr/core/src/test-files/solr/collection1/conf
   [junit4]   2> 3068229 T12233 oasr.ManagedResource.reloadFromStorage WARN No stored data found for /rest/managed
   [junit4]   2> 3068230 T12233 oasr.ManagedResource.notifyObserversDuringInit WARN No registered observers for /rest/managed
   [junit4]   2> 3068231 T12233 oasr.RestManager.init Initializing 0 registered ManagedResources
   [junit4]   2> 3068231 T12233 oasu.DefaultSolrCoreState.newIndexWriter Creating new IndexWriter...
   [junit4]   2> 3068232 T12233 oasu.DefaultSolrCoreState.newIndexWriter Waiting until IndexWriter is unused... core=collection1
   [junit4]   2> 3068233 T12233 oasu.DefaultSolrCoreState.closeIndexWriter Closing old IndexWriter... core=collection1
   [junit4]   2> 3068234 T12241 oasc.SolrCore.registerSearcher [collection1] Registered new searcher Searcher@606c7a7b[collection1] main{StandardDirectoryReader(segments_8:16 _4(4.9):c1 _5(4.9):c1)}
   [junit4]   2> 3068265 T12233 oasc.SolrDeletionPolicy.onCommit SolrDeletionPolicy.onCommit: commits: num=2
   [junit4]   2> 		commit{dir=/Users/jenkins/workspace/Lucene-Solr-4.x-MacOSX/solr/build/solr-core/test/J0/solr.core.TestNonNRTOpen-142A2837964C5631-001/init-core-data-001/index,segFN=segments_8,generation=8}
   [junit4]   2> 		commit{dir=/Users/jenkins/workspace/Lucene-Solr-4.x-MacOSX/solr/build/solr-core/test/J0/solr.core.TestNonNRTOpen-142A2837964C5631-001/init-core-data-001/index,segFN=segments_9,generation=9}
   [junit4]   2> 3068265 T12233 oasc.SolrDeletionPolicy.updateCommits newest commit generation = 9
   [junit4]   2> 3068275 T12233 oasc.SolrDeletionPolicy.onInit SolrDeletionPolicy.onInit: commits: num=1
   [junit4]   2> 		commit{dir=/Users/jenkins/workspace/Lucene-Solr-4.x-MacOSX/solr/build/solr-core/test/J0/solr.core.TestNonNRTOpen-142A2837964C5631-001/init-core-data-001/index,segFN=segments_9,generation=9}
   [junit4]   2> 3068275 T12233 oasc.SolrDeletionPolicy.updateCommits newest commit generation = 9
   [junit4]   2> 3068277 T12233 oasu.DefaultSolrCoreState.newIndexWriter New IndexWriter is ready to be used.
   [junit4]   2> 3068284 T12233 oass.SolrIndexSearcher.<init> Opening Searcher@5719ff99[collection1] main
   [junit4]   2> 3068284 T12233 oasc.CoreContainer.registerCore replacing core: collection1
   [junit4]   2> 3068284 T12233 oasc.SolrCore.close [collection1]  CLOSING SolrCore org.apache.solr.core.SolrCore@6a744607
   [junit4]   2> 3068284 T12233 oasu.DirectUpdateHandler2.close closing DirectUpdateHandler2{commits=1,autocommits=0,soft autocommits=0,optimizes=0,rollbacks=0,expungeDeletes=0,docsPending=1,adds=1,deletesById=0,deletesByQuery=0,errors=0,cumulative_adds=2,cumulative_deletesById=0,cumulative_deletesByQuery=0,cumulative_errors=0}
   [junit4]   2> 3068286 T12233 oasc.SolrCore.closeSearcher [collection1] Closing main searcher on request.
   [junit4]   2> 3068286 T12233 oasc.TestNonNRTOpen.assertNotNRT Checking notNRT & maxDoc=3 of core=org.apache.solr.core.SolrCore@5f03737d
   [junit4]   2> 3068287 T12233 oas.SolrTestCaseJ4.tearDown ###Ending testReaderIsNotNRT
   [junit4]   2> 3068289 T12241 oasc.SolrCore.registerSearcher [collection1] Registered new searcher Searcher@5719ff99[collection1] main{StandardDirectoryReader(segments_9:18 _4(4.9):c1 _5(4.9):c1 _6(4.9):c1)}
   [junit4]   2> NOTE: reproduce with: ant test  -Dtestcase=TestNonNRTOpen -Dtests.method=testReaderIsNotNRT -Dtests.seed=142A2837964C5631 -Dtests.slow=true -Dtests.locale=sr_ME -Dtests.timezone=Europe/Athens -Dtests.file.encoding=US-ASCII
   [junit4] FAILURE 0.43s | TestNonNRTOpen.testReaderIsNotNRT <<<
   [junit4]    > Throwable #1: java.lang.AssertionError: SOLR-5815? : wrong maxDoc: core=org.apache.solr.core.SolrCore@5f03737d searcher=Searcher@606c7a7b[collection1] main{StandardDirectoryReader(segments_8:16 _4(4.9):c1 _5(4.9):c1)} expected:<3> but was:<2>
   [junit4]    > 	at __randomizedtesting.SeedInfo.seed([142A2837964C5631:A1AC49B0298DE4C5]:0)
   [junit4]    > 	at org.apache.solr.core.TestNonNRTOpen.assertNotNRT(TestNonNRTOpen.java:142)
   [junit4]    > 	at org.apache.solr.core.TestNonNRTOpen.testReaderIsNotNRT(TestNonNRTOpen.java:100)
   [junit4]    > 	at java.lang.Thread.run(Thread.java:745)
   [junit4]   2> 3068300 T12233 oas.SolrTestCaseJ4.deleteCore ###deleteCore
   [junit4]   2> 3068300 T12233 oasc.CoreContainer.shutdown Shutting down CoreContainer instance=1708702172
   [junit4]   2> 3068303 T12233 oasc.SolrCore.close [collection1]  CLOSING SolrCore org.apache.solr.core.SolrCore@5f03737d
   [junit4]   2> 3068303 T12233 oasu.DirectUpdateHandler2.close closing DirectUpdateHandler2{commits=0,autocommits=0,soft autocommits=0,optimizes=0,rollbacks=0,expungeDeletes=0,docsPending=0,adds=0,deletesById=0,deletesByQuery=0,errors=0,cumulative_adds=0,cumulative_deletesById=0,cumulative_deletesByQuery=0,cumulative_errors=0}
   [junit4]   2> 3068304 T12233 oasu.SolrCoreState.decrefSolrCoreState Closing SolrCoreState
   [junit4]   2> 3068304 T12233 oasu.DefaultSolrCoreState.closeIndexWriter SolrCoreState ref count has reached 0 - closing IndexWriter
   [junit4]   2> 3068304 T12233 oasu.DefaultSolrCoreState.closeIndexWriter closing IndexWriter with IndexWriterCloser
   [junit4]   2> 3068305 T12233 oasc.SolrCore.closeSearcher [collection1] Closing main searcher on request.
   [junit4]   2> 3068307 T12233 oasc.CachingDirectoryFactory.close Closing StandardDirectoryFactory - 2 directories currently being tracked
   [junit4]   2> 3068307 T12233 oasc.CachingDirectoryFactory.closeCacheValue looking to close /Users/jenkins/workspace/Lucene-Solr-4.x-MacOSX/solr/build/solr-core/test/J0/solr.core.TestNonNRTOpen-142A2837964C5631-001/init-core-data-001 [CachedDir<<refCount=0;path=/Users/jenkins/workspace/Lucene-Solr-4.x-MacOSX/solr/build/solr-core/test/J0/solr.core.TestNonNRTOpen-142A2837964C5631-001/init-core-data-001;done=false>>]
   [junit4]   2> 3068307 T12233 oasc.CachingDirectoryFactory.close Closing directory: /Users/jenkins/workspace/Lucene-Solr-4.x-MacOSX/solr/build/solr-core/test/J0/solr.core.TestNonNRTOpen-142A2837964C5631-001/init-core-data-001
   [junit4]   2> 3068307 T12233 oasc.CachingDirectoryFactory.closeCacheValue looking to close /Users/jenkins/workspace/Lucene-Solr-4.x-MacOSX/solr/build/solr-core/test/J0/solr.core.TestNonNRTOpen-142A2837964C5631-001/init-core-data-001/index [CachedDir<<refCount=0;path=/Users/jenkins/workspace/Lucene-Solr-4.x-MacOSX/solr/build/solr-core/test/J0/solr.core.TestNonNRTOpen-142A2837964C5631-001/init-core-data-001/index;done=false>>]
   [junit4]   2> 3068308 T12233 oasc.CachingDirectoryFactory.close Closing directory: /Users/jenkins/workspace/Lucene-Solr-4.x-MacOSX/solr/build/solr-core/test/J0/solr.core.TestNonNRTOpen-142A2837964C5631-001/init-core-data-001/index
   [junit4]   2> NOTE: leaving temporary files on disk at: /Users/jenkins/workspace/Lucene-Solr-4.x-MacOSX/solr/build/solr-core/test/J0/./solr.core.TestNonNRTOpen-142A2837964C5631-001
   [junit4]   2> NOTE: test params are: codec=Lucene40, sim=RandomSimilarityProvider(queryNorm=false,coord=no): {}, locale=sr_ME, timezone=Europe/Athens
   [junit4]   2> NOTE: Mac OS X 10.8.5 x86_64/Oracle Corporation 1.8.0_05 (64-bit)/cpus=2,threads=1,free=141734488,total=536870912
   [junit4]   2> NOTE: All tests run in this JVM: [TestSolrQueryParserResource, RequestHandlersTest, TestPartialUpdateDeduplication, TestBM25SimilarityFactory, DocumentAnalysisRequestHandlerTest, ChaosMonkeyNothingIsSafeTest, TestQuerySenderListener, PeerSyncTest, EnumFieldTest, TestSerializedLuceneMatchVersion, TestAnalyzedSuggestions, SolrCoreCheckLockOnStartupTest, TestFiltering, BasicZkTest, FileUtilsTest, TestExpandComponent, HighlighterConfigTest, ResourceLoaderTest, TestWordDelimiterFilterFactory, TestRequestStatusCollectionAPI, TestFastLRUCache, ScriptEngineTest, TestRemoteStreaming, TestReload, TestCloudManagedSchema, DeleteShardTest, ClusterStateUpdateTest, TestCodecSupport, TestSolrXmlPersistor, MBeansHandlerTest, TestExceedMaxTermLength, TestRandomMergePolicy, FieldMutatingUpdateProcessorTest, DistributedQueryElevationComponentTest, UnloadDistributedZkTest, LoggingHandlerTest, TestSchemaVersionResource, SolrCoreTest, ChaosMonkeySafeLeaderTest, TermVectorComponentDistributedTest, QueryElevationComponentTest, SynonymTokenizerTest, TestRestManager, TestNonDefinedSimilarityFactory, AnalysisErrorHandlingTest, CursorMarkTest, TestDocBasedVersionConstraints, TestInfoStreamLogging, TestSolrDeletionPolicy2, ZkSolrClientTest, TestStressReorder, TestLazyCores, TestCollationKeyRangeQueries, BadComponentTest, BinaryUpdateRequestHandlerTest, SolrCmdDistributorTest, PingRequestHandlerTest, DistribCursorPagingTest, SyncSliceTest, SolrRequestParserTest, RecoveryZkTest, HighlighterTest, TestSolr4Spatial, OverseerRolesTest, TestConfigSets, SliceStateUpdateTest, TestSolrQueryParser, ZkControllerTest, TestFileDictionaryLookup, TestSolrXmlPersistence, TestXIncludeConfig, TestHashPartitioner, SolrTestCaseJ4Test, TestStressUserVersions, TestLFUCache, TestStressRecovery, TestFieldTypeCollectionResource, TestNRTOpen, DisMaxRequestHandlerTest, TestDynamicFieldResource, PolyFieldTest, LeaderElectionIntegrationTest, TestAtomicUpdateErrorCases, TestCloudManagedSchemaAddField, AliasIntegrationTest, TestCollapseQParserPlugin, StatelessScriptUpdateProcessorFactoryTest, HdfsRecoveryZkTest, HdfsLockFactoryTest, DirectSolrConnectionTest, IndexSchemaTest, OverseerCollectionProcessorTest, ResponseLogComponentTest, InfoHandlerTest, StandardRequestHandlerTest, TestJoin, TestReloadAndDeleteDocs, TestMiniSolrCloudCluster, SignatureUpdateProcessorFactoryTest, TestSolrXml, HdfsUnloadDistributedZkTest, TestPhraseSuggestions, StatsComponentTest, TestFieldCollectionResource, CircularListTest, TestSolrQueryParserDefaultOperatorResource, SpellingQueryConverterTest, TestSurroundQueryParser, AssignTest, TestFieldSortValues, CachingDirectoryFactoryTest, TestManagedResource, CurrencyFieldOpenExchangeTest, TestUtils, TestSchemaResource, DateMathParserTest, EchoParamsTest, ZkCLITest, SpellPossibilityIteratorTest, TestCollectionAPI, CoreMergeIndexesAdminHandlerTest, SimpleFacetsTest, HdfsBasicDistributedZkTest, TestNumberUtils, ShardRoutingTest, TestCloudInspectUtil, IndexBasedSpellCheckerTest, MigrateRouteKeyTest, TestQueryTypes, QueryResultKeyTest, TestGroupingSearch, QueryEqualityTest, ShardRoutingCustomTest, TestCustomSort, FieldAnalysisRequestHandlerTest, TestBadConfig, TestSearchPerf, HdfsSyncSliceTest, TestClassNameShortening, RegexBoostProcessorTest, ZkNodePropsTest, TestWriterPerf, HdfsCollectionsAPIDistributedZkTest, TestPseudoReturnFields, TestNoOpRegenerator, TestFastWriter, CursorPagingTest, AlternateDirectoryTest, TestStressVersions, DebugComponentTest, WordBreakSolrSpellCheckerTest, TestSimpleQParserPlugin, TestAnalyzeInfixSuggestions, DistribDocExpirationUpdateProcessorTest, HardAutoCommitTest, AutoCommitTest, DocExpirationUpdateProcessorFactoryTest, IndexSchemaRuntimeFieldTest, JsonLoaderTest, TestJmxMonitoredMap, BJQParserTest, TestIBSimilarityFactory, PrimUtilsTest, HdfsDirectoryTest, TestBinaryField, TestRTGBase, TestCSVResponseWriter, ExternalFileFieldSortTest, OpenCloseCoreStressTest, TestBlendedInfixSuggestions, TestShortCircuitedRequests, UniqFieldsUpdateProcessorFactoryTest, SpellCheckComponentTest, DocValuesMissingTest, TestDocumentBuilder, CoreAdminCreateDiscoverTest, TestManagedStopFilterFactory, SpatialFilterTest, AddSchemaFieldsUpdateProcessorFactoryTest, TermVectorComponentTest, TestCollationField, PreAnalyzedUpdateProcessorTest, TestSuggestSpellingConverter, TestInitQParser, TestZkChroot, TestDFRSimilarityFactory, BasicDistributedZkTest, BasicDistributedZk2Test, CollectionsAPIDistributedZkTest, OverseerTest, FullSolrCloudDistribCmdsTest, TestReplicationHandler, TestRandomFaceting, LeaderElectionTest, TestRandomDVFaceting, TestDistributedSearch, TestDistributedGrouping, TestFaceting, TestRecovery, DistributedSpellCheckComponentTest, TestRealTimeGet, TestMultiCoreConfBootstrap, DistributedTermsComponentTest, TestRangeQuery, TestCoreContainer, BadIndexSchemaTest, ConvertedLegacyTest, TestSort, TestFunctionQuery, BasicFunctionalityTest, DirectUpdateHandlerTest, TestIndexSearcher, SoftAutoCommitTest, ShowFileRequestHandlerTest, CurrencyFieldXmlFileTest, SolrIndexSplitterTest, SimplePostToolTest, TestCoreDiscovery, AnalysisAfterCoreReloadTest, TestExtendedDismaxParser, SpellCheckCollatorTest, SuggesterFSTTest, CoreAdminHandlerTest, TestFoldingMultitermQuery, DocValuesTest, SuggesterTSTTest, SuggesterTest, TestStressLucene, TestTrie, SuggesterWFSTTest, TestCSVLoader, NoCacheHeaderTest, SchemaVersionSpecificBehaviorTest, TestUpdate, DirectUpdateHandlerOptimizeTest, DefaultValueUpdateProcessorTest, SortByFunctionTest, DocValuesMultiTest, DistanceFunctionTest, TestSolrDeletionPolicy1, SolrInfoMBeanTest, XsltUpdateRequestHandlerTest, CacheHeaderTest, LukeRequestHandlerTest, TestQueryUtils, DirectSolrSpellCheckerTest, TestReversedWildcardFilterFactory, PrimitiveFieldTypeTest, TestOmitPositions, FileBasedSpellCheckerTest, TermsComponentTest, XmlUpdateRequestHandlerTest, DocumentBuilderTest, TestValueSourceCache, PathHierarchyTokenizerFactoryTest, TestIndexingPerformance, MoreLikeThisHandlerTest, RequiredFieldsTest, TestArbitraryIndexDir, FastVectorHighlighterTest, SolrPluginUtilsTest, TestJmxIntegration, ReturnFieldsTest, UpdateRequestProcessorFactoryTest, JSONWriterTest, QueryParsingTest, TestPHPSerializedResponseWriter, CSVRequestHandlerTest, TestComponentsName, SearchHandlerTest, CoreContainerCoreInitFailuresTest, TestBinaryResponseWriter, SOLR749Test, UpdateParamsTest, TestSolrIndexConfig, TestQuerySenderNoQuery, CopyFieldTest, SolrIndexConfigTest, TestMergePolicyConfig, MultiTermTest, SampleTest, TestDocSet, NumericFieldsTest, MinimalSchemaTest, TestElisionMultitermQuery, TestConfig, OutputWriterTest, TestFuzzyAnalyzedSuggestions, TestSolrCoreProperties, TestPostingsSolrHighlighter, NotRequiredUniqueKeyTest, TestLuceneMatchVersion, TestCharFilters, TestSweetSpotSimilarityFactory, TestPerFieldSimilarity, TestLMDirichletSimilarityFactory, TestLMJelinekMercerSimilarityFactory, TestDefaultSimilarityFactory, LegacyHTMLStripCharFilterTest, TimeZoneUtilsTest, TestFastOutputStream, OpenExchangeRatesOrgProviderTest, URLClassifyProcessorTest, PluginInfoTest, TestSolrXMLSerializer, PreAnalyzedFieldTest, TestSystemIdResolver, DateFieldTest, DOMUtilTest, RAMDirectoryFactoryTest, ClusterStateTest, TestSolrJ, TestLRUCache, SliceStateTest, SystemInfoHandlerTest, UUIDFieldTest, TestCursorMarkWithoutUniqueKey, TestDistributedMissingSort, TestHighlightDedupGrouping, AsyncMigrateRouteKeyTest, CollectionsAPIAsyncDistributedZkTest, ConnectionManagerTest, CustomCollectionTest, DeleteInactiveReplicaTest, DeleteReplicaTest, OverseerStatusTest, RemoteQueryErrorTest, SSLMigrationTest, ShardSplitTest, SolrXmlInZkTest, TestDistribDocBasedVersion, TriLevelCompositeIdRoutingTest, HdfsBasicDistributedZk2Test, HdfsChaosMonkeySafeLeaderTest, HdfsWriteToMultipleCollectionsTest, StressHdfsTest, TestImplicitCoreProperties, TestNonNRTOpen]
   [junit4] Completed in 1.39s, 2 tests, 1 failure <<< FAILURES!

[...truncated 120 lines...]
BUILD FAILED
/Users/jenkins/workspace/Lucene-Solr-4.x-MacOSX/build.xml:467: The following error occurred while executing this line:
/Users/jenkins/workspace/Lucene-Solr-4.x-MacOSX/build.xml:447: The following error occurred while executing this line:
/Users/jenkins/workspace/Lucene-Solr-4.x-MacOSX/build.xml:45: The following error occurred while executing this line:
/Users/jenkins/workspace/Lucene-Solr-4.x-MacOSX/extra-targets.xml:37: The following error occurred while executing this line:
/Users/jenkins/workspace/Lucene-Solr-4.x-MacOSX/solr/build.xml:189: The following error occurred while executing this line:
/Users/jenkins/workspace/Lucene-Solr-4.x-MacOSX/solr/common-build.xml:496: The following error occurred while executing this line:
/Users/jenkins/workspace/Lucene-Solr-4.x-MacOSX/lucene/common-build.xml:1297: The following error occurred while executing this line:
/Users/jenkins/workspace/Lucene-Solr-4.x-MacOSX/lucene/common-build.xml:921: There were test failures: 389 suites, 1626 tests, 1 failure, 42 ignored (15 assumptions)

Total time: 88 minutes 47 seconds
Build step 'Invoke Ant' marked build as failure
Description set: Java: 64bit/jdk1.8.0 -XX:+UseCompressedOops -XX:+UseG1GC
Archiving artifacts
Recording test results
Email was triggered for: Failure
Sending email for trigger: Failure



Mime
View raw message