lucene-dev mailing list archives

Site index · List index
Message view « Date » · « Thread »
Top « Date » · « Thread »
From Policeman Jenkins Server <jenk...@thetaphi.de>
Subject [JENKINS] Lucene-Solr-4.8-Linux (64bit/jdk1.8.0) - Build # 15 - Failure!
Date Wed, 16 Apr 2014 07:17:50 GMT
Build: http://jenkins.thetaphi.de/job/Lucene-Solr-4.8-Linux/15/
Java: 64bit/jdk1.8.0 -XX:+UseCompressedOops -XX:+UseParallelGC

2 tests failed.
REGRESSION:  org.apache.solr.cloud.CustomCollectionTest.testDistribSearch

Error Message:
collection already exists: implicitcollwithShardField

Stack Trace:
org.apache.solr.client.solrj.impl.HttpSolrServer$RemoteSolrException: collection already exists: implicitcollwithShardField
	at __randomizedtesting.SeedInfo.seed([374283E7D66D1D8E:B6A40DFFA1327DB2]:0)
	at org.apache.solr.client.solrj.impl.HttpSolrServer.executeMethod(HttpSolrServer.java:554)
	at org.apache.solr.client.solrj.impl.HttpSolrServer.request(HttpSolrServer.java:210)
	at org.apache.solr.client.solrj.impl.HttpSolrServer.request(HttpSolrServer.java:206)
	at org.apache.solr.client.solrj.impl.LBHttpSolrServer.doRequest(LBHttpSolrServer.java:340)
	at org.apache.solr.client.solrj.impl.LBHttpSolrServer.request(LBHttpSolrServer.java:301)
	at org.apache.solr.client.solrj.impl.CloudSolrServer.request(CloudSolrServer.java:636)
	at org.apache.solr.cloud.AbstractFullDistribZkTestBase.createCollection(AbstractFullDistribZkTestBase.java:1661)
	at org.apache.solr.cloud.AbstractFullDistribZkTestBase.createCollection(AbstractFullDistribZkTestBase.java:1615)
	at org.apache.solr.cloud.CustomCollectionTest.testCustomCollectionsAPI(CustomCollectionTest.java:314)
	at org.apache.solr.cloud.CustomCollectionTest.doTest(CustomCollectionTest.java:127)
	at org.apache.solr.BaseDistributedSearchTestCase.testDistribSearch(BaseDistributedSearchTestCase.java:865)
	at sun.reflect.NativeMethodAccessorImpl.invoke0(Native Method)
	at sun.reflect.NativeMethodAccessorImpl.invoke(NativeMethodAccessorImpl.java:62)
	at sun.reflect.DelegatingMethodAccessorImpl.invoke(DelegatingMethodAccessorImpl.java:43)
	at java.lang.reflect.Method.invoke(Method.java:483)
	at com.carrotsearch.randomizedtesting.RandomizedRunner.invoke(RandomizedRunner.java:1618)
	at com.carrotsearch.randomizedtesting.RandomizedRunner$6.evaluate(RandomizedRunner.java:827)
	at com.carrotsearch.randomizedtesting.RandomizedRunner$7.evaluate(RandomizedRunner.java:863)
	at com.carrotsearch.randomizedtesting.RandomizedRunner$8.evaluate(RandomizedRunner.java:877)
	at com.carrotsearch.randomizedtesting.rules.SystemPropertiesRestoreRule$1.evaluate(SystemPropertiesRestoreRule.java:53)
	at org.apache.lucene.util.TestRuleSetupTeardownChained$1.evaluate(TestRuleSetupTeardownChained.java:50)
	at org.apache.lucene.util.TestRuleFieldCacheSanity$1.evaluate(TestRuleFieldCacheSanity.java:51)
	at org.apache.lucene.util.AbstractBeforeAfterRule$1.evaluate(AbstractBeforeAfterRule.java:46)
	at com.carrotsearch.randomizedtesting.rules.SystemPropertiesInvariantRule$1.evaluate(SystemPropertiesInvariantRule.java:55)
	at org.apache.lucene.util.TestRuleThreadAndTestName$1.evaluate(TestRuleThreadAndTestName.java:49)
	at org.apache.lucene.util.TestRuleIgnoreAfterMaxFailures$1.evaluate(TestRuleIgnoreAfterMaxFailures.java:65)
	at org.apache.lucene.util.TestRuleMarkFailure$1.evaluate(TestRuleMarkFailure.java:48)
	at com.carrotsearch.randomizedtesting.rules.StatementAdapter.evaluate(StatementAdapter.java:36)
	at com.carrotsearch.randomizedtesting.ThreadLeakControl$StatementRunner.run(ThreadLeakControl.java:360)
	at com.carrotsearch.randomizedtesting.ThreadLeakControl.forkTimeoutingTask(ThreadLeakControl.java:793)
	at com.carrotsearch.randomizedtesting.ThreadLeakControl$3.evaluate(ThreadLeakControl.java:453)
	at com.carrotsearch.randomizedtesting.RandomizedRunner.runSingleTest(RandomizedRunner.java:836)
	at com.carrotsearch.randomizedtesting.RandomizedRunner$3.evaluate(RandomizedRunner.java:738)
	at com.carrotsearch.randomizedtesting.RandomizedRunner$4.evaluate(RandomizedRunner.java:772)
	at com.carrotsearch.randomizedtesting.RandomizedRunner$5.evaluate(RandomizedRunner.java:783)
	at com.carrotsearch.randomizedtesting.rules.StatementAdapter.evaluate(StatementAdapter.java:36)
	at com.carrotsearch.randomizedtesting.rules.SystemPropertiesRestoreRule$1.evaluate(SystemPropertiesRestoreRule.java:53)
	at org.apache.lucene.util.AbstractBeforeAfterRule$1.evaluate(AbstractBeforeAfterRule.java:46)
	at org.apache.lucene.util.TestRuleStoreClassName$1.evaluate(TestRuleStoreClassName.java:42)
	at com.carrotsearch.randomizedtesting.rules.SystemPropertiesInvariantRule$1.evaluate(SystemPropertiesInvariantRule.java:55)
	at com.carrotsearch.randomizedtesting.rules.NoShadowingOrOverridesOnMethodsRule$1.evaluate(NoShadowingOrOverridesOnMethodsRule.java:39)
	at com.carrotsearch.randomizedtesting.rules.NoShadowingOrOverridesOnMethodsRule$1.evaluate(NoShadowingOrOverridesOnMethodsRule.java:39)
	at com.carrotsearch.randomizedtesting.rules.StatementAdapter.evaluate(StatementAdapter.java:36)
	at com.carrotsearch.randomizedtesting.rules.StatementAdapter.evaluate(StatementAdapter.java:36)
	at org.apache.lucene.util.TestRuleAssertionsRequired$1.evaluate(TestRuleAssertionsRequired.java:43)
	at org.apache.lucene.util.TestRuleMarkFailure$1.evaluate(TestRuleMarkFailure.java:48)
	at org.apache.lucene.util.TestRuleIgnoreAfterMaxFailures$1.evaluate(TestRuleIgnoreAfterMaxFailures.java:65)
	at org.apache.lucene.util.TestRuleIgnoreTestSuites$1.evaluate(TestRuleIgnoreTestSuites.java:55)
	at com.carrotsearch.randomizedtesting.rules.StatementAdapter.evaluate(StatementAdapter.java:36)
	at com.carrotsearch.randomizedtesting.ThreadLeakControl$StatementRunner.run(ThreadLeakControl.java:360)
	at java.lang.Thread.run(Thread.java:744)


REGRESSION:  org.apache.solr.handler.component.DistributedDebugComponentTest.testSimpleSearch

Error Message:
IOException occured when talking to server at: https://127.0.0.1:53428/solr

Stack Trace:
org.apache.solr.client.solrj.SolrServerException: IOException occured when talking to server at: https://127.0.0.1:53428/solr
	at __randomizedtesting.SeedInfo.seed([374283E7D66D1D8E:4B37ACAAE56E8376]:0)
	at org.apache.solr.client.solrj.impl.HttpSolrServer.executeMethod(HttpSolrServer.java:567)
	at org.apache.solr.client.solrj.impl.HttpSolrServer.request(HttpSolrServer.java:210)
	at org.apache.solr.client.solrj.impl.HttpSolrServer.request(HttpSolrServer.java:206)
	at org.apache.solr.client.solrj.request.AbstractUpdateRequest.process(AbstractUpdateRequest.java:124)
	at org.apache.solr.client.solrj.SolrServer.commit(SolrServer.java:168)
	at org.apache.solr.client.solrj.SolrServer.commit(SolrServer.java:146)
	at org.apache.solr.handler.component.DistributedDebugComponentTest.setUp(DistributedDebugComponentTest.java:86)
	at sun.reflect.NativeMethodAccessorImpl.invoke0(Native Method)
	at sun.reflect.NativeMethodAccessorImpl.invoke(NativeMethodAccessorImpl.java:62)
	at sun.reflect.DelegatingMethodAccessorImpl.invoke(DelegatingMethodAccessorImpl.java:43)
	at java.lang.reflect.Method.invoke(Method.java:483)
	at com.carrotsearch.randomizedtesting.RandomizedRunner.invoke(RandomizedRunner.java:1618)
	at com.carrotsearch.randomizedtesting.RandomizedRunner$7.evaluate(RandomizedRunner.java:861)
	at com.carrotsearch.randomizedtesting.RandomizedRunner$8.evaluate(RandomizedRunner.java:877)
	at com.carrotsearch.randomizedtesting.rules.SystemPropertiesRestoreRule$1.evaluate(SystemPropertiesRestoreRule.java:53)
	at org.apache.lucene.util.TestRuleSetupTeardownChained$1.evaluate(TestRuleSetupTeardownChained.java:50)
	at org.apache.lucene.util.TestRuleFieldCacheSanity$1.evaluate(TestRuleFieldCacheSanity.java:51)
	at org.apache.lucene.util.AbstractBeforeAfterRule$1.evaluate(AbstractBeforeAfterRule.java:46)
	at com.carrotsearch.randomizedtesting.rules.SystemPropertiesInvariantRule$1.evaluate(SystemPropertiesInvariantRule.java:55)
	at org.apache.lucene.util.TestRuleThreadAndTestName$1.evaluate(TestRuleThreadAndTestName.java:49)
	at org.apache.lucene.util.TestRuleIgnoreAfterMaxFailures$1.evaluate(TestRuleIgnoreAfterMaxFailures.java:65)
	at org.apache.lucene.util.TestRuleMarkFailure$1.evaluate(TestRuleMarkFailure.java:48)
	at com.carrotsearch.randomizedtesting.rules.StatementAdapter.evaluate(StatementAdapter.java:36)
	at com.carrotsearch.randomizedtesting.ThreadLeakControl$StatementRunner.run(ThreadLeakControl.java:360)
	at com.carrotsearch.randomizedtesting.ThreadLeakControl.forkTimeoutingTask(ThreadLeakControl.java:793)
	at com.carrotsearch.randomizedtesting.ThreadLeakControl$3.evaluate(ThreadLeakControl.java:453)
	at com.carrotsearch.randomizedtesting.RandomizedRunner.runSingleTest(RandomizedRunner.java:836)
	at com.carrotsearch.randomizedtesting.RandomizedRunner$3.evaluate(RandomizedRunner.java:738)
	at com.carrotsearch.randomizedtesting.RandomizedRunner$4.evaluate(RandomizedRunner.java:772)
	at com.carrotsearch.randomizedtesting.RandomizedRunner$5.evaluate(RandomizedRunner.java:783)
	at com.carrotsearch.randomizedtesting.rules.StatementAdapter.evaluate(StatementAdapter.java:36)
	at com.carrotsearch.randomizedtesting.rules.SystemPropertiesRestoreRule$1.evaluate(SystemPropertiesRestoreRule.java:53)
	at org.apache.lucene.util.AbstractBeforeAfterRule$1.evaluate(AbstractBeforeAfterRule.java:46)
	at org.apache.lucene.util.TestRuleStoreClassName$1.evaluate(TestRuleStoreClassName.java:42)
	at com.carrotsearch.randomizedtesting.rules.SystemPropertiesInvariantRule$1.evaluate(SystemPropertiesInvariantRule.java:55)
	at com.carrotsearch.randomizedtesting.rules.NoShadowingOrOverridesOnMethodsRule$1.evaluate(NoShadowingOrOverridesOnMethodsRule.java:39)
	at com.carrotsearch.randomizedtesting.rules.NoShadowingOrOverridesOnMethodsRule$1.evaluate(NoShadowingOrOverridesOnMethodsRule.java:39)
	at com.carrotsearch.randomizedtesting.rules.StatementAdapter.evaluate(StatementAdapter.java:36)
	at com.carrotsearch.randomizedtesting.rules.StatementAdapter.evaluate(StatementAdapter.java:36)
	at org.apache.lucene.util.TestRuleAssertionsRequired$1.evaluate(TestRuleAssertionsRequired.java:43)
	at org.apache.lucene.util.TestRuleMarkFailure$1.evaluate(TestRuleMarkFailure.java:48)
	at org.apache.lucene.util.TestRuleIgnoreAfterMaxFailures$1.evaluate(TestRuleIgnoreAfterMaxFailures.java:65)
	at org.apache.lucene.util.TestRuleIgnoreTestSuites$1.evaluate(TestRuleIgnoreTestSuites.java:55)
	at com.carrotsearch.randomizedtesting.rules.StatementAdapter.evaluate(StatementAdapter.java:36)
	at com.carrotsearch.randomizedtesting.ThreadLeakControl$StatementRunner.run(ThreadLeakControl.java:360)
	at java.lang.Thread.run(Thread.java:744)
Caused by: org.apache.http.NoHttpResponseException: The target server failed to respond
	at org.apache.http.impl.conn.DefaultHttpResponseParser.parseHead(DefaultHttpResponseParser.java:143)
	at org.apache.http.impl.conn.DefaultHttpResponseParser.parseHead(DefaultHttpResponseParser.java:57)
	at org.apache.http.impl.io.AbstractMessageParser.parse(AbstractMessageParser.java:260)
	at org.apache.http.impl.AbstractHttpClientConnection.receiveResponseHeader(AbstractHttpClientConnection.java:283)
	at org.apache.http.impl.conn.DefaultClientConnection.receiveResponseHeader(DefaultClientConnection.java:251)
	at org.apache.http.impl.conn.ManagedClientConnectionImpl.receiveResponseHeader(ManagedClientConnectionImpl.java:197)
	at org.apache.http.protocol.HttpRequestExecutor.doReceiveResponse(HttpRequestExecutor.java:271)
	at org.apache.http.protocol.HttpRequestExecutor.execute(HttpRequestExecutor.java:123)
	at org.apache.http.impl.client.DefaultRequestDirector.tryExecute(DefaultRequestDirector.java:682)
	at org.apache.http.impl.client.DefaultRequestDirector.execute(DefaultRequestDirector.java:486)
	at org.apache.http.impl.client.AbstractHttpClient.doExecute(AbstractHttpClient.java:863)
	at org.apache.http.impl.client.CloseableHttpClient.execute(CloseableHttpClient.java:82)
	at org.apache.http.impl.client.CloseableHttpClient.execute(CloseableHttpClient.java:106)
	at org.apache.http.impl.client.CloseableHttpClient.execute(CloseableHttpClient.java:57)
	at org.apache.solr.client.solrj.impl.HttpSolrServer.executeMethod(HttpSolrServer.java:452)
	... 45 more




Build Log:
[...truncated 10658 lines...]
   [junit4] Suite: org.apache.solr.handler.component.DistributedDebugComponentTest
   [junit4]   2> Creating dataDir: /mnt/ssd/jenkins/workspace/Lucene-Solr-4.8-Linux/solr/build/solr-core/test/J0/./solr.handler.component.DistributedDebugComponentTest-374283E7D66D1D8E-001/init-core-data-001
   [junit4]   2> 10124 T37 oas.SolrTestCaseJ4.buildSSLConfig Randomized ssl (true) and clientAuth (false)
   [junit4]   2> 10173 T37 oas.SolrTestCaseJ4.setUp ###Starting testSimpleSearch
   [junit4]   2> 10174 T37 oas.SolrTestCaseJ4.initCore ####initCore
   [junit4]   2> 10174 T37 oas.SolrTestCaseJ4.initCore ####initCore end
   [junit4]   2> 10181 T37 oejs.Server.doStart jetty-8.1.10.v20130312
   [junit4]   2> 10442 T37 oejus.SslContextFactory.doStart Enabled Protocols [SSLv2Hello, SSLv3, TLSv1, TLSv1.1, TLSv1.2] of [SSLv2Hello, SSLv3, TLSv1, TLSv1.1, TLSv1.2]
   [junit4]   2> 10447 T37 oejs.AbstractConnector.doStart Started SslSelectChannelConnector@127.0.0.1:53428
   [junit4]   2> 10455 T37 oass.SolrDispatchFilter.init SolrDispatchFilter.init()
   [junit4]   2> 10455 T37 oasc.SolrResourceLoader.locateSolrHome JNDI not configured for solr (NoInitialContextEx)
   [junit4]   2> 10456 T37 oasc.SolrResourceLoader.locateSolrHome using system property solr.solr.home: /mnt/ssd/jenkins/workspace/Lucene-Solr-4.8-Linux/solr/build/solr-core/test/J0/./solr.handler.component.DistributedDebugComponentTest-374283E7D66D1D8E-001/tempDir-001
   [junit4]   2> 10456 T37 oasc.SolrResourceLoader.<init> new SolrResourceLoader for directory: '/mnt/ssd/jenkins/workspace/Lucene-Solr-4.8-Linux/solr/build/solr-core/test/J0/./solr.handler.component.DistributedDebugComponentTest-374283E7D66D1D8E-001/tempDir-001/'
   [junit4]   2> 10474 T37 oasc.ConfigSolr.fromFile Loading container configuration from /mnt/ssd/jenkins/workspace/Lucene-Solr-4.8-Linux/solr/build/solr-core/test/J0/./solr.handler.component.DistributedDebugComponentTest-374283E7D66D1D8E-001/tempDir-001/solr.xml
   [junit4]   2> 10491 T37 oasc.CoreContainer.<init> New CoreContainer 815982316
   [junit4]   2> 10492 T37 oasc.CoreContainer.load Loading cores into CoreContainer [instanceDir=/mnt/ssd/jenkins/workspace/Lucene-Solr-4.8-Linux/solr/build/solr-core/test/J0/./solr.handler.component.DistributedDebugComponentTest-374283E7D66D1D8E-001/tempDir-001/]
   [junit4]   2> 10493 T37 oashc.HttpShardHandlerFactory.getParameter Setting socketTimeout to: 90000
   [junit4]   2> 10493 T37 oashc.HttpShardHandlerFactory.getParameter Setting urlScheme to: https
   [junit4]   2> 10494 T37 oashc.HttpShardHandlerFactory.getParameter Setting connTimeout to: 15000
   [junit4]   2> 10495 T37 oashc.HttpShardHandlerFactory.getParameter Setting maxConnectionsPerHost to: 20
   [junit4]   2> 10495 T37 oashc.HttpShardHandlerFactory.getParameter Setting corePoolSize to: 0
   [junit4]   2> 10495 T37 oashc.HttpShardHandlerFactory.getParameter Setting maximumPoolSize to: 2147483647
   [junit4]   2> 10496 T37 oashc.HttpShardHandlerFactory.getParameter Setting maxThreadIdleTime to: 5
   [junit4]   2> 10496 T37 oashc.HttpShardHandlerFactory.getParameter Setting sizeOfQueue to: -1
   [junit4]   2> 10496 T37 oashc.HttpShardHandlerFactory.getParameter Setting fairnessPolicy to: false
   [junit4]   2> 10509 T37 oasl.LogWatcher.createWatcher SLF4J impl is org.slf4j.impl.Log4jLoggerFactory
   [junit4]   2> 10510 T37 oasl.LogWatcher.newRegisteredLogWatcher Registering Log Listener [Log4j (org.slf4j.impl.Log4jLoggerFactory)]
   [junit4]   2> 10511 T37 oasc.CoreContainer.load Host Name: 127.0.0.1
   [junit4]   2> 10518 T47 oasc.SolrResourceLoader.<init> new SolrResourceLoader for directory: '/mnt/ssd/jenkins/workspace/Lucene-Solr-4.8-Linux/solr/build/solr-core/test/J0/./solr.handler.component.DistributedDebugComponentTest-374283E7D66D1D8E-001/tempDir-001/collection1/'
   [junit4]   2> 10603 T47 oasc.SolrConfig.<init> Using Lucene MatchVersion: LUCENE_48
   [junit4]   2> 10666 T47 oasc.SolrConfig.<init> Loaded SolrConfig: solrconfig.xml
   [junit4]   2> 10667 T47 oass.IndexSchema.readSchema Reading Solr Schema from schema.xml
   [junit4]   2> 10681 T47 oass.IndexSchema.readSchema [collection1] Schema name=test
   [junit4]   2> 10696 T47 oasc.SolrResourceLoader.findClass WARN Solr loaded a deprecated plugin/analysis class [solr.ByteField]. Please consult documentation how to replace it accordingly.
   [junit4]   2> 10703 T47 oasc.SolrResourceLoader.findClass WARN Solr loaded a deprecated plugin/analysis class [solr.ShortField]. Please consult documentation how to replace it accordingly.
   [junit4]   2> 10714 T47 oasc.SolrResourceLoader.findClass WARN Solr loaded a deprecated plugin/analysis class [solr.BCDIntField]. Please consult documentation how to replace it accordingly.
   [junit4]   2> 10719 T47 oasc.SolrResourceLoader.findClass WARN Solr loaded a deprecated plugin/analysis class [solr.BCDLongField]. Please consult documentation how to replace it accordingly.
   [junit4]   2> 10724 T47 oasc.SolrResourceLoader.findClass WARN Solr loaded a deprecated plugin/analysis class [solr.BCDStrField]. Please consult documentation how to replace it accordingly.
   [junit4]   2> 11116 T47 oass.ByteField.init WARN ByteField is deprecated and will be removed in 5.0. You should use TrieIntField instead.
   [junit4]   2> 11117 T47 oass.ShortField.init WARN ShortField is deprecated and will be removed in 5.0. You should use TrieIntField instead.
   [junit4]   2> 11130 T47 oass.OpenExchangeRatesOrgProvider.init Initialized with rates=open-exchange-rates.json, refreshInterval=1440.
   [junit4]   2> 11139 T47 oass.IndexSchema.readSchema default search field in schema is text
   [junit4]   2> 11141 T47 oass.IndexSchema.readSchema unique key field: id
   [junit4]   2> 11165 T47 oass.FileExchangeRateProvider.reload Reloading exchange rates from file currency.xml
   [junit4]   2> 11169 T47 oass.FileExchangeRateProvider.reload Reloading exchange rates from file currency.xml
   [junit4]   2> 11172 T47 oass.OpenExchangeRatesOrgProvider.reload Reloading exchange rates from open-exchange-rates.json
   [junit4]   2> 11174 T47 oass.OpenExchangeRatesOrgProvider$OpenExchangeRates.<init> WARN Unknown key IMPORTANT NOTE
   [junit4]   2> 11174 T47 oass.OpenExchangeRatesOrgProvider$OpenExchangeRates.<init> WARN Expected key, got STRING
   [junit4]   2> 11175 T47 oass.OpenExchangeRatesOrgProvider.reload Reloading exchange rates from open-exchange-rates.json
   [junit4]   2> 11175 T47 oass.OpenExchangeRatesOrgProvider$OpenExchangeRates.<init> WARN Unknown key IMPORTANT NOTE
   [junit4]   2> 11175 T47 oass.OpenExchangeRatesOrgProvider$OpenExchangeRates.<init> WARN Expected key, got STRING
   [junit4]   2> 11176 T47 oasc.CoreContainer.create Creating SolrCore 'collection1' using configuration from instancedir /mnt/ssd/jenkins/workspace/Lucene-Solr-4.8-Linux/solr/build/solr-core/test/J0/./solr.handler.component.DistributedDebugComponentTest-374283E7D66D1D8E-001/tempDir-001/collection1/
   [junit4]   2> 11176 T47 oasc.SolrCore.initDirectoryFactory org.apache.solr.core.MockDirectoryFactory
   [junit4]   2> 11176 T47 oasc.SolrCore.<init> [collection1] Opening new SolrCore at /mnt/ssd/jenkins/workspace/Lucene-Solr-4.8-Linux/solr/build/solr-core/test/J0/./solr.handler.component.DistributedDebugComponentTest-374283E7D66D1D8E-001/tempDir-001/collection1/, dataDir=/mnt/ssd/jenkins/workspace/Lucene-Solr-4.8-Linux/solr/build/solr-core/test/J0/solr.handler.component.DistributedDebugComponentTest-374283E7D66D1D8E-001/tempDir-002/
   [junit4]   2> 11176 T47 oasc.JmxMonitoredMap.<init> No JMX servers found, not exposing Solr information with JMX.
   [junit4]   2> 11177 T47 oasc.CachingDirectoryFactory.get return new directory for /mnt/ssd/jenkins/workspace/Lucene-Solr-4.8-Linux/solr/build/solr-core/test/J0/solr.handler.component.DistributedDebugComponentTest-374283E7D66D1D8E-001/tempDir-002
   [junit4]   2> 11177 T47 oasc.SolrCore.getNewIndexDir New index directory detected: old=null new=/mnt/ssd/jenkins/workspace/Lucene-Solr-4.8-Linux/solr/build/solr-core/test/J0/solr.handler.component.DistributedDebugComponentTest-374283E7D66D1D8E-001/tempDir-002/index/
   [junit4]   2> 11178 T47 oasc.SolrCore.initIndex WARN [collection1] Solr index directory '/mnt/ssd/jenkins/workspace/Lucene-Solr-4.8-Linux/solr/build/solr-core/test/J0/solr.handler.component.DistributedDebugComponentTest-374283E7D66D1D8E-001/tempDir-002/index' doesn't exist. Creating new index...
   [junit4]   2> 11178 T47 oasc.CachingDirectoryFactory.get return new directory for /mnt/ssd/jenkins/workspace/Lucene-Solr-4.8-Linux/solr/build/solr-core/test/J0/solr.handler.component.DistributedDebugComponentTest-374283E7D66D1D8E-001/tempDir-002/index
   [junit4]   2> 11178 T47 oasu.RandomMergePolicy.<init> RandomMergePolicy wrapping class org.apache.lucene.index.TieredMergePolicy: [TieredMergePolicy: maxMergeAtOnce=46, maxMergeAtOnceExplicit=22, maxMergedSegmentMB=79.0830078125, floorSegmentMB=0.8935546875, forceMergeDeletesPctAllowed=20.956481937422062, segmentsPerTier=30.0, maxCFSSegmentSizeMB=8.796093022207999E12, noCFSRatio=0.8958419379791615
   [junit4]   2> 11179 T47 oasc.SolrDeletionPolicy.onCommit SolrDeletionPolicy.onCommit: commits: num=1
   [junit4]   2> 		commit{dir=RateLimitedDirectoryWrapper(MockDirectoryWrapper(RAMDirectory@74db8322 lockFactory=org.apache.lucene.store.SingleInstanceLockFactory@7f43f267)),segFN=segments_1,generation=1}
   [junit4]   2> 11180 T47 oasc.SolrDeletionPolicy.updateCommits newest commit generation = 1
   [junit4]   2> 11180 T47 oasc.SolrCore.initWriters created xml: solr.XMLResponseWriter
   [junit4]   2> 11189 T47 oasup.UpdateRequestProcessorChain.init creating updateRequestProcessorChain "dedupe"
   [junit4]   2> 11190 T47 oasup.UpdateRequestProcessorChain.init inserting DistributedUpdateProcessorFactory into updateRequestProcessorChain "dedupe"
   [junit4]   2> 11190 T47 oasup.UpdateRequestProcessorChain.init creating updateRequestProcessorChain "dedupe-allfields"
   [junit4]   2> 11191 T47 oasup.UpdateRequestProcessorChain.init inserting DistributedUpdateProcessorFactory into updateRequestProcessorChain "dedupe-allfields"
   [junit4]   2> 11191 T47 oasup.UpdateRequestProcessorChain.init creating updateRequestProcessorChain "stored_sig"
   [junit4]   2> 11191 T47 oasup.UpdateRequestProcessorChain.init inserting DistributedUpdateProcessorFactory into updateRequestProcessorChain "stored_sig"
   [junit4]   2> 11191 T47 oasup.UpdateRequestProcessorChain.init creating updateRequestProcessorChain "uniq-fields"
   [junit4]   2> 11192 T47 oasup.UniqFieldsUpdateProcessorFactory.init WARN Use of the 'fields' init param in UniqFieldsUpdateProcessorFactory is deprecated, please use 'fieldName' (or another FieldMutatingUpdateProcessorFactory selector option) instead
   [junit4]   2> 11192 T47 oasup.UniqFieldsUpdateProcessorFactory.init Replacing 'fields' init param with (individual) 'fieldName' params
   [junit4]   2> 11192 T47 oasup.UpdateRequestProcessorChain.init inserting DistributedUpdateProcessorFactory into updateRequestProcessorChain "uniq-fields"
   [junit4]   2> 11193 T47 oasup.UpdateRequestProcessorChain.init creating updateRequestProcessorChain "distrib-dup-test-chain-explicit"
   [junit4]   2> 11193 T47 oasup.UpdateRequestProcessorChain.init creating updateRequestProcessorChain "distrib-dup-test-chain-implicit"
   [junit4]   2> 11194 T47 oasup.UpdateRequestProcessorChain.init inserting DistributedUpdateProcessorFactory into updateRequestProcessorChain "distrib-dup-test-chain-implicit"
   [junit4]   2> 11194 T47 oasc.SolrCore.loadUpdateProcessorChains no updateRequestProcessorChain defined as default, creating implicit default
   [junit4]   2> 11194 T47 oasc.RequestHandlers.initHandlersFromConfig adding lazy requestHandler: solr.ReplicationHandler
   [junit4]   2> 11194 T47 oasc.RequestHandlers.initHandlersFromConfig created /replication: solr.ReplicationHandler
   [junit4]   2> 11195 T47 oasc.RequestHandlers.initHandlersFromConfig created standard: solr.StandardRequestHandler
   [junit4]   2> 11195 T47 oasc.RequestHandlers.initHandlersFromConfig created /get: solr.RealTimeGetHandler
   [junit4]   2> 11195 T47 oasc.RequestHandlers.initHandlersFromConfig created dismax: solr.SearchHandler
   [junit4]   2> 11196 T47 oasc.RequestHandlers.initHandlersFromConfig created mock: org.apache.solr.core.MockQuerySenderListenerReqHandler
   [junit4]   2> 11196 T47 oasc.RequestHandlers.initHandlersFromConfig created /admin/: org.apache.solr.handler.admin.AdminHandlers
   [junit4]   2> 11196 T47 oasc.RequestHandlers.initHandlersFromConfig created /admin/file: solr.admin.ShowFileRequestHandler
   [junit4]   2> 11197 T47 oasc.RequestHandlers.initHandlersFromConfig created defaults: solr.StandardRequestHandler
   [junit4]   2> 11197 T47 oasc.RequestHandlers.initHandlersFromConfig adding lazy requestHandler: solr.StandardRequestHandler
   [junit4]   2> 11197 T47 oasc.RequestHandlers.initHandlersFromConfig created lazy: solr.StandardRequestHandler
   [junit4]   2> 11197 T47 oasc.RequestHandlers.initHandlersFromConfig created /update: solr.UpdateRequestHandler
   [junit4]   2> 11198 T47 oasc.RequestHandlers.initHandlersFromConfig created /terms: org.apache.solr.handler.component.SearchHandler
   [junit4]   2> 11198 T47 oasc.RequestHandlers.initHandlersFromConfig created spellCheckCompRH: org.apache.solr.handler.component.SearchHandler
   [junit4]   2> 11198 T47 oasc.RequestHandlers.initHandlersFromConfig created spellCheckCompRH_Direct: org.apache.solr.handler.component.SearchHandler
   [junit4]   2> 11199 T47 oasc.RequestHandlers.initHandlersFromConfig created spellCheckWithWordbreak: org.apache.solr.handler.component.SearchHandler
   [junit4]   2> 11199 T47 oasc.RequestHandlers.initHandlersFromConfig created spellCheckWithWordbreak_Direct: org.apache.solr.handler.component.SearchHandler
   [junit4]   2> 11199 T47 oasc.RequestHandlers.initHandlersFromConfig created spellCheckCompRH1: org.apache.solr.handler.component.SearchHandler
   [junit4]   2> 11200 T47 oasc.RequestHandlers.initHandlersFromConfig created mltrh: org.apache.solr.handler.component.SearchHandler
   [junit4]   2> 11200 T47 oasc.RequestHandlers.initHandlersFromConfig created tvrh: org.apache.solr.handler.component.SearchHandler
   [junit4]   2> 11200 T47 oasc.RequestHandlers.initHandlersFromConfig created /mlt: solr.MoreLikeThisHandler
   [junit4]   2> 11201 T47 oasc.RequestHandlers.initHandlersFromConfig created /debug/dump: solr.DumpRequestHandler
   [junit4]   2> 11203 T47 oashl.XMLLoader.init xsltCacheLifetimeSeconds=60
   [junit4]   2> 11204 T47 oasc.SolrCore.initDeprecatedSupport WARN solrconfig.xml uses deprecated <admin/gettableFiles>, Please update your config to use the ShowFileRequestHandler.
   [junit4]   2> 11226 T47 oasu.CommitTracker.<init> Hard AutoCommit: disabled
   [junit4]   2> 11227 T47 oasu.CommitTracker.<init> Soft AutoCommit: disabled
   [junit4]   2> 11227 T47 oasu.RandomMergePolicy.<init> RandomMergePolicy wrapping class org.apache.lucene.index.LogByteSizeMergePolicy: [LogByteSizeMergePolicy: minMergeSize=1677721, mergeFactor=40, maxMergeSize=2147483648, maxMergeSizeForForcedMerge=9223372036854775807, calibrateSizeByDeletes=true, maxMergeDocs=2147483647, maxCFSSegmentSizeMB=8.796093022207999E12, noCFSRatio=0.40607660326952755]
   [junit4]   2> 11229 T47 oasc.SolrDeletionPolicy.onInit SolrDeletionPolicy.onInit: commits: num=1
   [junit4]   2> 		commit{dir=RateLimitedDirectoryWrapper(MockDirectoryWrapper(RAMDirectory@74db8322 lockFactory=org.apache.lucene.store.SingleInstanceLockFactory@7f43f267)),segFN=segments_1,generation=1}
   [junit4]   2> 11229 T47 oasc.SolrDeletionPolicy.updateCommits newest commit generation = 1
   [junit4]   2> 11229 T47 oass.SolrIndexSearcher.<init> Opening Searcher@504b140c[collection1] main
   [junit4]   2> 11230 T47 oasr.RestManager.init Initializing RestManager with initArgs: {storageIO=org.apache.solr.rest.ManagedResourceStorage$InMemoryStorageIO}
   [junit4]   2> 11230 T47 oasr.ManagedResourceStorage.load Reading _rest_managed.json using InMemoryStorage
   [junit4]   2> 11231 T47 oasr.ManagedResource.reloadFromStorage WARN No stored data found for /rest/managed
   [junit4]   2> 11231 T47 oasr.ManagedResource.notifyObserversDuringInit WARN No registered observers for /rest/managed
   [junit4]   2> 11231 T47 oasr.RestManager.init Initializing 0 registered ManagedResources
   [junit4]   2> 11231 T47 oashc.SpellCheckComponent.inform Initializing spell checkers
   [junit4]   2> 11249 T47 oass.DirectSolrSpellChecker.init init: {name=direct,classname=DirectSolrSpellChecker,field=lowerfilt,minQueryLength=3}
   [junit4]   2> 11284 T48 oasc.SolrCore.registerSearcher [collection1] Registered new searcher Searcher@504b140c[collection1] main{StandardDirectoryReader(segments_1:1:nrt)}
   [junit4]   2> 11284 T47 oasc.CoreContainer.registerCore registering core: collection1
   [junit4]   2> 11292 T37 oass.SolrDispatchFilter.init user.dir=/mnt/ssd/jenkins/workspace/Lucene-Solr-4.8-Linux/solr/build/solr-core/test/J0
   [junit4]   2> 11293 T37 oass.SolrDispatchFilter.init SolrDispatchFilter.init() done
   [junit4]   2> 11293 T37 oas.SolrJettyTestBase.createJetty Jetty Assigned Port#53428
   [junit4]   2> 11455 T39 oasha.CoreAdminHandler.handleCreateAction core create command name=collection2&action=CREATE&wt=javabin&version=2
   [junit4]   2> 11458 T39 oasc.SolrResourceLoader.<init> new SolrResourceLoader for directory: '/mnt/ssd/jenkins/workspace/Lucene-Solr-4.8-Linux/solr/build/solr-core/test/J0/./solr.handler.component.DistributedDebugComponentTest-374283E7D66D1D8E-001/tempDir-001/collection2/'
   [junit4]   2> 11507 T39 oasc.SolrConfig.<init> Using Lucene MatchVersion: LUCENE_48
   [junit4]   2> 11540 T39 oasc.SolrConfig.<init> Loaded SolrConfig: solrconfig.xml
   [junit4]   2> 11545 T39 oass.IndexSchema.readSchema Reading Solr Schema from schema.xml
   [junit4]   2> 11555 T39 oass.IndexSchema.readSchema [collection2] Schema name=test
   [junit4]   2> 11756 T39 oass.ByteField.init WARN ByteField is deprecated and will be removed in 5.0. You should use TrieIntField instead.
   [junit4]   2> 11757 T39 oass.ShortField.init WARN ShortField is deprecated and will be removed in 5.0. You should use TrieIntField instead.
   [junit4]   2> 11759 T39 oass.OpenExchangeRatesOrgProvider.init Initialized with rates=open-exchange-rates.json, refreshInterval=1440.
   [junit4]   2> 11766 T39 oass.IndexSchema.readSchema default search field in schema is text
   [junit4]   2> 11768 T39 oass.IndexSchema.readSchema unique key field: id
   [junit4]   2> 11791 T39 oass.FileExchangeRateProvider.reload Reloading exchange rates from file currency.xml
   [junit4]   2> 11796 T39 oass.FileExchangeRateProvider.reload Reloading exchange rates from file currency.xml
   [junit4]   2> 11802 T39 oass.OpenExchangeRatesOrgProvider.reload Reloading exchange rates from open-exchange-rates.json
   [junit4]   2> 11803 T39 oass.OpenExchangeRatesOrgProvider$OpenExchangeRates.<init> WARN Unknown key IMPORTANT NOTE
   [junit4]   2> 11804 T39 oass.OpenExchangeRatesOrgProvider$OpenExchangeRates.<init> WARN Expected key, got STRING
   [junit4]   2> 11813 T39 oass.OpenExchangeRatesOrgProvider.reload Reloading exchange rates from open-exchange-rates.json
   [junit4]   2> 11814 T39 oass.OpenExchangeRatesOrgProvider$OpenExchangeRates.<init> WARN Unknown key IMPORTANT NOTE
   [junit4]   2> 11814 T39 oass.OpenExchangeRatesOrgProvider$OpenExchangeRates.<init> WARN Expected key, got STRING
   [junit4]   2> 11815 T39 oasc.CoreContainer.create Creating SolrCore 'collection2' using configuration from instancedir /mnt/ssd/jenkins/workspace/Lucene-Solr-4.8-Linux/solr/build/solr-core/test/J0/./solr.handler.component.DistributedDebugComponentTest-374283E7D66D1D8E-001/tempDir-001/collection2/
   [junit4]   2> 11815 T39 oasc.SolrCore.initDirectoryFactory org.apache.solr.core.MockDirectoryFactory
   [junit4]   2> 11816 T39 oasc.SolrCore.<init> [collection2] Opening new SolrCore at /mnt/ssd/jenkins/workspace/Lucene-Solr-4.8-Linux/solr/build/solr-core/test/J0/./solr.handler.component.DistributedDebugComponentTest-374283E7D66D1D8E-001/tempDir-001/collection2/, dataDir=/mnt/ssd/jenkins/workspace/Lucene-Solr-4.8-Linux/solr/build/solr-core/test/J0/./solr.handler.component.DistributedDebugComponentTest-374283E7D66D1D8E-001/tempDir-001/collection2/data/
   [junit4]   2> 11828 T39 oasc.JmxMonitoredMap.<init> No JMX servers found, not exposing Solr information with JMX.
   [junit4]   2> 11830 T39 oasc.CachingDirectoryFactory.get return new directory for /mnt/ssd/jenkins/workspace/Lucene-Solr-4.8-Linux/solr/build/solr-core/test/J0/./solr.handler.component.DistributedDebugComponentTest-374283E7D66D1D8E-001/tempDir-001/collection2/data
   [junit4]   2> 11830 T39 oasc.SolrCore.getNewIndexDir New index directory detected: old=null new=/mnt/ssd/jenkins/workspace/Lucene-Solr-4.8-Linux/solr/build/solr-core/test/J0/./solr.handler.component.DistributedDebugComponentTest-374283E7D66D1D8E-001/tempDir-001/collection2/data/index/
   [junit4]   2> 11830 T39 oasc.SolrCore.initIndex WARN [collection2] Solr index directory '/mnt/ssd/jenkins/workspace/Lucene-Solr-4.8-Linux/solr/build/solr-core/test/J0/./solr.handler.component.DistributedDebugComponentTest-374283E7D66D1D8E-001/tempDir-001/collection2/data/index' doesn't exist. Creating new index...
   [junit4]   2> 11831 T39 oasc.CachingDirectoryFactory.get return new directory for /mnt/ssd/jenkins/workspace/Lucene-Solr-4.8-Linux/solr/build/solr-core/test/J0/./solr.handler.component.DistributedDebugComponentTest-374283E7D66D1D8E-001/tempDir-001/collection2/data/index
   [junit4]   2> 11832 T39 oasu.RandomMergePolicy.<init> RandomMergePolicy wrapping class org.apache.lucene.index.TieredMergePolicy: [TieredMergePolicy: maxMergeAtOnce=46, maxMergeAtOnceExplicit=22, maxMergedSegmentMB=79.0830078125, floorSegmentMB=0.8935546875, forceMergeDeletesPctAllowed=20.956481937422062, segmentsPerTier=30.0, maxCFSSegmentSizeMB=8.796093022207999E12, noCFSRatio=0.8958419379791615
   [junit4]   2> 11833 T39 oasc.SolrDeletionPolicy.onCommit SolrDeletionPolicy.onCommit: commits: num=1
   [junit4]   2> 		commit{dir=RateLimitedDirectoryWrapper(MockDirectoryWrapper(RAMDirectory@223e5c00 lockFactory=org.apache.lucene.store.SingleInstanceLockFactory@7b13ab1f)),segFN=segments_1,generation=1}
   [junit4]   2> 11833 T39 oasc.SolrDeletionPolicy.updateCommits newest commit generation = 1
   [junit4]   2> 11834 T39 oasc.SolrCore.initWriters created xml: solr.XMLResponseWriter
   [junit4]   2> 11835 T39 oasup.UpdateRequestProcessorChain.init creating updateRequestProcessorChain "dedupe"
   [junit4]   2> 11836 T39 oasup.UpdateRequestProcessorChain.init inserting DistributedUpdateProcessorFactory into updateRequestProcessorChain "dedupe"
   [junit4]   2> 11837 T39 oasup.UpdateRequestProcessorChain.init creating updateRequestProcessorChain "dedupe-allfields"
   [junit4]   2> 11837 T39 oasup.UpdateRequestProcessorChain.init inserting DistributedUpdateProcessorFactory into updateRequestProcessorChain "dedupe-allfields"
   [junit4]   2> 11837 T39 oasup.UpdateRequestProcessorChain.init creating updateRequestProcessorChain "stored_sig"
   [junit4]   2> 11838 T39 oasup.UpdateRequestProcessorChain.init inserting DistributedUpdateProcessorFactory into updateRequestProcessorChain "stored_sig"
   [junit4]   2> 11838 T39 oasup.UpdateRequestProcessorChain.init creating updateRequestProcessorChain "uniq-fields"
   [junit4]   2> 11839 T39 oasup.UniqFieldsUpdateProcessorFactory.init WARN Use of the 'fields' init param in UniqFieldsUpdateProcessorFactory is deprecated, please use 'fieldName' (or another FieldMutatingUpdateProcessorFactory selector option) instead
   [junit4]   2> 11839 T39 oasup.UniqFieldsUpdateProcessorFactory.init Replacing 'fields' init param with (individual) 'fieldName' params
   [junit4]   2> 11839 T39 oasup.UpdateRequestProcessorChain.init inserting DistributedUpdateProcessorFactory into updateRequestProcessorChain "uniq-fields"
   [junit4]   2> 11840 T39 oasup.UpdateRequestProcessorChain.init creating updateRequestProcessorChain "distrib-dup-test-chain-explicit"
   [junit4]   2> 11840 T39 oasup.UpdateRequestProcessorChain.init creating updateRequestProcessorChain "distrib-dup-test-chain-implicit"
   [junit4]   2> 11841 T39 oasup.UpdateRequestProcessorChain.init inserting DistributedUpdateProcessorFactory into updateRequestProcessorChain "distrib-dup-test-chain-implicit"
   [junit4]   2> 11841 T39 oasc.SolrCore.loadUpdateProcessorChains no updateRequestProcessorChain defined as default, creating implicit default
   [junit4]   2> 11841 T39 oasc.RequestHandlers.initHandlersFromConfig adding lazy requestHandler: solr.ReplicationHandler
   [junit4]   2> 11842 T39 oasc.RequestHandlers.initHandlersFromConfig created /replication: solr.ReplicationHandler
   [junit4]   2> 11842 T39 oasc.RequestHandlers.initHandlersFromConfig created standard: solr.StandardRequestHandler
   [junit4]   2> 11843 T39 oasc.RequestHandlers.initHandlersFromConfig created /get: solr.RealTimeGetHandler
   [junit4]   2> 11843 T39 oasc.RequestHandlers.initHandlersFromConfig created dismax: solr.SearchHandler
   [junit4]   2> 11843 T39 oasc.RequestHandlers.initHandlersFromConfig created mock: org.apache.solr.core.MockQuerySenderListenerReqHandler
   [junit4]   2> 11844 T39 oasc.RequestHandlers.initHandlersFromConfig created /admin/: org.apache.solr.handler.admin.AdminHandlers
   [junit4]   2> 11844 T39 oasc.RequestHandlers.initHandlersFromConfig created /admin/file: solr.admin.ShowFileRequestHandler
   [junit4]   2> 11845 T39 oasc.RequestHandlers.initHandlersFromConfig created defaults: solr.StandardRequestHandler
   [junit4]   2> 11845 T39 oasc.RequestHandlers.initHandlersFromConfig adding lazy requestHandler: solr.StandardRequestHandler
   [junit4]   2> 11845 T39 oasc.RequestHandlers.initHandlersFromConfig created lazy: solr.StandardRequestHandler
   [junit4]   2> 11846 T39 oasc.RequestHandlers.initHandlersFromConfig created /update: solr.UpdateRequestHandler
   [junit4]   2> 11846 T39 oasc.RequestHandlers.initHandlersFromConfig created /terms: org.apache.solr.handler.component.SearchHandler
   [junit4]   2> 11846 T39 oasc.RequestHandlers.initHandlersFromConfig created spellCheckCompRH: org.apache.solr.handler.component.SearchHandler
   [junit4]   2> 11847 T39 oasc.RequestHandlers.initHandlersFromConfig created spellCheckCompRH_Direct: org.apache.solr.handler.component.SearchHandler
   [junit4]   2> 11847 T39 oasc.RequestHandlers.initHandlersFromConfig created spellCheckWithWordbreak: org.apache.solr.handler.component.SearchHandler
   [junit4]   2> 11848 T39 oasc.RequestHandlers.initHandlersFromConfig created spellCheckWithWordbreak_Direct: org.apache.solr.handler.component.SearchHandler
   [junit4]   2> 11848 T39 oasc.RequestHandlers.initHandlersFromConfig created spellCheckCompRH1: org.apache.solr.handler.component.SearchHandler
   [junit4]   2> 11848 T39 oasc.RequestHandlers.initHandlersFromConfig created mltrh: org.apache.solr.handler.component.SearchHandler
   [junit4]   2> 11857 T39 oasc.RequestHandlers.initHandlersFromConfig created tvrh: org.apache.solr.handler.component.SearchHandler
   [junit4]   2> 11858 T39 oasc.RequestHandlers.initHandlersFromConfig created /mlt: solr.MoreLikeThisHandler
   [junit4]   2> 11859 T39 oasc.RequestHandlers.initHandlersFromConfig created /debug/dump: solr.DumpRequestHandler
   [junit4]   2> 11862 T39 oashl.XMLLoader.init xsltCacheLifetimeSeconds=60
   [junit4]   2> 11863 T39 oasc.SolrCore.initDeprecatedSupport WARN solrconfig.xml uses deprecated <admin/gettableFiles>, Please update your config to use the ShowFileRequestHandler.
   [junit4]   2> 11865 T39 oasu.CommitTracker.<init> Hard AutoCommit: disabled
   [junit4]   2> 11866 T39 oasu.CommitTracker.<init> Soft AutoCommit: disabled
   [junit4]   2> 11866 T39 oasu.RandomMergePolicy.<init> RandomMergePolicy wrapping class org.apache.lucene.index.LogByteSizeMergePolicy: [LogByteSizeMergePolicy: minMergeSize=1677721, mergeFactor=40, maxMergeSize=2147483648, maxMergeSizeForForcedMerge=9223372036854775807, calibrateSizeByDeletes=true, maxMergeDocs=2147483647, maxCFSSegmentSizeMB=8.796093022207999E12, noCFSRatio=0.40607660326952755]
   [junit4]   2> 11868 T39 oasc.SolrDeletionPolicy.onInit SolrDeletionPolicy.onInit: commits: num=1
   [junit4]   2> 		commit{dir=RateLimitedDirectoryWrapper(MockDirectoryWrapper(RAMDirectory@223e5c00 lockFactory=org.apache.lucene.store.SingleInstanceLockFactory@7b13ab1f)),segFN=segments_1,generation=1}
   [junit4]   2> 11868 T39 oasc.SolrDeletionPolicy.updateCommits newest commit generation = 1
   [junit4]   2> 11869 T39 oass.SolrIndexSearcher.<init> Opening Searcher@cd70f15[collection2] main
   [junit4]   2> 11870 T39 oasr.RestManager.init Initializing RestManager with initArgs: {storageIO=org.apache.solr.rest.ManagedResourceStorage$InMemoryStorageIO}
   [junit4]   2> 11870 T39 oasr.ManagedResourceStorage.load Reading _rest_managed.json using InMemoryStorage
   [junit4]   2> 11870 T39 oasr.ManagedResource.reloadFromStorage WARN No stored data found for /rest/managed
   [junit4]   2> 11871 T39 oasr.ManagedResource.notifyObserversDuringInit WARN No registered observers for /rest/managed
   [junit4]   2> 11871 T39 oasr.RestManager.init Initializing 0 registered ManagedResources
   [junit4]   2> 11871 T39 oashc.SpellCheckComponent.inform Initializing spell checkers
   [junit4]   2> 11946 T39 oass.DirectSolrSpellChecker.init init: {name=direct,classname=DirectSolrSpellChecker,field=lowerfilt,minQueryLength=3}
   [junit4]   2> 11982 T50 oasc.SolrCore.registerSearcher [collection2] Registered new searcher Searcher@cd70f15[collection2] main{StandardDirectoryReader(segments_1:1:nrt)}
   [junit4]   2> 11983 T39 oasc.CoreContainer.registerCore registering core: collection2
   [junit4]   2> 11984 T39 oass.SolrDispatchFilter.handleAdminRequest [admin] webapp=null path=/admin/cores params={name=collection2&action=CREATE&wt=javabin&version=2} status=0 QTime=532 
   [junit4]   2> ASYNC  NEW_CORE C5 name=collection1 org.apache.solr.core.SolrCore@47548925
   [junit4]   2> 12114 T46 C5 oasup.LogUpdateProcessor.finish [collection1] webapp=/solr path=/update params={wt=javabin&version=2} {add=[1 (1465522194338545664)]} 0 97
   [junit4]   2> 212765 T39 C5 oasu.DirectUpdateHandler2.commit start commit{,optimize=false,openSearcher=true,waitSearcher=true,expungeDeletes=false,softCommit=false,prepareCommit=false}
   [junit4]   2> 212766 T37 oas.SolrTestCaseJ4.tearDown ###Ending testSimpleSearch
   [junit4]   2> 212783 T39 C5 oasc.SolrDeletionPolicy.onCommit SolrDeletionPolicy.onCommit: commits: num=2
   [junit4]   2> 		commit{dir=RateLimitedDirectoryWrapper(MockDirectoryWrapper(RAMDirectory@74db8322 lockFactory=org.apache.lucene.store.SingleInstanceLockFactory@7f43f267)),segFN=segments_1,generation=1}
   [junit4]   2> 		commit{dir=RateLimitedDirectoryWrapper(MockDirectoryWrapper(RAMDirectory@74db8322 lockFactory=org.apache.lucene.store.SingleInstanceLockFactory@7f43f267)),segFN=segments_2,generation=2}
   [junit4]   2> 212784 T39 C5 oasc.SolrDeletionPolicy.updateCommits newest commit generation = 2
   [junit4]   2> 212788 T37 oasc.CoreContainer.shutdown Shutting down CoreContainer instance=815982316
   [junit4]   2> 212789 T37 oasc.SolrCore.close [collection2]  CLOSING SolrCore org.apache.solr.core.SolrCore@786a2b5e
   [junit4]   2> 212789 T37 oasu.DirectUpdateHandler2.close closing DirectUpdateHandler2{commits=0,autocommits=0,soft autocommits=0,optimizes=0,rollbacks=0,expungeDeletes=0,docsPending=0,adds=0,deletesById=0,deletesByQuery=0,errors=0,cumulative_adds=0,cumulative_deletesById=0,cumulative_deletesByQuery=0,cumulative_errors=0,transaction_logs_total_size=0,transaction_logs_total_number=0}
   [junit4]   2> 212790 T37 oasu.SolrCoreState.decrefSolrCoreState Closing SolrCoreState
   [junit4]   2> 212790 T37 oasu.DefaultSolrCoreState.closeIndexWriter SolrCoreState ref count has reached 0 - closing IndexWriter
   [junit4]   2> 212791 T37 oasu.DefaultSolrCoreState.closeIndexWriter closing IndexWriter with IndexWriterCloser
   [junit4]   2> 212791 T39 C5 oass.SolrIndexSearcher.<init> Opening Searcher@60345389[collection1] main
   [junit4]   2> 212792 T48 oasc.SolrCore.registerSearcher [collection1] Registered new searcher Searcher@60345389[collection1] main{StandardDirectoryReader(segments_2:3:nrt _0(4.8):C1)}
   [junit4]   2> 212793 T39 C5 oasu.DirectUpdateHandler2.commit end_commit_flush
   [junit4]   2> 212793 T37 oasc.SolrCore.closeSearcher [collection2] Closing main searcher on request.
   [junit4]   2> 212793 T39 C5 oasup.LogUpdateProcessor.finish [collection1] webapp=/solr path=/update params={waitSearcher=true&commit=true&softCommit=false&wt=javabin&version=2} {commit=} 0 28
   [junit4]   2> 212794 T37 oasc.CachingDirectoryFactory.close Closing MockDirectoryFactory - 2 directories currently being tracked
   [junit4]   2> 212794 T37 oasc.CachingDirectoryFactory.closeCacheValue looking to close /mnt/ssd/jenkins/workspace/Lucene-Solr-4.8-Linux/solr/build/solr-core/test/J0/./solr.handler.component.DistributedDebugComponentTest-374283E7D66D1D8E-001/tempDir-001/collection2/data [CachedDir<<refCount=0;path=/mnt/ssd/jenkins/workspace/Lucene-Solr-4.8-Linux/solr/build/solr-core/test/J0/./solr.handler.component.DistributedDebugComponentTest-374283E7D66D1D8E-001/tempDir-001/collection2/data;done=false>>]
   [junit4]   2> 212795 T37 oasc.CachingDirectoryFactory.close Closing directory: /mnt/ssd/jenkins/workspace/Lucene-Solr-4.8-Linux/solr/build/solr-core/test/J0/./solr.handler.component.DistributedDebugComponentTest-374283E7D66D1D8E-001/tempDir-001/collection2/data
   [junit4]   2> 212795 T37 oasc.CachingDirectoryFactory.closeCacheValue looking to close /mnt/ssd/jenkins/workspace/Lucene-Solr-4.8-Linux/solr/build/solr-core/test/J0/./solr.handler.component.DistributedDebugComponentTest-374283E7D66D1D8E-001/tempDir-001/collection2/data/index [CachedDir<<refCount=0;path=/mnt/ssd/jenkins/workspace/Lucene-Solr-4.8-Linux/solr/build/solr-core/test/J0/./solr.handler.component.DistributedDebugComponentTest-374283E7D66D1D8E-001/tempDir-001/collection2/data/index;done=false>>]
   [junit4]   2> 212795 T37 oasc.CachingDirectoryFactory.close Closing directory: /mnt/ssd/jenkins/workspace/Lucene-Solr-4.8-Linux/solr/build/solr-core/test/J0/./solr.handler.component.DistributedDebugComponentTest-374283E7D66D1D8E-001/tempDir-001/collection2/data/index
   [junit4]   2> 212796 T37 oejsh.ContextHandler.doStop stopped o.e.j.s.ServletContextHandler{/solr,null}
   [junit4]   2> 212796 T39 C5 oasc.SolrException.log ERROR null:org.eclipse.jetty.io.EofException
   [junit4]   2> 		at org.eclipse.jetty.server.HttpOutput.write(HttpOutput.java:142)
   [junit4]   2> 		at org.eclipse.jetty.server.HttpOutput.write(HttpOutput.java:107)
   [junit4]   2> 		at org.apache.solr.common.util.FastOutputStream.flush(FastOutputStream.java:214)
   [junit4]   2> 		at org.apache.solr.common.util.FastOutputStream.flushBuffer(FastOutputStream.java:207)
   [junit4]   2> 		at org.apache.solr.common.util.JavaBinCodec.marshal(JavaBinCodec.java:98)
   [junit4]   2> 		at org.apache.solr.response.BinaryResponseWriter.write(BinaryResponseWriter.java:51)
   [junit4]   2> 		at org.apache.solr.servlet.SolrDispatchFilter.writeResponse(SolrDispatchFilter.java:755)
   [junit4]   2> 		at org.apache.solr.servlet.SolrDispatchFilter.doFilter(SolrDispatchFilter.java:431)
   [junit4]   2> 		at org.apache.solr.servlet.SolrDispatchFilter.doFilter(SolrDispatchFilter.java:207)
   [junit4]   2> 		at org.eclipse.jetty.servlet.ServletHandler$CachedChain.doFilter(ServletHandler.java:1419)
   [junit4]   2> 		at org.apache.solr.client.solrj.embedded.JettySolrRunner$DebugFilter.doFilter(JettySolrRunner.java:134)
   [junit4]   2> 		at org.eclipse.jetty.servlet.ServletHandler$CachedChain.doFilter(ServletHandler.java:1419)
   [junit4]   2> 		at org.eclipse.jetty.servlet.ServletHandler.doHandle(ServletHandler.java:455)
   [junit4]   2> 		at org.eclipse.jetty.server.session.SessionHandler.doHandle(SessionHandler.java:229)
   [junit4]   2> 		at org.eclipse.jetty.server.handler.ScopedHandler.handle(ScopedHandler.java:137)
   [junit4]   2> 		at org.eclipse.jetty.server.handler.GzipHandler.handle(GzipHandler.java:301)
   [junit4]   2> 		at org.eclipse.jetty.server.handler.ContextHandler.doHandle(ContextHandler.java:1077)
   [junit4]   2> 		at org.eclipse.jetty.servlet.ServletHandler.doScope(ServletHandler.java:384)
   [junit4]   2> 		at org.eclipse.jetty.server.session.SessionHandler.doScope(SessionHandler.java:193)
   [junit4]   2> 		at org.eclipse.jetty.server.handler.ContextHandler.doScope(ContextHandler.java:1009)
   [junit4]   2> 		at org.eclipse.jetty.server.handler.ScopedHandler.handle(ScopedHandler.java:135)
   [junit4]   2> 		at org.eclipse.jetty.server.handler.HandlerWrapper.handle(HandlerWrapper.java:116)
   [junit4]   2> 		at org.eclipse.jetty.server.Server.handle(Server.java:368)
   [junit4]   2> 		at org.eclipse.jetty.server.AbstractHttpConnection.handleRequest(AbstractHttpConnection.java:489)
   [junit4]   2> 		at org.eclipse.jetty.server.AbstractHttpConnection.content(AbstractHttpConnection.java:953)
   [junit4]   2> 		at org.eclipse.jetty.server.AbstractHttpConnection$RequestHandler.content(AbstractHttpConnection.java:1014)
   [junit4]   2> 		at org.eclipse.jetty.http.HttpParser.parseNext(HttpParser.java:861)
   [junit4]   2> 		at org.eclipse.jetty.http.HttpParser.parseAvailable(HttpParser.java:240)
   [junit4]   2> 		at org.eclipse.jetty.server.AsyncHttpConnection.handle(AsyncHttpConnection.java:82)
   [junit4]   2> 		at org.eclipse.jetty.io.nio.SslConnection.handle(SslConnection.java:196)
   [junit4]   2> 		at org.eclipse.jetty.io.nio.SelectChannelEndPoint.handle(SelectChannelEndPoint.java:628)
   [junit4]   2> 		at org.eclipse.jetty.io.nio.SelectChannelEndPoint$1.run(SelectChannelEndPoint.java:52)
   [junit4]   2> 		at org.eclipse.jetty.util.thread.QueuedThreadPool.runJob(QueuedThreadPool.java:608)
   [junit4]   2> 		at org.eclipse.jetty.util.thread.QueuedThreadPool$3.run(QueuedThreadPool.java:543)
   [junit4]   2> 		at java.lang.Thread.run(Thread.java:744)
   [junit4]   2> 	
   [junit4]   2> 212797 T39 C5 oasc.SolrException.log ERROR null:org.eclipse.jetty.io.EofException
   [junit4]   2> 		at org.eclipse.jetty.server.HttpOutput.write(HttpOutput.java:142)
   [junit4]   2> 		at org.eclipse.jetty.server.HttpOutput.write(HttpOutput.java:107)
   [junit4]   2> 		at org.apache.solr.common.util.FastOutputStream.flush(FastOutputStream.java:214)
   [junit4]   2> 		at org.apache.solr.common.util.FastOutputStream.flushBuffer(FastOutputStream.java:207)
   [junit4]   2> 		at org.apache.solr.common.util.JavaBinCodec.marshal(JavaBinCodec.java:98)
   [junit4]   2> 		at org.apache.solr.response.BinaryResponseWriter.write(BinaryResponseWriter.java:51)
   [junit4]   2> 		at org.apache.solr.servlet.SolrDispatchFilter.writeResponse(SolrDispatchFilter.java:755)
   [junit4]   2> 		at org.apache.solr.servlet.SolrDispatchFilter.doFilter(SolrDispatchFilter.java:431)
   [junit4]   2> 		at org.apache.solr.servlet.SolrDispatchFilter.doFilter(SolrDispatchFilter.java:207)
   [junit4]   2> 		at org.eclipse.jetty.servlet.ServletHandler$CachedChain.doFilter(ServletHandler.java:1419)
   [junit4]   2> 		at org.apache.solr.client.solrj.embedded.JettySolrRunner$DebugFilter.doFilter(JettySolrRunner.java:134)
   [junit4]   2> 		at org.eclipse.jetty.servlet.ServletHandler$CachedChain.doFilter(ServletHandler.java:1419)
   [junit4]   2> 		at org.eclipse.jetty.servlet.ServletHandler.doHandle(ServletHandler.java:455)
   [junit4]   2> 		at org.eclipse.jetty.server.session.SessionHandler.doHandle(SessionHandler.java:229)
   [junit4]   2> 		at org.eclipse.jetty.server.handler.ScopedHandler.handle(ScopedHandler.java:137)
   [junit4]   2> 		at org.eclipse.jetty.server.handler.GzipHandler.handle(GzipHandler.java:301)
   [junit4]   2> 		at org.eclipse.jetty.server.handler.ContextHandler.doHandle(ContextHandler.java:1077)
   [junit4]   2> 		at org.eclipse.jetty.servlet.ServletHandler.doScope(ServletHandler.java:384)
   [junit4]   2> 		at org.eclipse.jetty.server.session.SessionHandler.doScope(SessionHandler.java:193)
   [junit4]   2> 		at org.eclipse.jetty.server.handler.ContextHandler.doScope(ContextHandler.java:1009)
   [junit4]   2> 		at org.eclipse.jetty.server.handler.ScopedHandler.handle(ScopedHandler.java:135)
   [junit4]   2> 		at org.eclipse.jetty.server.handler.HandlerWrapper.handle(HandlerWrapper.java:116)
   [junit4]   2> 		at org.eclipse.jetty.server.Server.handle(Server.java:368)
   [junit4]   2> 		at org.eclipse.jetty.server.AbstractHttpConnection.handleRequest(AbstractHttpConnection.java:489)
   [junit4]   2> 		at org.eclipse.jetty.server.AbstractHttpConnection.content(AbstractHttpConnection.java:953)
   [junit4]   2> 		at org.eclipse.jetty.server.AbstractHttpConnection$RequestHandler.content(AbstractHttpConnection.java:1014)
   [junit4]   2> 		at org.eclipse.jetty.http.HttpParser.parseNext(HttpParser.java:861)
   [junit4]   2> 		at org.eclipse.jetty.http.HttpParser.parseAvailable(HttpParser.java:240)
   [junit4]   2> 		at org.eclipse.jetty.server.AsyncHttpConnection.handle(AsyncHttpConnection.java:82)
   [junit4]   2> 		at org.eclipse.jetty.io.nio.SslConnection.handle(SslConnection.java:196)
   [junit4]   2> 		at org.eclipse.jetty.io.nio.SelectChannelEndPoint.handle(SelectChannelEndPoint.java:628)
   [junit4]   2> 		at org.eclipse.jetty.io.nio.SelectChannelEndPoint$1.run(SelectChannelEndPoint.java:52)
   [junit4]   2> 		at org.eclipse.jetty.util.thread.QueuedThreadPool.runJob(QueuedThreadPool.java:608)
   [junit4]   2> 		at org.eclipse.jetty.util.thread.QueuedThreadPool$3.run(QueuedThreadPool.java:543)
   [junit4]   2> 		at java.lang.Thread.run(Thread.java:744)
   [junit4]   2> 	
   [junit4]   2> 212803 T39 C5 oasc.SolrCore.close [collection1]  CLOSING SolrCore org.apache.solr.core.SolrCore@47548925
   [junit4]   2> 212803 T39 C5 oasu.DirectUpdateHandler2.close closing DirectUpdateHandler2{commits=1,autocommits=0,soft autocommits=0,optimizes=0,rollbacks=0,expungeDeletes=0,docsPending=0,adds=0,deletesById=0,deletesByQuery=0,errors=0,cumulative_adds=1,cumulative_deletesById=0,cumulative_deletesByQuery=0,cumulative_errors=0,transaction_logs_total_size=109,transaction_logs_total_number=1}
   [junit4]   2> 212803 T39 C5 oasu.SolrCoreState.decrefSolrCoreState Closing SolrCoreState
   [junit4]   2> 212804 T39 C5 oasu.DefaultSolrCoreState.closeIndexWriter SolrCoreState ref count has reached 0 - closing IndexWriter
   [junit4]   2> 212804 T39 C5 oasu.DefaultSolrCoreState.closeIndexWriter closing IndexWriter with IndexWriterCloser
   [junit4]   2> 212807 T39 C5 oasc.SolrCore.closeSearcher [collection1] Closing main searcher on request.
   [junit4]   2> 212807 T39 C5 oasc.CachingDirectoryFactory.close Closing MockDirectoryFactory - 2 directories currently being tracked
   [junit4]   2> 212808 T39 C5 oasc.CachingDirectoryFactory.closeCacheValue looking to close /mnt/ssd/jenkins/workspace/Lucene-Solr-4.8-Linux/solr/build/solr-core/test/J0/solr.handler.component.DistributedDebugComponentTest-374283E7D66D1D8E-001/tempDir-002/index [CachedDir<<refCount=0;path=/mnt/ssd/jenkins/workspace/Lucene-Solr-4.8-Linux/solr/build/solr-core/test/J0/solr.handler.component.DistributedDebugComponentTest-374283E7D66D1D8E-001/tempDir-002/index;done=false>>]
   [junit4]   2> 212808 T39 C5 oasc.CachingDirectoryFactory.close Closing directory: /mnt/ssd/jenkins/workspace/Lucene-Solr-4.8-Linux/solr/build/solr-core/test/J0/solr.handler.component.DistributedDebugComponentTest-374283E7D66D1D8E-001/tempDir-002/index
   [junit4]   2> 212808 T39 C5 oasc.CachingDirectoryFactory.closeCacheValue looking to close /mnt/ssd/jenkins/workspace/Lucene-Solr-4.8-Linux/solr/build/solr-core/test/J0/solr.handler.component.DistributedDebugComponentTest-374283E7D66D1D8E-001/tempDir-002 [CachedDir<<refCount=0;path=/mnt/ssd/jenkins/workspace/Lucene-Solr-4.8-Linux/solr/build/solr-core/test/J0/solr.handler.component.DistributedDebugComponentTest-374283E7D66D1D8E-001/tempDir-002;done=false>>]
   [junit4]   2> 212808 T39 C5 oasc.CachingDirectoryFactory.close Closing directory: /mnt/ssd/jenkins/workspace/Lucene-Solr-4.8-Linux/solr/build/solr-core/test/J0/solr.handler.component.DistributedDebugComponentTest-374283E7D66D1D8E-001/tempDir-002
   [junit4]   2> NOTE: reproduce with: ant test  -Dtestcase=DistributedDebugComponentTest -Dtests.method=testSimpleSearch -Dtests.seed=374283E7D66D1D8E -Dtests.multiplier=3 -Dtests.slow=true -Dtests.locale=pt -Dtests.timezone=Asia/Aqtobe -Dtests.file.encoding=UTF-8
   [junit4] ERROR    203s J0 | DistributedDebugComponentTest.testSimpleSearch <<<
   [junit4]    > Throwable #1: org.apache.solr.client.solrj.SolrServerException: IOException occured when talking to server at: https://127.0.0.1:53428/solr
   [junit4]    > 	at __randomizedtesting.SeedInfo.seed([374283E7D66D1D8E:4B37ACAAE56E8376]:0)
   [junit4]    > 	at org.apache.solr.client.solrj.impl.HttpSolrServer.executeMethod(HttpSolrServer.java:567)
   [junit4]    > 	at org.apache.solr.client.solrj.impl.HttpSolrServer.request(HttpSolrServer.java:210)
   [junit4]    > 	at org.apache.solr.client.solrj.impl.HttpSolrServer.request(HttpSolrServer.java:206)
   [junit4]    > 	at org.apache.solr.client.solrj.request.AbstractUpdateRequest.process(AbstractUpdateRequest.java:124)
   [junit4]    > 	at org.apache.solr.client.solrj.SolrServer.commit(SolrServer.java:168)
   [junit4]    > 	at org.apache.solr.client.solrj.SolrServer.commit(SolrServer.java:146)
   [junit4]    > 	at org.apache.solr.handler.component.DistributedDebugComponentTest.setUp(DistributedDebugComponentTest.java:86)
   [junit4]    > 	at java.lang.Thread.run(Thread.java:744)
   [junit4]    > Caused by: org.apache.http.NoHttpResponseException: The target server failed to respond
   [junit4]    > 	at org.apache.http.impl.conn.DefaultHttpResponseParser.parseHead(DefaultHttpResponseParser.java:143)
   [junit4]    > 	at org.apache.http.impl.conn.DefaultHttpResponseParser.parseHead(DefaultHttpResponseParser.java:57)
   [junit4]    > 	at org.apache.http.impl.io.AbstractMessageParser.parse(AbstractMessageParser.java:260)
   [junit4]    > 	at org.apache.http.impl.AbstractHttpClientConnection.receiveResponseHeader(AbstractHttpClientConnection.java:283)
   [junit4]    > 	at org.apache.http.impl.conn.DefaultClientConnection.receiveResponseHeader(DefaultClientConnection.java:251)
   [junit4]    > 	at org.apache.http.impl.conn.ManagedClientConnectionImpl.receiveResponseHeader(ManagedClientConnectionImpl.java:197)
   [junit4]    > 	at org.apache.http.protocol.HttpRequestExecutor.doReceiveResponse(HttpRequestExecutor.java:271)
   [junit4]    > 	at org.apache.http.protocol.HttpRequestExecutor.execute(HttpRequestExecutor.java:123)
   [junit4]    > 	at org.apache.http.impl.client.DefaultRequestDirector.tryExecute(DefaultRequestDirector.java:682)
   [junit4]    > 	at org.apache.http.impl.client.DefaultRequestDirector.execute(DefaultRequestDirector.java:486)
   [junit4]    > 	at org.apache.http.impl.client.AbstractHttpClient.doExecute(AbstractHttpClient.java:863)
   [junit4]    > 	at org.apache.http.impl.client.CloseableHttpClient.execute(CloseableHttpClient.java:82)
   [junit4]    > 	at org.apache.http.impl.client.CloseableHttpClient.execute(CloseableHttpClient.java:106)
   [junit4]    > 	at org.apache.http.impl.client.CloseableHttpClient.execute(CloseableHttpClient.java:57)
   [junit4]    > 	at org.apache.solr.client.solrj.impl.HttpSolrServer.executeMethod(HttpSolrServer.java:452)
   [junit4]    > 	... 45 more
   [junit4]   2> 212884 T37 oas.SolrTestCaseJ4.deleteCore ###deleteCore
   [junit4]   2> NOTE: leaving temporary files on disk at: /mnt/ssd/jenkins/workspace/Lucene-Solr-4.8-Linux/solr/build/solr-core/test/J0/./solr.handler.component.DistributedDebugComponentTest-374283E7D66D1D8E-001
   [junit4]   2> NOTE: test params are: codec=Lucene42, sim=DefaultSimilarity, locale=pt, timezone=Asia/Aqtobe
   [junit4]   2> NOTE: Linux 3.8.0-38-generic amd64/Oracle Corporation 1.8.0 (64-bit)/cpus=8,threads=1,free=23845096,total=198705152
   [junit4]   2> NOTE: All tests run in this JVM: [SolrIndexSplitterTest, TestSchemaVersionResource, DistributedDebugComponentTest]
   [junit4] Completed on J0 in 202.84s, 1 test, 1 error <<< FAILURES!

[...truncated 995 lines...]
   [junit4] Suite: org.apache.solr.cloud.CustomCollectionTest
   [junit4]   2> Creating dataDir: /mnt/ssd/jenkins/workspace/Lucene-Solr-4.8-Linux/solr/build/solr-core/test/J0/./solr.cloud.CustomCollectionTest-374283E7D66D1D8E-001/init-core-data-001
   [junit4]   2> 1246589 T5073 oas.SolrTestCaseJ4.buildSSLConfig Randomized ssl (true) and clientAuth (false)
   [junit4]   2> 1246589 T5073 oas.BaseDistributedSearchTestCase.initHostContext Setting hostContext system property: /ys/ho
   [junit4]   2> 1246592 T5073 oas.SolrTestCaseJ4.setUp ###Starting testDistribSearch
   [junit4]   2> 1246592 T5073 oasc.ZkTestServer.run STARTING ZK TEST SERVER
   [junit4]   2> 1246592 T5074 oasc.ZkTestServer$ZKServerMain.runFromConfig Starting server
   [junit4]   2> 1246692 T5073 oasc.ZkTestServer.run start zk server on port:38615
   [junit4]   2> 1246694 T5073 oascc.ConnectionManager.waitForConnected Waiting for client to connect to ZooKeeper
   [junit4]   2> 1255945 T5077 oazsp.FileTxnLog.commit WARN fsync-ing the write ahead log in SyncThread:0 took 9249ms which will adversely effect operation latency. See the ZooKeeper troubleshooting guide
   [junit4]   2> 1255947 T5080 oascc.ConnectionManager.process Watcher org.apache.solr.common.cloud.ConnectionManager@704a1151 name:ZooKeeperConnection Watcher:127.0.0.1:38615 got event WatchedEvent state:SyncConnected type:None path:null path:null type:None
   [junit4]   2> 1255947 T5073 oascc.ConnectionManager.waitForConnected Client is connected to ZooKeeper
   [junit4]   2> 1255948 T5073 oascc.SolrZkClient.makePath makePath: /solr
   [junit4]   2> 1255955 T5073 oascc.ConnectionManager.waitForConnected Waiting for client to connect to ZooKeeper
   [junit4]   2> 1255957 T5082 oascc.ConnectionManager.process Watcher org.apache.solr.common.cloud.ConnectionManager@22be589f name:ZooKeeperConnection Watcher:127.0.0.1:38615/solr got event WatchedEvent state:SyncConnected type:None path:null path:null type:None
   [junit4]   2> 1255957 T5073 oascc.ConnectionManager.waitForConnected Client is connected to ZooKeeper
   [junit4]   2> 1255958 T5073 oascc.SolrZkClient.makePath makePath: /collections/collection1
   [junit4]   2> 1255962 T5073 oascc.SolrZkClient.makePath makePath: /collections/collection1/shards
   [junit4]   2> 1255966 T5073 oascc.SolrZkClient.makePath makePath: /collections/control_collection
   [junit4]   2> 1255968 T5073 oascc.SolrZkClient.makePath makePath: /collections/control_collection/shards
   [junit4]   2> 1255971 T5073 oasc.AbstractZkTestCase.putConfig put /mnt/ssd/jenkins/workspace/Lucene-Solr-4.8-Linux/solr/core/src/test-files/solr/collection1/conf/solrconfig-tlog.xml to /configs/conf1/solrconfig.xml
   [junit4]   2> 1255971 T5073 oascc.SolrZkClient.makePath makePath: /configs/conf1/solrconfig.xml
   [junit4]   2> 1255975 T5073 oasc.AbstractZkTestCase.putConfig put /mnt/ssd/jenkins/workspace/Lucene-Solr-4.8-Linux/solr/core/src/test-files/solr/collection1/conf/schema.xml to /configs/conf1/schema.xml
   [junit4]   2> 1255976 T5073 oascc.SolrZkClient.makePath makePath: /configs/conf1/schema.xml
   [junit4]   2> 1255979 T5073 oasc.AbstractZkTestCase.putConfig put /mnt/ssd/jenkins/workspace/Lucene-Solr-4.8-Linux/solr/core/src/test-files/solr/collection1/conf/solrconfig.snippet.randomindexconfig.xml to /configs/conf1/solrconfig.snippet.randomindexconfig.xml
   [junit4]   2> 1255980 T5073 oascc.SolrZkClient.makePath makePath: /configs/conf1/solrconfig.snippet.randomindexconfig.xml
   [junit4]   2> 1255983 T5073 oasc.AbstractZkTestCase.putConfig put /mnt/ssd/jenkins/workspace/Lucene-Solr-4.8-Linux/solr/core/src/test-files/solr/collection1/conf/stopwords.txt to /configs/conf1/stopwords.txt
   [junit4]   2> 1255984 T5073 oascc.SolrZkClient.makePath makePath: /configs/conf1/stopwords.txt
   [junit4]   2> 1255987 T5073 oasc.AbstractZkTestCase.putConfig put /mnt/ssd/jenkins/workspace/Lucene-Solr-4.8-Linux/solr/core/src/test-files/solr/collection1/conf/protwords.txt to /configs/conf1/protwords.txt
   [junit4]   2> 1255988 T5073 oascc.SolrZkClient.makePath makePath: /configs/conf1/protwords.txt
   [junit4]   2> 1255991 T5073 oasc.AbstractZkTestCase.putConfig put /mnt/ssd/jenkins/workspace/Lucene-Solr-4.8-Linux/solr/core/src/test-files/solr/collection1/conf/currency.xml to /configs/conf1/currency.xml
   [junit4]   2> 1255992 T5073 oascc.SolrZkClient.makePath makePath: /configs/conf1/currency.xml
   [junit4]   2> 1255995 T5073 oasc.AbstractZkTestCase.putConfig put /mnt/ssd/jenkins/workspace/Lucene-Solr-4.8-Linux/solr/core/src/test-files/solr/collection1/conf/enumsConfig.xml to /configs/conf1/enumsConfig.xml
   [junit4]   2> 1255995 T5073 oascc.SolrZkClient.makePath makePath: /configs/conf1/enumsConfig.xml
   [junit4]   2> 1255999 T5073 oasc.AbstractZkTestCase.putConfig put /mnt/ssd/jenkins/workspace/Lucene-Solr-4.8-Linux/solr/core/src/test-files/solr/collection1/conf/open-exchange-rates.json to /configs/conf1/open-exchange-rates.json
   [junit4]   2> 1255999 T5073 oascc.SolrZkClient.makePath makePath: /configs/conf1/open-exchange-rates.json
   [junit4]   2> 1256001 T5073 oasc.AbstractZkTestCase.putConfig put /mnt/ssd/jenkins/workspace/Lucene-Solr-4.8-Linux/solr/core/src/test-files/solr/collection1/conf/mapping-ISOLatin1Accent.txt to /configs/conf1/mapping-ISOLatin1Accent.txt
   [junit4]   2> 1256002 T5073 oascc.SolrZkClient.makePath makePath: /configs/conf1/mapping-ISOLatin1Accent.txt
   [junit4]   2> 1256004 T5073 oasc.AbstractZkTestCase.putConfig put /mnt/ssd/jenkins/workspace/Lucene-Solr-4.8-Linux/solr/core/src/test-files/solr/collection1/conf/old_synonyms.txt to /configs/conf1/old_synonyms.txt
   [junit4]   2> 1256005 T5073 oascc.SolrZkClient.makePath makePath: /configs/conf1/old_synonyms.txt
   [junit4]   2> 1256007 T5073 oasc.AbstractZkTestCase.putConfig put /mnt/ssd/jenkins/workspace/Lucene-Solr-4.8-Linux/solr/core/src/test-files/solr/collection1/conf/synonyms.txt to /configs/conf1/synonyms.txt
   [junit4]   2> 1256008 T5073 oascc.SolrZkClient.makePath makePath: /configs/conf1/synonyms.txt
   [junit4]   2> 1256010 T5073 oascc.ConnectionManager.waitForConnected Waiting for client to connect to ZooKeeper
   [junit4]   2> 1256011 T5084 oascc.ConnectionManager.process Watcher org.apache.solr.common.cloud.ConnectionManager@cd6802 name:ZooKeeperConnection Watcher:127.0.0.1:38615/solr got event WatchedEvent state:SyncConnected type:None path:null path:null type:None
   [junit4]   2> 1256012 T5073 oascc.ConnectionManager.waitForConnected Client is connected to ZooKeeper
   [junit4]   2> 1256247 T5073 oejs.Server.doStart jetty-8.1.10.v20130312
   [junit4]   2> 1256250 T5073 oejus.SslContextFactory.doStart Enabled Protocols [SSLv2Hello, SSLv3, TLSv1, TLSv1.1, TLSv1.2] of [SSLv2Hello, SSLv3, TLSv1, TLSv1.1, TLSv1.2]
   [junit4]   2> 1256252 T5073 oejs.AbstractConnector.doStart Started SslSelectChannelConnector@127.0.0.1:32903
   [junit4]   2> 1256254 T5073 oass.SolrDispatchFilter.init SolrDispatchFilter.init()
   [junit4]   2> 1256254 T5073 oasc.SolrResourceLoader.locateSolrHome JNDI not configured for solr (NoInitialContextEx)
   [junit4]   2> 1256254 T5073 oasc.SolrResourceLoader.locateSolrHome using system property solr.solr.home: ./solr.cloud.CustomCollectionTest-374283E7D66D1D8E-001/tempDir-002
   [junit4]   2> 1256254 T5073 oasc.SolrResourceLoader.<init> new SolrResourceLoader for directory: './solr.cloud.CustomCollectionTest-374283E7D66D1D8E-001/tempDir-002/'
   [junit4]   2> 1256264 T5073 oasc.ConfigSolr.fromFile Loading container configuration from /mnt/ssd/jenkins/workspace/Lucene-Solr-4.8-Linux/solr/build/solr-core/test/J0/./solr.cloud.CustomCollectionTest-374283E7D66D1D8E-001/tempDir-002/solr.xml
   [junit4]   2> 1256271 T5073 oasc.CorePropertiesLocator.<init> Config-defined core root directory: /mnt/ssd/jenkins/workspace/Lucene-Solr-4.8-Linux/solr/build/solr-core/test/J0/./solr.cloud.CustomCollectionTest-374283E7D66D1D8E-001/tempDir-002
   [junit4]   2> 1256272 T5073 oasc.CoreContainer.<init> New CoreContainer 478012213
   [junit4]   2> 1256272 T5073 oasc.CoreContainer.load Loading cores into CoreContainer [instanceDir=./solr.cloud.CustomCollectionTest-374283E7D66D1D8E-001/tempDir-002/]
   [junit4]   2> 1256272 T5073 oashc.HttpShardHandlerFactory.getParameter Setting socketTimeout to: 90000
   [junit4]   2> 1256272 T5073 oashc.HttpShardHandlerFactory.getParameter Setting urlScheme to: 
   [junit4]   2> 1256273 T5073 oashc.HttpShardHandlerFactory.getParameter Setting connTimeout to: 15000
   [junit4]   2> 1256273 T5073 oashc.HttpShardHandlerFactory.getParameter Setting maxConnectionsPerHost to: 20
   [junit4]   2> 1256273 T5073 oashc.HttpShardHandlerFactory.getParameter Setting corePoolSize to: 0
   [junit4]   2> 1256273 T5073 oashc.HttpShardHandlerFactory.getParameter Setting maximumPoolSize to: 2147483647
   [junit4]   2> 1256274 T5073 oashc.HttpShardHandlerFactory.getParameter Setting maxThreadIdleTime to: 5
   [junit4]   2> 1256274 T5073 oashc.HttpShardHandlerFactory.getParameter Setting sizeOfQueue to: -1
   [junit4]   2> 1256274 T5073 oashc.HttpShardHandlerFactory.getParameter Setting fairnessPolicy to: false
   [junit4]   2> 1256275 T5073 oasl.LogWatcher.createWatcher SLF4J impl is org.slf4j.impl.Log4jLoggerFactory
   [junit4]   2> 1256276 T5073 oasl.LogWatcher.newRegisteredLogWatcher Registering Log Listener [Log4j (org.slf4j.impl.Log4jLoggerFactory)]
   [junit4]   2> 1256276 T5073 oasc.CoreContainer.load Host Name: 127.0.0.1
   [junit4]   2> 1256276 T5073 oasc.ZkContainer.initZooKeeper Zookeeper client=127.0.0.1:38615/solr
   [junit4]   2> 1256276 T5073 oasc.ZkController.checkChrootPath zkHost includes chroot
   [junit4]   2> 1256277 T5073 oascc.ConnectionManager.waitForConnected Waiting for client to connect to ZooKeeper
   [junit4]   2> 1256278 T5095 oascc.ConnectionManager.process Watcher org.apache.solr.common.cloud.ConnectionManager@2c4a09c name:ZooKeeperConnection Watcher:127.0.0.1:38615 got event WatchedEvent state:SyncConnected type:None path:null path:null type:None
   [junit4]   2> 1256278 T5073 oascc.ConnectionManager.waitForConnected Client is connected to ZooKeeper
   [junit4]   2> 1256279 T5073 oascc.ConnectionManager.waitForConnected Waiting for client to connect to ZooKeeper
   [junit4]   2> 1256280 T5097 oascc.ConnectionManager.process Watcher org.apache.solr.common.cloud.ConnectionManager@62d2d1ad name:ZooKeeperConnection Watcher:127.0.0.1:38615/solr got event WatchedEvent state:SyncConnected type:None path:null path:null type:None
   [junit4]   2> 1256280 T5073 oascc.ConnectionManager.waitForConnected Client is connected to ZooKeeper
   [junit4]   2> 1256281 T5073 oascc.SolrZkClient.makePath makePath: /overseer/queue
   [junit4]   2> 1256283 T5073 oascc.SolrZkClient.makePath makePath: /overseer/collection-queue-work
   [junit4]   2> 1256287 T5073 oascc.SolrZkClient.makePath makePath: /overseer/collection-map-running
   [junit4]   2> 1256289 T5073 oascc.SolrZkClient.makePath makePath: /overseer/collection-map-completed
   [junit4]   2> 1256295 T5073 oascc.SolrZkClient.makePath makePath: /overseer/collection-map-failure
   [junit4]   2> 1256297 T5073 oascc.SolrZkClient.makePath makePath: /live_nodes
   [junit4]   2> 1256297 T5073 oasc.ZkController.createEphemeralLiveNode Register node as live in ZooKeeper:/live_nodes/127.0.0.1:32903_ys%2Fho
   [junit4]   2> 1256298 T5073 oascc.SolrZkClient.makePath makePath: /live_nodes/127.0.0.1:32903_ys%2Fho
   [junit4]   2> 1256299 T5073 oascc.SolrZkClient.makePath makePath: /overseer_elect
   [junit4]   2> 1256300 T5073 oascc.SolrZkClient.makePath makePath: /overseer_elect/election
   [junit4]   2> 1256302 T5073 oasc.OverseerElectionContext.runLeaderProcess I am going to be the leader 127.0.0.1:32903_ys%2Fho
   [junit4]   2> 1256302 T5073 oascc.SolrZkClient.makePath makePath: /overseer_elect/leader
   [junit4]   2> 1256303 T5073 oasc.Overseer.start Overseer (id=91595218054152196-127.0.0.1:32903_ys%2Fho-n_0000000000) starting
   [junit4]   2> 1256304 T5073 oascc.SolrZkClient.makePath makePath: /overseer/queue-work
   [junit4]   2> 1256309 T5099 oasc.OverseerCollectionProcessor.run Process current queue of collection creations
   [junit4]   2> 1256309 T5073 oascc.SolrZkClient.makePath makePath: /clusterstate.json
   [junit4]   2> 1256310 T5099 oasc.OverseerCollectionProcessor.prioritizeOverseerNodes prioritizing overseer nodes at 127.0.0.1:32903_ys%2Fho
   [junit4]   2> 1256310 T5073 oascc.SolrZkClient.makePath makePath: /aliases.json
   [junit4]   2> 1256311 T5073 oascc.ZkStateReader.createClusterStateWatchersAndUpdate Updating cluster state from ZooKeeper... 
   [junit4]   2> 1256312 T5098 oasc.Overseer$ClusterStateUpdater.run Starting to work on the main queue
   [junit4]   2> 1256313 T5073 oasc.CorePropertiesLocator.discover Looking for core definitions underneath /mnt/ssd/jenkins/workspace/Lucene-Solr-4.8-Linux/solr/build/solr-core/test/J0/./solr.cloud.CustomCollectionTest-374283E7D66D1D8E-001/tempDir-002
   [junit4]   2> 1256318 T5073 oasc.CorePropertiesLocator.discoverUnder Found core conf in /mnt/ssd/jenkins/workspace/Lucene-Solr-4.8-Linux/solr/build/solr-core/test/J0/./solr.cloud.CustomCollectionTest-374283E7D66D1D8E-001/tempDir-002/conf/
   [junit4]   2> 1256412 T5073 oasc.CorePropertiesLocator.discover Found 1 core definitions
   [junit4]   2> 1256414 T5073 oass.SolrDispatchFilter.init user.dir=/mnt/ssd/jenkins/workspace/Lucene-Solr-4.8-Linux/solr/build/solr-core/test/J0
   [junit4]   2> 1256414 T5073 oass.SolrDispatchFilter.init SolrDispatchFilter.init() done
   [junit4]   2> 1256416 T5073 oascc.ConnectionManager.waitForConnected Waiting for client to connect to ZooKeeper
   [junit4]   2> 1256429 T5102 oascc.ConnectionManager.process Watcher org.apache.solr.common.cloud.ConnectionManager@1cb4933e name:ZooKeeperConnection Watcher:127.0.0.1:38615/solr got event WatchedEvent state:SyncConnected type:None path:null path:null type:None
   [junit4]   2> 1256430 T5073 oascc.ConnectionManager.waitForConnected Client is connected to ZooKeeper
   [junit4]   2> 1256430 T5073 oascc.ZkStateReader.createClusterStateWatchersAndUpdate Updating cluster state from ZooKeeper... 
   [junit4]   2> 1256432 T5073 oasc.ChaosMonkey.monkeyLog monkey: init - expire sessions:false cause connection loss:false
   [junit4]   2> 1256676 T5073 oasc.AbstractFullDistribZkTestBase.createJettys create jetty 1
   [junit4]   2> 1256676 T5073 oejs.Server.doStart jetty-8.1.10.v20130312
   [junit4]   2> 1256679 T5073 oejus.SslContextFactory.doStart Enabled Protocols [SSLv2Hello, SSLv3, TLSv1, TLSv1.1, TLSv1.2] of [SSLv2Hello, SSLv3, TLSv1, TLSv1.1, TLSv1.2]
   [junit4]   2> 1256679 T5073 oejs.AbstractConnector.doStart Started SslSelectChannelConnector@127.0.0.1:38412
   [junit4]   2> 1256681 T5073 oass.SolrDispatchFilter.init SolrDispatchFilter.init()
   [junit4]   2> 1256681 T5073 oasc.SolrResourceLoader.locateSolrHome JNDI not configured for solr (NoInitialContextEx)
   [junit4]   2> 1256681 T5073 oasc.SolrResourceLoader.locateSolrHome using system property solr.solr.home: ../../../../../../../../../../mnt/ssd/jenkins/workspace/Lucene-Solr-4.8-Linux/solr/build/solr-core/test/J0/./solr.cloud.CustomCollectionTest-374283E7D66D1D8E-001/tempDir-003
   [junit4]   2> 1256682 T5073 oasc.SolrResourceLoader.<init> new SolrResourceLoader for directory: '../../../../../../../../../../mnt/ssd/jenkins/workspace/Lucene-Solr-4.8-Linux/solr/build/solr-core/test/J0/./solr.cloud.CustomCollectionTest-374283E7D66D1D8E-001/tempDir-003/'
   [junit4]   2> 1256692 T5073 oasc.ConfigSolr.fromFile Loading container configuration from /mnt/ssd/jenkins/workspace/Lucene-Solr-4.8-Linux/solr/build/solr-core/test/J0/../../../../../../../../../../mnt/ssd/jenkins/workspace/Lucene-Solr-4.8-Linux/solr/build/solr-core/test/J0/./solr.cloud.CustomCollectionTest-374283E7D66D1D8E-001/tempDir-003/solr.xml
   [junit4]   2> 1256699 T5073 oasc.CorePropertiesLocator.<init> Config-defined core root directory: /mnt/ssd/jenkins/workspace/Lucene-Solr-4.8-Linux/solr/build/solr-core/test/J0/../../../../../../../../../../mnt/ssd/jenkins/workspace/Lucene-Solr-4.8-Linux/solr/build/solr-core/test/J0/./solr.cloud.CustomCollectionTest-374283E7D66D1D8E-001/tempDir-003
   [junit4]   2> 1256700 T5073 oasc.CoreContainer.<init> New CoreContainer 85093889
   [junit4]   2> 1256700 T5073 oasc.CoreContainer.load Loading cores into CoreContainer [instanceDir=../../../../../../../../../../mnt/ssd/jenkins/workspace/Lucene-Solr-4.8-Linux/solr/build/solr-core/test/J0/./solr.cloud.CustomCollectionTest-374283E7D66D1D8E-001/tempDir-003/]
   [junit4]   2> 1256700 T5073 oashc.HttpShardHandlerFactory.getParameter Setting socketTimeout to: 90000
   [junit4]   2> 1256700 T5073 oashc.HttpShardHandlerFactory.getParameter Setting urlScheme to: 
   [junit4]   2> 1256701 T5073 oashc.HttpShardHandlerFactory.getParameter Setting connTimeout to: 15000
   [junit4]   2> 1256701 T5073 oashc.HttpShardHandlerFactory.getParameter Setting maxConnectionsPerHost to: 20
   [junit4]   2> 1256701 T5073 oashc.HttpShardHandlerFactory.getParameter Setting corePoolSize to: 0
   [junit4]   2> 1256701 T5073 oashc.HttpShardHandlerFactory.getParameter Setting maximumPoolSize to: 2147483647
   [junit4]   2> 1256701 T5073 oashc.HttpShardHandlerFactory.getParameter Setting maxThreadIdleTime to: 5
   [junit4]   2> 1256702 T5073 oashc.HttpShardHandlerFactory.getParameter Setting sizeOfQueue to: -1
   [junit4]   2> 1256702 T5073 oashc.HttpShardHandlerFactory.getParameter Setting fairnessPolicy to: false
   [junit4]   2> 1256703 T5073 oasl.LogWatcher.createWatcher SLF4J impl is org.slf4j.impl.Log4jLoggerFactory
   [junit4]   2> 1256704 T5073 oasl.LogWatcher.newRegisteredLogWatcher Registering Log Listener [Log4j (org.slf4j.impl.Log4jLoggerFactory)]
   [junit4]   2> 1256704 T5073 oasc.CoreContainer.load Host Name: 127.0.0.1
   [junit4]   2> 1256704 T5073 oasc.ZkContainer.initZooKeeper Zookeeper client=127.0.0.1:38615/solr
   [junit4]   2> 1256704 T5073 oasc.ZkController.checkChrootPath zkHost includes chroot
   [junit4]   2> 1256705 T5073 oascc.ConnectionManager.waitForConnected Waiting for client to connect to ZooKeeper
   [junit4]   2> 1256707 T5113 oascc.ConnectionManager.process Watcher org.apache.solr.common.cloud.ConnectionManager@1d439521 name:ZooKeeperConnection Watcher:127.0.0.1:38615 got event WatchedEvent state:SyncConnected type:None path:null path:null type:None
   [junit4]   2> 1256707 T5073 oascc.ConnectionManager.waitForConnected Client is connected to ZooKeeper
   [junit4]   2> 1256708 T5073 oascc.ConnectionManager.waitForConnected Waiting for client to connect to ZooKeeper
   [junit4]   2> 1256709 T5115 oascc.ConnectionManager.process Watcher org.apache.solr.common.cloud.ConnectionManager@6d53d3ca name:ZooKeeperConnection Watcher:127.0.0.1:38615/solr got event WatchedEvent state:SyncConnected type:None path:null path:null type:None
   [junit4]   2> 1256709 T5073 oascc.ConnectionManager.waitForConnected Client is connected to ZooKeeper
   [junit4]   2> 1256713 T5073 oascc.ZkStateReader.createClusterStateWatchersAndUpdate Updating cluster state from ZooKeeper... 
   [junit4]   2> 1257715 T5073 oasc.ZkController.createEphemeralLiveNode Register node as live in ZooKeeper:/live_nodes/127.0.0.1:38412_ys%2Fho
   [junit4]   2> 1257718 T5073 oascc.SolrZkClient.makePath makePath: /live_nodes/127.0.0.1:38412_ys%2Fho
   [junit4]   2> 1257720 T5097 oascc.ZkStateReader$3.process Updating live nodes... (2)
   [junit4]   2> 1257720 T5115 oascc.ZkStateReader$3.process Updating live nodes... (2)
   [junit4]   2> 1257720 T5102 oascc.ZkStateReader$3.process Updating live nodes... (2)
   [junit4]   2> 1257722 T5073 oasc.CorePropertiesLocator.discover Looking for core definitions underneath /mnt/ssd/jenkins/workspace/Lucene-Solr-4.8-Linux/solr/build/solr-core/test/J0/../../../../../../../../../../mnt/ssd/jenkins/workspace/Lucene-Solr-4.8-Linux/solr/build/solr-core/test/J0/./solr.cloud.CustomCollectionTest-374283E7D66D1D8E-001/tempDir-003
   [junit4]   2> 1257730 T5073 oasc.CorePropertiesLocator.discoverUnder Found core conf in /mnt/ssd/jenkins/workspace/Lucene-Solr-4.8-Linux/solr/build/solr-core/test/J0/../../../../../../../../../../mnt/ssd/jenkins/workspace/Lucene-Solr-4.8-Linux/solr/build/solr-core/test/J0/./solr.cloud.CustomCollectionTest-374283E7D66D1D8E-001/tempDir-003/conf/
   [junit4]   2> 1257849 T5073 oasc.CorePropertiesLocator.discover Found 1 core definitions
   [junit4]   2> 1257850 T5073 oass.SolrDispatchFilter.init user.dir=/mnt/ssd/jenkins/workspace/Lucene-Solr-4.8-Linux/solr/build/solr-core/test/J0
   [junit4]   2> 1257850 T5073 oass.SolrDispatchFilter.init SolrDispatchFilter.init() done
   [junit4]   2> 1258081 T5073 oasc.AbstractFullDistribZkTestBase.createJettys create jetty 2
   [junit4]   2> 1258082 T5073 oejs.Server.doStart jetty-8.1.10.v20130312
   [junit4]   2> 1258084 T5073 oejus.SslContextFactory.doStart Enabled Protocols [SSLv2Hello, SSLv3, TLSv1, TLSv1.1, TLSv1.2] of [SSLv2Hello, SSLv3, TLSv1, TLSv1.1, TLSv1.2]
   [junit4]   2> 1258085 T5073 oejs.AbstractConnector.doStart Started SslSelectChannelConnector@127.0.0.1:57917
   [junit4]   2> 1258086 T5073 oass.SolrDispatchFilter.init SolrDispatchFilter.init()
   [junit4]   2> 1258087 T5073 oasc.SolrResourceLoader.locateSolrHome JNDI not configured for solr (NoInitialContextEx)
   [junit4]   2> 1258087 T5073 oasc.SolrResourceLoader.locateSolrHome using system property solr.solr.home: ./solr.cloud.CustomCollectionTest-374283E7D66D1D8E-001/tempDir-004
   [junit4]   2> 1258087 T5073 oasc.SolrResourceLoader.<init> new SolrResourceLoader for directory: './solr.cloud.CustomCollectionTest-374283E7D66D1D8E-001/tempDir-004/'
   [junit4]   2> 1258097 T5073 oasc.ConfigSolr.fromFile Loading container configuration from /mnt/ssd/jenkins/workspace/Lucene-Solr-4.8-Linux/solr/build/solr-core/test/J0/./solr.cloud.CustomCollectionTest-374283E7D66D1D8E-001/tempDir-004/solr.xml
   [junit4]   2> 1258103 T5073 oasc.CorePropertiesLocator.<init> Config-defined core root directory: /mnt/ssd/jenkins/workspace/Lucene-Solr-4.8-Linux/solr/build/solr-core/test/J0/./solr.cloud.CustomCollectionTest-374283E7D66D1D8E-001/tempDir-004
   [junit4]   2> 1258104 T5073 oasc.CoreContainer.<init> New CoreContainer 220325489
   [junit4]   2> 1258104 T5073 oasc.CoreContainer.load Loading cores into CoreContainer [instanceDir=./solr.cloud.CustomCollectionTest-374283E7D66D1D8E-001/tempDir-004/]
   [junit4]   2> 1258104 T5073 oashc.HttpShardHandlerFactory.getParameter Setting socketTimeout to: 90000
   [junit4]   2> 1258104 T5073 oashc.HttpShardHandlerFactory.getParameter Setting urlScheme to: 
   [junit4]   2> 1258105 T5073 oashc.HttpShardHandlerFactory.getParameter Setting connTimeout to: 15000
   [junit4]   2> 1258105 T5073 oashc.HttpShardHandlerFactory.getParameter Setting maxConnectionsPerHost to: 20
   [junit4]   2> 1258105 T5073 oashc.HttpShardHandlerFactory.getParameter Setting corePoolSize to: 0
   [junit4]   2> 1258105 T5073 oashc.HttpShardHandlerFactory.getParameter Setting maximumPoolSize to: 2147483647
   [junit4]   2> 1258106 T5073 oashc.HttpShardHandlerFactory.getParameter Setting maxThreadIdleTime to: 5
   [junit4]   2> 1258106 T5073 oashc.HttpShardHandlerFactory.getParameter Setting sizeOfQueue to: -1
   [junit4]   2> 1258106 T5073 oashc.HttpShardHandlerFactory.getParameter Setting fairnessPolicy to: false
   [junit4]   2> 1258107 T5073 oasl.LogWatcher.createWatcher SLF4J impl is org.slf4j.impl.Log4jLoggerFactory
   [junit4]   2> 1258108 T5073 oasl.LogWatcher.newRegisteredLogWatcher Registering Log Listener [Log4j (org.slf4j.impl.Log4jLoggerFactory)]
   [junit4]   2> 1258108 T5073 oasc.CoreContainer.load Host Name: 127.0.0.1
   [junit4]   2> 1258108 T5073 oasc.ZkContainer.initZooKeeper Zookeeper client=127.0.0.1:38615/solr
   [junit4]   2> 1258108 T5073 oasc.ZkController.checkChrootPath zkHost includes chroot
   [junit4]   2> 1258109 T5073 oascc.ConnectionManager.waitForConnected Waiting for client to connect to ZooKeeper
   [junit4]   2> 1258110 T5127 oascc.ConnectionManager.process Watcher org.apache.solr.common.cloud.ConnectionManager@3e75bc5b name:ZooKeeperConnection Watcher:127.0.0.1:38615 got event WatchedEvent state:SyncConnected type:None path:null path:null type:None
   [junit4]   2> 1258110 T5073 oascc.ConnectionManager.waitForConnected Client is connected to ZooKeeper
   [junit4]   2> 1258112 T5073 oascc.ConnectionManager.waitForConnected Waiting for client to connect to ZooKeeper
   [junit4]   2> 1258113 T5129 oascc.ConnectionManager.process Watcher org.apache.solr.common.cloud.ConnectionManager@5b42f5b9 name:ZooKeeperConnection Watcher:127.0.0.1:38615/solr got event WatchedEvent state:SyncConnected type:None path:null path:null type:None
   [junit4]   2> 1258113 T5073 oascc.ConnectionManager.waitForConnected Client is connected to ZooKeeper
   [junit4]   2> 1258117 T5073 oascc.ZkStateReader.createClusterStateWatchersAndUpdate Updating cluster state from ZooKeeper... 
   [junit4]   2> 1259118 T5073 oasc.ZkController.createEphemeralLiveNode Register node as live in ZooKeeper:/live_nodes/127.0.0.1:57917_ys%2Fho
   [junit4]   2> 1259120 T5073 oascc.SolrZkClient.makePath makePath: /live_nodes/127.0.0.1:57917_ys%2Fho
   [junit4]   2> 1259121 T5115 oascc.ZkStateReader$3.process Updating live nodes... (3)
   [junit4]   2> 1259122 T5097 oascc.ZkStateReader$3.process Updating live nodes... (3)
   [junit4]   2> 1259122 T5129 oascc.ZkStateReader$3.process Updating live nodes... (3)
   [junit4]   2> 1259121 T5102 oascc.ZkStateReader$3.process Updating live nodes... (3)
   [junit4]   2> 1259124 T5073 oasc.CorePropertiesLocator.discover Looking for core definitions underneath /mnt/ssd/jenkins/workspace/Lucene-Solr-4.8-Linux/solr/build/solr-core/test/J0/./solr.cloud.CustomCollectionTest-374283E7D66D1D8E-001/tempDir-004
   [junit4]   2> 1259129 T5073 oasc.CorePropertiesLocator.discoverUnder Found core conf in /mnt/ssd/jenkins/workspace/Lucene-Solr-4.8-Linux/solr/build/solr-core/test/J0/./solr.cloud.CustomCollectionTest-374283E7D66D1D8E-001/tempDir-004/conf/
   [junit4]   2> 1259224 T5073 oasc.CorePropertiesLocator.discover Found 1 core definitions
   [junit4]   2> 1259225 T5073 oass.SolrDispatchFilter.init user.dir=/mnt/ssd/jenkins/workspace/Lucene-Solr-4.8-Linux/solr/build/solr-core/test/J0
   [junit4]   2> 1259225 T5073 oass.SolrDispatchFilter.init SolrDispatchFilter.init() done
   [junit4]   2> 1259454 T5073 oasc.AbstractFullDistribZkTestBase.createJettys create jetty 3
   [junit4]   2> 1259454 T5073 oejs.Server.doStart jetty-8.1.10.v20130312
   [junit4]   2> 1259457 T5073 oejus.SslContextFactory.doStart Enabled Protocols [SSLv2Hello, SSLv3, TLSv1, TLSv1.1, TLSv1.2] of [SSLv2Hello, SSLv3, TLSv1, TLSv1.1, TLSv1.2]
   [junit4]   2> 1259458 T5073 oejs.AbstractConnector.doStart Started SslSelectChannelConnector@127.0.0.1:47065
   [junit4]   2> 1259459 T5073 oass.SolrDispatchFilter.init SolrDispatchFilter.init()
   [junit4]   2> 1259460 T5073 oasc.SolrResourceLoader.locateSolrHome JNDI not configured for solr (NoInitialContextEx)
   [junit4]   2> 1259460 T5073 oasc.SolrResourceLoader.locateSolrHome using system property solr.solr.home: ../../../../../../../../../../mnt/ssd/jenkins/workspace/Lucene-Solr-4.8-Linux/solr/build/solr-core/test/J0/./solr.cloud.CustomCollectionTest-374283E7D66D1D8E-001/tempDir-005
   [junit4]   2> 1259460 T5073 oasc.SolrResourceLoader.<init> new SolrResourceLoader for directory: '../../../../../../../../../../mnt/ssd/jenkins/workspace/Lucene-Solr-4.8-Linux/solr/build/solr-core/test/J0/./solr.cloud.CustomCollectionTest-374283E7D66D1D8E-001/tempDir-005/'
   [junit4]   2> 1259470 T5073 oasc.ConfigSolr.fromFile Loading container configuration from /mnt/ssd/jenkins/workspace/Lucene-Solr-4.8-Linux/solr/build/solr-core/test/J0/../../../../../../../../../../mnt/ssd/jenkins/workspace/Lucene-Solr-4.8-Linux/solr/build/solr-core/test/J0/./solr.cloud.CustomCollectionTest-374283E7D66D1D8E-001/tempDir-005/solr.xml
   [junit4]   2> 1259476 T5073 oasc.CorePropertiesLocator.<init> Config-defined core root directory: /mnt/ssd/jenkins/workspace/Lucene-Solr-4.8-Linux/solr/build/solr-core/test/J0/../../../../../../../../../../mnt/ssd/jenkins/workspace/Lucene-Solr-4.8-Linux/solr/build/solr-core/test/J0/./solr.cloud.CustomCollectionTest-374283E7D66D1D8E-001/tempDir-005
   [junit4]   2> 1259476 T5073 oasc.CoreContainer.<init> New CoreContainer 297985766
   [junit4]   2> 1259476 T5073 oasc.CoreContainer.load Loading cores into CoreContainer [instanceDir=../../../../../../../../../../mnt/ssd/jenkins/workspace/Lucene-Solr-4.8-Linux/solr/build/solr-core/test/J0/./solr.cloud.CustomCollectionTest-374283E7D66D1D8E-001/tempDir-005/]
   [junit4]   2> 1259477 T5073 oashc.HttpShardHandlerFactory.getParameter Setting socketTimeout to: 90000
   [junit4]   2> 1259477 T5073 oashc.HttpShardHandlerFactory.getParameter Setting urlScheme to: 
   [junit4]   2> 1259477 T5073 oashc.HttpShardHandlerFactory.getParameter Setting connTimeout to: 15000
   [junit4]   2> 1259477 T5073 oashc.HttpShardHandlerFactory.getParameter Setting maxConnectionsPerHost to: 20
   [junit4]   2> 1259478 T5073 oashc.HttpShardHandlerFactory.getParameter Setting corePoolSize to: 0
   [junit4]   2> 1259478 T5073 oashc.HttpShardHandlerFactory.getParameter Setting maximumPoolSize to: 2147483647
   [junit4]   2> 1259478 T5073 oashc.HttpShardHandlerFactory.getParameter Setting maxThreadIdleTime to: 5
   [junit4]   2> 1259478 T5073 oashc.HttpShardHandlerFactory.getParameter Setting sizeOfQueue to: -1
   [junit4]   2> 1259479 T5073 oashc.HttpShardHandlerFactory.getParameter Setting fairnessPolicy to: false
   [junit4]   2> 

[...truncated too long message...]

loud.LeaderElector$ElectionWatcher.process(LeaderElector.java:303)
   [junit4]   2> 	at org.apache.zookeeper.ClientCnxn$EventThread.processEvent(ClientCnxn.java:522)
   [junit4]   2> 	at org.apache.zookeeper.ClientCnxn$EventThread.run(ClientCnxn.java:498)
   [junit4]   2> 
   [junit4]   2> 1603262 T5157 oasc.LeaderElector$ElectionWatcher.process WARN  org.apache.zookeeper.KeeperException$SessionExpiredException: KeeperErrorCode = Session expired for /collections/implicitcoll4/leader_elect/a/election
   [junit4]   2> 	at org.apache.zookeeper.KeeperException.create(KeeperException.java:127)
   [junit4]   2> 	at org.apache.zookeeper.KeeperException.create(KeeperException.java:51)
   [junit4]   2> 	at org.apache.zookeeper.ZooKeeper.getChildren(ZooKeeper.java:1472)
   [junit4]   2> 	at org.apache.solr.common.cloud.SolrZkClient$6.execute(SolrZkClient.java:260)
   [junit4]   2> 	at org.apache.solr.common.cloud.SolrZkClient$6.execute(SolrZkClient.java:257)
   [junit4]   2> 	at org.apache.solr.common.cloud.ZkCmdExecutor.retryOperation(ZkCmdExecutor.java:73)
   [junit4]   2> 	at org.apache.solr.common.cloud.SolrZkClient.getChildren(SolrZkClient.java:257)
   [junit4]   2> 	at org.apache.solr.cloud.LeaderElector.checkIfIamLeader(LeaderElector.java:94)
   [junit4]   2> 	at org.apache.solr.cloud.LeaderElector.access$200(LeaderElector.java:55)
   [junit4]   2> 	at org.apache.solr.cloud.LeaderElector$ElectionWatcher.process(LeaderElector.java:303)
   [junit4]   2> 	at org.apache.zookeeper.ClientCnxn$EventThread.processEvent(ClientCnxn.java:522)
   [junit4]   2> 	at org.apache.zookeeper.ClientCnxn$EventThread.run(ClientCnxn.java:498)
   [junit4]   2> 
   [junit4]   2> 1603262 T5157 oasc.LeaderElector$ElectionWatcher.process WARN  org.apache.zookeeper.KeeperException$SessionExpiredException: KeeperErrorCode = Session expired for /collections/implicitcoll5/leader_elect/c/election
   [junit4]   2> 	at org.apache.zookeeper.KeeperException.create(KeeperException.java:127)
   [junit4]   2> 	at org.apache.zookeeper.KeeperException.create(KeeperException.java:51)
   [junit4]   2> 	at org.apache.zookeeper.ZooKeeper.getChildren(ZooKeeper.java:1472)
   [junit4]   2> 	at org.apache.solr.common.cloud.SolrZkClient$6.execute(SolrZkClient.java:260)
   [junit4]   2> 	at org.apache.solr.common.cloud.SolrZkClient$6.execute(SolrZkClient.java:257)
   [junit4]   2> 	at org.apache.solr.common.cloud.ZkCmdExecutor.retryOperation(ZkCmdExecutor.java:73)
   [junit4]   2> 	at org.apache.solr.common.cloud.SolrZkClient.getChildren(SolrZkClient.java:257)
   [junit4]   2> 	at org.apache.solr.cloud.LeaderElector.checkIfIamLeader(LeaderElector.java:94)
   [junit4]   2> 	at org.apache.solr.cloud.LeaderElector.access$200(LeaderElector.java:55)
   [junit4]   2> 	at org.apache.solr.cloud.LeaderElector$ElectionWatcher.process(LeaderElector.java:303)
   [junit4]   2> 	at org.apache.zookeeper.ClientCnxn$EventThread.processEvent(ClientCnxn.java:522)
   [junit4]   2> 	at org.apache.zookeeper.ClientCnxn$EventThread.run(ClientCnxn.java:498)
   [junit4]   2> 
   [junit4]   2> 1603262 T5157 oasc.LeaderElector$ElectionWatcher.process WARN  org.apache.zookeeper.KeeperException$SessionExpiredException: KeeperErrorCode = Session expired for /collections/implicitcoll0/leader_elect/c/election
   [junit4]   2> 	at org.apache.zookeeper.KeeperException.create(KeeperException.java:127)
   [junit4]   2> 	at org.apache.zookeeper.KeeperException.create(KeeperException.java:51)
   [junit4]   2> 	at org.apache.zookeeper.ZooKeeper.getChildren(ZooKeeper.java:1472)
   [junit4]   2> 	at org.apache.solr.common.cloud.SolrZkClient$6.execute(SolrZkClient.java:260)
   [junit4]   2> 	at org.apache.solr.common.cloud.SolrZkClient$6.execute(SolrZkClient.java:257)
   [junit4]   2> 	at org.apache.solr.common.cloud.ZkCmdExecutor.retryOperation(ZkCmdExecutor.java:73)
   [junit4]   2> 	at org.apache.solr.common.cloud.SolrZkClient.getChildren(SolrZkClient.java:257)
   [junit4]   2> 	at org.apache.solr.cloud.LeaderElector.checkIfIamLeader(LeaderElector.java:94)
   [junit4]   2> 	at org.apache.solr.cloud.LeaderElector.access$200(LeaderElector.java:55)
   [junit4]   2> 	at org.apache.solr.cloud.LeaderElector$ElectionWatcher.process(LeaderElector.java:303)
   [junit4]   2> 	at org.apache.zookeeper.ClientCnxn$EventThread.processEvent(ClientCnxn.java:522)
   [junit4]   2> 	at org.apache.zookeeper.ClientCnxn$EventThread.run(ClientCnxn.java:498)
   [junit4]   2> 
   [junit4]   2> NOTE: leaving temporary files on disk at: /mnt/ssd/jenkins/workspace/Lucene-Solr-4.8-Linux/solr/build/solr-core/test/J0/./solr.cloud.CustomCollectionTest-374283E7D66D1D8E-001
   [junit4]   2> NOTE: test params are: codec=Lucene3x, sim=RandomSimilarityProvider(queryNorm=true,coord=no): {}, locale=sr__#Latn, timezone=America/Guayaquil
   [junit4]   2> NOTE: Linux 3.8.0-38-generic amd64/Oracle Corporation 1.8.0 (64-bit)/cpus=8,threads=1,free=43576536,total=352321536
   [junit4]   2> NOTE: All tests run in this JVM: [SolrIndexSplitterTest, TestSchemaVersionResource, DistributedDebugComponentTest, QueryParsingTest, TestSuggestSpellingConverter, TestBlendedInfixSuggestions, TestComplexPhraseQParserPlugin, LukeRequestHandlerTest, TestReversedWildcardFilterFactory, TestCursorMarkWithoutUniqueKey, SampleTest, FieldMutatingUpdateProcessorTest, OverseerStatusTest, ResourceLoaderTest, OverseerTest, TestReplicationHandler, BasicDistributedZkTest, CircularListTest, PeerSyncTest, TestDocSet, SearchHandlerTest, TestSimpleQParserPlugin, SliceStateTest, TestMergePolicyConfig, JsonLoaderTest, TestDefaultSearchFieldResource, AutoCommitTest, SOLR749Test, ReturnFieldsTest, SolrTestCaseJ4Test, TestSearcherReuse, TestRestManager, TestCollationFieldDocValues, TestFieldSortValues, DistributedQueryElevationComponentTest, TestFieldResource, TestTrie, ExternalFileFieldSortTest, FileBasedSpellCheckerTest, TestSurroundQueryParser, TestOverriddenPrefixQueryForCustomFieldType, TestRemoteStreaming, TestCollectionAPI, TestUniqueKeyFieldResource, SolrInfoMBeanTest, TestRandomMergePolicy, SolrXmlInZkTest, UpdateRequestProcessorFactoryTest, TestLFUCache, CoreMergeIndexesAdminHandlerTest, TestCharFilters, TestSort, ShardRoutingTest, ScriptEngineTest, TestRandomDVFaceting, AnalysisAfterCoreReloadTest, ClusterStateUpdateTest, TestConfigSets, CSVRequestHandlerTest, TestNonDefinedSimilarityFactory, UpdateParamsTest, TestSolrDeletionPolicy1, TestNRTOpen, SpatialFilterTest, CoreAdminRequestStatusTest, TestJoin, DOMUtilTest, TestRecoveryHdfs, BadComponentTest, SimpleFacetsTest, TestJmxMonitoredMap, PrimitiveFieldTypeTest, TestElisionMultitermQuery, TestBM25SimilarityFactory, TestFreeTextSuggestions, StressHdfsTest, TestExceedMaxTermLength, TestSolrQueryParserResource, AddSchemaFieldsUpdateProcessorFactoryTest, TestRequestStatusCollectionAPI, TestFieldTypeResource, TestExtendedDismaxParser, MoreLikeThisHandlerTest, BinaryUpdateRequestHandlerTest, DocValuesTest, SpellPossibilityIteratorTest, ResponseLogComponentTest, QueryEqualityTest, UUIDFieldTest, SoftAutoCommitTest, RecoveryZkTest, LegacyHTMLStripCharFilterTest, UnloadDistributedZkTest, CollectionsAPIDistributedZkTest, TestStressReorder, DistributedTermsComponentTest, TestCoreContainer, TestGroupingSearch, TestBadConfig, TestIndexSearcher, HighlighterTest, CurrencyFieldOpenExchangeTest, TestCoreDiscovery, SpellCheckCollatorTest, TestFoldingMultitermQuery, SuggesterTSTTest, SuggesterTest, PolyFieldTest, NoCacheHeaderTest, SchemaVersionSpecificBehaviorTest, SolrCoreCheckLockOnStartupTest, DirectUpdateHandlerOptimizeTest, DocValuesMultiTest, DistanceFunctionTest, XsltUpdateRequestHandlerTest, DebugComponentTest, CacheHeaderTest, TestWriterPerf, DocumentBuilderTest, PathHierarchyTokenizerFactoryTest, TermVectorComponentTest, FastVectorHighlighterTest, RegexBoostProcessorTest, TestCSVResponseWriter, TestPHPSerializedResponseWriter, CoreContainerCoreInitFailuresTest, AlternateDirectoryTest, CopyFieldTest, TestSearchPerf, OutputWriterTest, TestPostingsSolrHighlighter, TestLuceneMatchVersion, SynonymTokenizerTest, EchoParamsTest, TestPerFieldSimilarity, TestLMDirichletSimilarityFactory, TestIBSimilarityFactory, TimeZoneUtilsTest, OpenExchangeRatesOrgProviderTest, DateMathParserTest, TestSolrXMLSerializer, PreAnalyzedFieldTest, TestSystemIdResolver, PrimUtilsTest, DateFieldTest, RAMDirectoryFactoryTest, ClusterStateTest, TestLRUCache, TestUtils, TestDocumentBuilder, SystemInfoHandlerTest, FileUtilsTest, CursorPagingTest, TestDistributedMissingSort, TestCollationKeyRangeQueries, AssignTest, AsyncMigrateRouteKeyTest, CustomCollectionTest]
   [junit4] Completed on J0 in 357.61s, 1 test, 1 error <<< FAILURES!

[...truncated 189 lines...]
BUILD FAILED
/mnt/ssd/jenkins/workspace/Lucene-Solr-4.8-Linux/build.xml:467: The following error occurred while executing this line:
/mnt/ssd/jenkins/workspace/Lucene-Solr-4.8-Linux/build.xml:447: The following error occurred while executing this line:
/mnt/ssd/jenkins/workspace/Lucene-Solr-4.8-Linux/build.xml:45: The following error occurred while executing this line:
/mnt/ssd/jenkins/workspace/Lucene-Solr-4.8-Linux/extra-targets.xml:37: The following error occurred while executing this line:
/mnt/ssd/jenkins/workspace/Lucene-Solr-4.8-Linux/solr/build.xml:189: The following error occurred while executing this line:
/mnt/ssd/jenkins/workspace/Lucene-Solr-4.8-Linux/solr/common-build.xml:496: The following error occurred while executing this line:
/mnt/ssd/jenkins/workspace/Lucene-Solr-4.8-Linux/lucene/common-build.xml:1282: The following error occurred while executing this line:
/mnt/ssd/jenkins/workspace/Lucene-Solr-4.8-Linux/lucene/common-build.xml:908: There were test failures: 387 suites, 1619 tests, 2 errors, 37 ignored (16 assumptions)

Total time: 61 minutes 20 seconds
Build step 'Invoke Ant' marked build as failure
Description set: Java: 64bit/jdk1.8.0 -XX:+UseCompressedOops -XX:+UseParallelGC
Archiving artifacts
Recording test results
Email was triggered for: Failure
Sending email for trigger: Failure



Mime
View raw message