lucene-dev mailing list archives

Site index · List index
Message view « Date » · « Thread »
Top « Date » · « Thread »
From Steve Rowe <sar...@gmail.com>
Subject Re: [JENKINS-MAVEN] Lucene-Solr-Maven-4.x #622: POMs out of sync
Date Thu, 03 Apr 2014 05:50:41 GMT
I’m guessing some cruft (something like an HTML error response where an XML file should be)
has infected the Jenkins local Maven repository for the lucene-codecs module, so I nuked that
part of the local repository.  We’ll see if that allows the Maven builds to succeed.

Steve
 
On Apr 3, 2014, at 12:48 AM, Apache Jenkins Server <jenkins@builds.apache.org> wrote:

> Build: https://builds.apache.org/job/Lucene-Solr-Maven-4.x/622/
> 
> No tests ran.
> 
> Build Log:
> [...truncated 39358 lines...]
> -validate-maven-dependencies:
> [artifact:dependencies] [INFO] snapshot org.apache.lucene:lucene-codecs:4.8-SNAPSHOT:
checking for updates from sonatype.releases
> [artifact:dependencies] [WARNING] *** CHECKSUM FAILED - Checksum failed on download:
local = 'ef3dc2ec718a24931364e81249c0933d3d0cc682'; remote = '<html>
> [artifact:dependencies] <head><title>301' - RETRYING
> [artifact:dependencies] [WARNING] *** CHECKSUM FAILED - Checksum failed on download:
local = 'ef3dc2ec718a24931364e81249c0933d3d0cc682'; remote = '<html>
> [artifact:dependencies] <head><title>301' - IGNORING
> [artifact:dependencies] An error has occurred while processing the Maven artifact tasks.
> 
> [...truncated 18 lines...]
> BUILD FAILED
> /usr/home/hudson/hudson-slave/workspace/Lucene-Solr-Maven-4.x/build.xml:483: The following
error occurred while executing this line:
> /usr/home/hudson/hudson-slave/workspace/Lucene-Solr-Maven-4.x/build.xml:174: The following
error occurred while executing this line:
> /usr/home/hudson/hudson-slave/workspace/Lucene-Solr-Maven-4.x/lucene/build.xml:507: The
following error occurred while executing this line:
> /usr/home/hudson/hudson-slave/workspace/Lucene-Solr-Maven-4.x/lucene/common-build.xml:1508:
The following error occurred while executing this line:
> /usr/home/hudson/hudson-slave/workspace/Lucene-Solr-Maven-4.x/lucene/common-build.xml:548:
Unable to resolve artifact: Unable to get dependency information: Unable to read the metadata
file for artifact 'org.apache.lucene:lucene-codecs:jar': Error getting POM for 'org.apache.lucene:lucene-codecs'
from the repository: Unable to read local copy of metadata: Cannot read metadata from '/home/hudson/.m2/repository/org/apache/lucene/lucene-codecs/4.8-SNAPSHOT/maven-metadata-sonatype.releases.xml':
end tag name </body> must match start tag name <hr> from line 5 (position: TEXT
seen ...</center>\r\n</body>... @6:8) 
>  org.apache.lucene:lucene-codecs:pom:4.8-SNAPSHOT
> 
> 
> for project org.apache.lucene:lucene-codecs
>  org.apache.lucene:lucene-codecs:jar:4.8-SNAPSHOT
> 
> from the specified remote repositories:
>  central (http://repo1.maven.org/maven2),
>  sonatype.releases (http://oss.sonatype.org/content/repositories/releases),
>  Nexus (http://repository.apache.org/snapshots)
> 
> Path to dependency: 
> 	1) org.apache.lucene:lucene-test-framework:jar:4.8-SNAPSHOT
> 
> 
> 
> Total time: 31 minutes 4 seconds
> Build step 'Invoke Ant' marked build as failure
> Recording test results
> Email was triggered for: Failure
> Sending email for trigger: Failure
> 
> 
> 
> ---------------------------------------------------------------------
> To unsubscribe, e-mail: dev-unsubscribe@lucene.apache.org
> For additional commands, e-mail: dev-help@lucene.apache.org


---------------------------------------------------------------------
To unsubscribe, e-mail: dev-unsubscribe@lucene.apache.org
For additional commands, e-mail: dev-help@lucene.apache.org


Mime
View raw message