lucene-dev mailing list archives

Site index · List index
Message view « Date » · « Thread »
Top « Date » · « Thread »
From Michael McCandless <luc...@mikemccandless.com>
Subject Re: [JENKINS] Lucene-4x-Linux-Java7-64-test-only - Build # 19681 - Failure!
Date Thu, 24 Apr 2014 15:57:38 GMT
I'll dig.

Mike McCandless

http://blog.mikemccandless.com


On Thu, Apr 24, 2014 at 11:51 AM,  <builder@flonkings.com> wrote:
> Build: builds.flonkings.com/job/Lucene-4x-Linux-Java7-64-test-only/19681/
>
> 1 tests failed.
> REGRESSION:  org.apache.lucene.index.TestTerms.testTermMinMaxRandom
>
> Error Message:
>
>
> Stack Trace:
> java.lang.AssertionError
>         at __randomizedtesting.SeedInfo.seed([3F2528AD7379C20F:7356A7D91FE5196A]:0)
>         at org.apache.lucene.util.UnicodeUtil.UTF8toUTF16(UnicodeUtil.java:563)
>         at org.apache.lucene.codecs.lucene3x.TermInfosWriter.compareToLastTerm(TermInfosWriter.java:187)
>         at org.apache.lucene.codecs.lucene3x.TermInfosWriter.add(TermInfosWriter.java:217)
>         at org.apache.lucene.codecs.lucene3x.PreFlexRWFieldsWriter$PreFlexTermsWriter.finishTerm(PreFlexRWFieldsWriter.java:209)
>         at org.apache.lucene.index.FreqProxTermsWriterPerField.flush(FreqProxTermsWriterPerField.java:548)
>         at org.apache.lucene.index.FreqProxTermsWriter.flush(FreqProxTermsWriter.java:85)
>         at org.apache.lucene.index.TermsHash.flush(TermsHash.java:116)
>         at org.apache.lucene.index.DocInverter.flush(DocInverter.java:53)
>         at org.apache.lucene.index.DocFieldProcessor.flush(DocFieldProcessor.java:81)
>         at org.apache.lucene.index.DocumentsWriterPerThread.flush(DocumentsWriterPerThread.java:465)
>         at org.apache.lucene.index.DocumentsWriter.doFlush(DocumentsWriter.java:518)
>         at org.apache.lucene.index.DocumentsWriter.flushAllThreads(DocumentsWriter.java:628)
>         at org.apache.lucene.index.IndexWriter.prepareCommitInternal(IndexWriter.java:2942)
>         at org.apache.lucene.index.IndexWriter.commitInternal(IndexWriter.java:3101)
>         at org.apache.lucene.index.IndexWriter.commit(IndexWriter.java:3068)
>         at org.apache.lucene.index.RandomIndexWriter.getReader(RandomIndexWriter.java:320)
>         at org.apache.lucene.index.RandomIndexWriter.getReader(RandomIndexWriter.java:257)
>         at org.apache.lucene.index.TestTerms.testTermMinMaxRandom(TestTerms.java:84)
>         at sun.reflect.NativeMethodAccessorImpl.invoke0(Native Method)
>         at sun.reflect.NativeMethodAccessorImpl.invoke(NativeMethodAccessorImpl.java:57)
>         at sun.reflect.DelegatingMethodAccessorImpl.invoke(DelegatingMethodAccessorImpl.java:43)
>         at java.lang.reflect.Method.invoke(Method.java:606)
>         at com.carrotsearch.randomizedtesting.RandomizedRunner.invoke(RandomizedRunner.java:1618)
>         at com.carrotsearch.randomizedtesting.RandomizedRunner$6.evaluate(RandomizedRunner.java:827)
>         at com.carrotsearch.randomizedtesting.RandomizedRunner$7.evaluate(RandomizedRunner.java:863)
>         at com.carrotsearch.randomizedtesting.RandomizedRunner$8.evaluate(RandomizedRunner.java:877)
>         at org.apache.lucene.util.TestRuleSetupTeardownChained$1.evaluate(TestRuleSetupTeardownChained.java:50)
>         at org.apache.lucene.util.TestRuleFieldCacheSanity$1.evaluate(TestRuleFieldCacheSanity.java:51)
>         at org.apache.lucene.util.AbstractBeforeAfterRule$1.evaluate(AbstractBeforeAfterRule.java:46)
>         at com.carrotsearch.randomizedtesting.rules.SystemPropertiesInvariantRule$1.evaluate(SystemPropertiesInvariantRule.java:55)
>         at org.apache.lucene.util.TestRuleThreadAndTestName$1.evaluate(TestRuleThreadAndTestName.java:49)
>         at org.apache.lucene.util.TestRuleIgnoreAfterMaxFailures$1.evaluate(TestRuleIgnoreAfterMaxFailures.java:65)
>         at org.apache.lucene.util.TestRuleMarkFailure$1.evaluate(TestRuleMarkFailure.java:48)
>         at com.carrotsearch.randomizedtesting.rules.StatementAdapter.evaluate(StatementAdapter.java:36)
>         at com.carrotsearch.randomizedtesting.ThreadLeakControl$StatementRunner.run(ThreadLeakControl.java:360)
>         at com.carrotsearch.randomizedtesting.ThreadLeakControl.forkTimeoutingTask(ThreadLeakControl.java:793)
>         at com.carrotsearch.randomizedtesting.ThreadLeakControl$3.evaluate(ThreadLeakControl.java:453)
>         at com.carrotsearch.randomizedtesting.RandomizedRunner.runSingleTest(RandomizedRunner.java:836)
>         at com.carrotsearch.randomizedtesting.RandomizedRunner$3.evaluate(RandomizedRunner.java:738)
>         at com.carrotsearch.randomizedtesting.RandomizedRunner$4.evaluate(RandomizedRunner.java:772)
>         at com.carrotsearch.randomizedtesting.RandomizedRunner$5.evaluate(RandomizedRunner.java:783)
>         at org.apache.lucene.util.AbstractBeforeAfterRule$1.evaluate(AbstractBeforeAfterRule.java:46)
>         at org.apache.lucene.util.TestRuleStoreClassName$1.evaluate(TestRuleStoreClassName.java:42)
>         at com.carrotsearch.randomizedtesting.rules.SystemPropertiesInvariantRule$1.evaluate(SystemPropertiesInvariantRule.java:55)
>         at com.carrotsearch.randomizedtesting.rules.NoShadowingOrOverridesOnMethodsRule$1.evaluate(NoShadowingOrOverridesOnMethodsRule.java:39)
>         at com.carrotsearch.randomizedtesting.rules.NoShadowingOrOverridesOnMethodsRule$1.evaluate(NoShadowingOrOverridesOnMethodsRule.java:39)
>         at com.carrotsearch.randomizedtesting.rules.StatementAdapter.evaluate(StatementAdapter.java:36)
>         at com.carrotsearch.randomizedtesting.rules.StatementAdapter.evaluate(StatementAdapter.java:36)
>         at org.apache.lucene.util.TestRuleAssertionsRequired$1.evaluate(TestRuleAssertionsRequired.java:43)
>         at org.apache.lucene.util.TestRuleMarkFailure$1.evaluate(TestRuleMarkFailure.java:48)
>         at org.apache.lucene.util.TestRuleIgnoreAfterMaxFailures$1.evaluate(TestRuleIgnoreAfterMaxFailures.java:65)
>         at org.apache.lucene.util.TestRuleIgnoreTestSuites$1.evaluate(TestRuleIgnoreTestSuites.java:55)
>         at com.carrotsearch.randomizedtesting.rules.StatementAdapter.evaluate(StatementAdapter.java:36)
>         at com.carrotsearch.randomizedtesting.ThreadLeakControl$StatementRunner.run(ThreadLeakControl.java:360)
>         at java.lang.Thread.run(Thread.java:724)
>
>
>
>
> Build Log:
> [...truncated 368 lines...]
>    [junit4] Suite: org.apache.lucene.index.TestTerms
>    [junit4]   2> NOTE: reproduce with: ant test  -Dtestcase=TestTerms -Dtests.method=testTermMinMaxRandom
-Dtests.seed=3F2528AD7379C20F -Dtests.slow=true -Dtests.locale=es_VE -Dtests.timezone=America/Kentucky/Monticello
-Dtests.file.encoding=UTF-8
>    [junit4] FAILURE 0.76s J4 | TestTerms.testTermMinMaxRandom <<<
>    [junit4]    > Throwable #1: java.lang.AssertionError
>    [junit4]    >        at __randomizedtesting.SeedInfo.seed([3F2528AD7379C20F:7356A7D91FE5196A]:0)
>    [junit4]    >        at org.apache.lucene.util.UnicodeUtil.UTF8toUTF16(UnicodeUtil.java:563)
>    [junit4]    >        at org.apache.lucene.codecs.lucene3x.TermInfosWriter.compareToLastTerm(TermInfosWriter.java:187)
>    [junit4]    >        at org.apache.lucene.codecs.lucene3x.TermInfosWriter.add(TermInfosWriter.java:217)
>    [junit4]    >        at org.apache.lucene.codecs.lucene3x.PreFlexRWFieldsWriter$PreFlexTermsWriter.finishTerm(PreFlexRWFieldsWriter.java:209)
>    [junit4]    >        at org.apache.lucene.index.FreqProxTermsWriterPerField.flush(FreqProxTermsWriterPerField.java:548)
>    [junit4]    >        at org.apache.lucene.index.FreqProxTermsWriter.flush(FreqProxTermsWriter.java:85)
>    [junit4]    >        at org.apache.lucene.index.TermsHash.flush(TermsHash.java:116)
>    [junit4]    >        at org.apache.lucene.index.DocInverter.flush(DocInverter.java:53)
>    [junit4]    >        at org.apache.lucene.index.DocFieldProcessor.flush(DocFieldProcessor.java:81)
>    [junit4]    >        at org.apache.lucene.index.DocumentsWriterPerThread.flush(DocumentsWriterPerThread.java:465)
>    [junit4]    >        at org.apache.lucene.index.DocumentsWriter.doFlush(DocumentsWriter.java:518)
>    [junit4]    >        at org.apache.lucene.index.DocumentsWriter.flushAllThreads(DocumentsWriter.java:628)
>    [junit4]    >        at org.apache.lucene.index.IndexWriter.prepareCommitInternal(IndexWriter.java:2942)
>    [junit4]    >        at org.apache.lucene.index.IndexWriter.commitInternal(IndexWriter.java:3101)
>    [junit4]    >        at org.apache.lucene.index.IndexWriter.commit(IndexWriter.java:3068)
>    [junit4]    >        at org.apache.lucene.index.RandomIndexWriter.getReader(RandomIndexWriter.java:320)
>    [junit4]    >        at org.apache.lucene.index.RandomIndexWriter.getReader(RandomIndexWriter.java:257)
>    [junit4]    >        at org.apache.lucene.index.TestTerms.testTermMinMaxRandom(TestTerms.java:84)
>    [junit4]    >        at java.lang.Thread.run(Thread.java:724)
>    [junit4]   2> NOTE: test params are: codec=Lucene3x, sim=DefaultSimilarity, locale=es_VE,
timezone=America/Kentucky/Monticello
>    [junit4]   2> NOTE: Linux 3.2.0-26-generic amd64/Oracle Corporation 1.7.0_25 (64-bit)/cpus=8,threads=1,free=100845072,total=246743040
>    [junit4]   2> NOTE: All tests run in this JVM: [TestLevenshteinAutomata, TestOmitNorms,
TestMaxTermFrequency, TestMixedCodecs, TestSimpleFSDirectory, TestIntBlockPool, TestDuelingCodecs,
TestNoMergeScheduler, TestTwoPhaseCommitTool, TestImpersonation, ThrowInUncaught, Nested2,
Nested3, Nested1, TestDocBoost, TestTerms]
>    [junit4] Completed on J4 in 3.90s, 6 tests, 1 failure <<< FAILURES!
>
> [...truncated 1147 lines...]
> BUILD FAILED
> /var/lib/jenkins/workspace/Lucene-4x-Linux-Java7-64-test-only/checkout/lucene/build.xml:49:
The following error occurred while executing this line:
> /var/lib/jenkins/workspace/Lucene-4x-Linux-Java7-64-test-only/checkout/lucene/common-build.xml:1297:
The following error occurred while executing this line:
> /var/lib/jenkins/workspace/Lucene-4x-Linux-Java7-64-test-only/checkout/lucene/common-build.xml:921:
There were test failures: 400 suites, 3110 tests, 1 failure, 99 ignored (89 assumptions)
>
> Total time: 6 minutes 2 seconds
> Build step 'Invoke Ant' marked build as failure
> Recording test results
> Email was triggered for: Failure
> Sending email for trigger: Failure
>
>
>
>
> ---------------------------------------------------------------------
> To unsubscribe, e-mail: dev-unsubscribe@lucene.apache.org
> For additional commands, e-mail: dev-help@lucene.apache.org

---------------------------------------------------------------------
To unsubscribe, e-mail: dev-unsubscribe@lucene.apache.org
For additional commands, e-mail: dev-help@lucene.apache.org


Mime
View raw message