lucene-dev mailing list archives

Site index · List index
Message view « Date » · « Thread »
Top « Date » · « Thread »
From Michael McCandless <luc...@mikemccandless.com>
Subject Re: [JENKINS] Lucene-4x-Linux-Java7-64-test-only - Build # 20227 - Failure!
Date Wed, 30 Apr 2014 17:13:01 GMT
I committed a fix.

Mike McCandless

http://blog.mikemccandless.com


On Wed, Apr 30, 2014 at 12:12 PM, Michael McCandless
<lucene@mikemccandless.com> wrote:
> I'll dig.
>
> Mike McCandless
>
> http://blog.mikemccandless.com
>
>
> On Wed, Apr 30, 2014 at 11:52 AM,  <builder@flonkings.com> wrote:
>> Build: builds.flonkings.com/job/Lucene-4x-Linux-Java7-64-test-only/20227/
>>
>> 1 tests failed.
>> REGRESSION:  org.apache.lucene.index.TestTermVectorsWriter.testInconsistentTermVectorOptions
>>
>> Error Message:
>>
>>
>> Stack Trace:
>> java.lang.AssertionError
>>         at __randomizedtesting.SeedInfo.seed([F423BF9ECA066875:62AF43CBE382AFB5]:0)
>>         at org.apache.lucene.codecs.pulsing.PulsingPostingsWriter.finishTerm(PulsingPostingsWriter.java:346)
>>         at org.apache.lucene.codecs.memory.FSTOrdTermsWriter$TermsWriter.finishTerm(FSTOrdTermsWriter.java:328)
>>         at org.apache.lucene.index.FreqProxTermsWriterPerField.flush(FreqProxTermsWriterPerField.java:501)
>>         at org.apache.lucene.index.FreqProxTermsWriter.flush(FreqProxTermsWriter.java:80)
>>         at org.apache.lucene.index.DefaultIndexingChain.flush(DefaultIndexingChain.java:114)
>>         at org.apache.lucene.index.DocumentsWriterPerThread.flush(DocumentsWriterPerThread.java:415)
>>         at org.apache.lucene.index.DocumentsWriter.doFlush(DocumentsWriter.java:512)
>>         at org.apache.lucene.index.DocumentsWriter.flushAllThreads(DocumentsWriter.java:622)
>>         at org.apache.lucene.index.IndexWriter.getReader(IndexWriter.java:377)
>>         at org.apache.lucene.index.RandomIndexWriter.getReader(RandomIndexWriter.java:315)
>>         at org.apache.lucene.index.RandomIndexWriter.getReader(RandomIndexWriter.java:257)
>>         at org.apache.lucene.index.TestTermVectorsWriter.doTestMixup(TestTermVectorsWriter.java:666)
>>         at org.apache.lucene.index.TestTermVectorsWriter.testInconsistentTermVectorOptions(TestTermVectorsWriter.java:599)
>>         at sun.reflect.NativeMethodAccessorImpl.invoke0(Native Method)
>>         at sun.reflect.NativeMethodAccessorImpl.invoke(NativeMethodAccessorImpl.java:57)
>>         at sun.reflect.DelegatingMethodAccessorImpl.invoke(DelegatingMethodAccessorImpl.java:43)
>>         at java.lang.reflect.Method.invoke(Method.java:606)
>>         at com.carrotsearch.randomizedtesting.RandomizedRunner.invoke(RandomizedRunner.java:1618)
>>         at com.carrotsearch.randomizedtesting.RandomizedRunner$6.evaluate(RandomizedRunner.java:827)
>>         at com.carrotsearch.randomizedtesting.RandomizedRunner$7.evaluate(RandomizedRunner.java:863)
>>         at com.carrotsearch.randomizedtesting.RandomizedRunner$8.evaluate(RandomizedRunner.java:877)
>>         at org.apache.lucene.util.TestRuleSetupTeardownChained$1.evaluate(TestRuleSetupTeardownChained.java:50)
>>         at org.apache.lucene.util.TestRuleFieldCacheSanity$1.evaluate(TestRuleFieldCacheSanity.java:51)
>>         at org.apache.lucene.util.AbstractBeforeAfterRule$1.evaluate(AbstractBeforeAfterRule.java:46)
>>         at com.carrotsearch.randomizedtesting.rules.SystemPropertiesInvariantRule$1.evaluate(SystemPropertiesInvariantRule.java:55)
>>         at org.apache.lucene.util.TestRuleThreadAndTestName$1.evaluate(TestRuleThreadAndTestName.java:49)
>>         at org.apache.lucene.util.TestRuleIgnoreAfterMaxFailures$1.evaluate(TestRuleIgnoreAfterMaxFailures.java:65)
>>         at org.apache.lucene.util.TestRuleMarkFailure$1.evaluate(TestRuleMarkFailure.java:48)
>>         at com.carrotsearch.randomizedtesting.rules.StatementAdapter.evaluate(StatementAdapter.java:36)
>>         at com.carrotsearch.randomizedtesting.ThreadLeakControl$StatementRunner.run(ThreadLeakControl.java:360)
>>         at com.carrotsearch.randomizedtesting.ThreadLeakControl.forkTimeoutingTask(ThreadLeakControl.java:793)
>>         at com.carrotsearch.randomizedtesting.ThreadLeakControl$3.evaluate(ThreadLeakControl.java:453)
>>         at com.carrotsearch.randomizedtesting.RandomizedRunner.runSingleTest(RandomizedRunner.java:836)
>>         at com.carrotsearch.randomizedtesting.RandomizedRunner$3.evaluate(RandomizedRunner.java:738)
>>         at com.carrotsearch.randomizedtesting.RandomizedRunner$4.evaluate(RandomizedRunner.java:772)
>>         at com.carrotsearch.randomizedtesting.RandomizedRunner$5.evaluate(RandomizedRunner.java:783)
>>         at org.apache.lucene.util.AbstractBeforeAfterRule$1.evaluate(AbstractBeforeAfterRule.java:46)
>>         at org.apache.lucene.util.TestRuleStoreClassName$1.evaluate(TestRuleStoreClassName.java:42)
>>         at com.carrotsearch.randomizedtesting.rules.SystemPropertiesInvariantRule$1.evaluate(SystemPropertiesInvariantRule.java:55)
>>         at com.carrotsearch.randomizedtesting.rules.NoShadowingOrOverridesOnMethodsRule$1.evaluate(NoShadowingOrOverridesOnMethodsRule.java:39)
>>         at com.carrotsearch.randomizedtesting.rules.NoShadowingOrOverridesOnMethodsRule$1.evaluate(NoShadowingOrOverridesOnMethodsRule.java:39)
>>         at com.carrotsearch.randomizedtesting.rules.StatementAdapter.evaluate(StatementAdapter.java:36)
>>         at com.carrotsearch.randomizedtesting.rules.StatementAdapter.evaluate(StatementAdapter.java:36)
>>         at com.carrotsearch.randomizedtesting.rules.StatementAdapter.evaluate(StatementAdapter.java:36)
>>         at org.apache.lucene.util.TestRuleAssertionsRequired$1.evaluate(TestRuleAssertionsRequired.java:43)
>>         at org.apache.lucene.util.TestRuleMarkFailure$1.evaluate(TestRuleMarkFailure.java:48)
>>         at org.apache.lucene.util.TestRuleIgnoreAfterMaxFailures$1.evaluate(TestRuleIgnoreAfterMaxFailures.java:65)
>>         at org.apache.lucene.util.TestRuleIgnoreTestSuites$1.evaluate(TestRuleIgnoreTestSuites.java:55)
>>         at com.carrotsearch.randomizedtesting.rules.StatementAdapter.evaluate(StatementAdapter.java:36)
>>         at com.carrotsearch.randomizedtesting.ThreadLeakControl$StatementRunner.run(ThreadLeakControl.java:360)
>>         at java.lang.Thread.run(Thread.java:724)
>>
>>
>>
>>
>> Build Log:
>> [...truncated 624 lines...]
>>    [junit4] Suite: org.apache.lucene.index.TestTermVectorsWriter
>>    [junit4]   2> NOTE: reproduce with: ant test  -Dtestcase=TestTermVectorsWriter
-Dtests.method=testInconsistentTermVectorOptions -Dtests.seed=F423BF9ECA066875 -Dtests.slow=true
-Dtests.locale=fr_CH -Dtests.timezone=Australia/Broken_Hill -Dtests.file.encoding=UTF-8
>>    [junit4] FAILURE 0.09s J7 | TestTermVectorsWriter.testInconsistentTermVectorOptions
<<<
>>    [junit4]    > Throwable #1: java.lang.AssertionError
>>    [junit4]    >        at __randomizedtesting.SeedInfo.seed([F423BF9ECA066875:62AF43CBE382AFB5]:0)
>>    [junit4]    >        at org.apache.lucene.codecs.pulsing.PulsingPostingsWriter.finishTerm(PulsingPostingsWriter.java:346)
>>    [junit4]    >        at org.apache.lucene.codecs.memory.FSTOrdTermsWriter$TermsWriter.finishTerm(FSTOrdTermsWriter.java:328)
>>    [junit4]    >        at org.apache.lucene.index.FreqProxTermsWriterPerField.flush(FreqProxTermsWriterPerField.java:501)
>>    [junit4]    >        at org.apache.lucene.index.FreqProxTermsWriter.flush(FreqProxTermsWriter.java:80)
>>    [junit4]    >        at org.apache.lucene.index.DefaultIndexingChain.flush(DefaultIndexingChain.java:114)
>>    [junit4]    >        at org.apache.lucene.index.DocumentsWriterPerThread.flush(DocumentsWriterPerThread.java:415)
>>    [junit4]    >        at org.apache.lucene.index.DocumentsWriter.doFlush(DocumentsWriter.java:512)
>>    [junit4]    >        at org.apache.lucene.index.DocumentsWriter.flushAllThreads(DocumentsWriter.java:622)
>>    [junit4]    >        at org.apache.lucene.index.IndexWriter.getReader(IndexWriter.java:377)
>>    [junit4]    >        at org.apache.lucene.index.RandomIndexWriter.getReader(RandomIndexWriter.java:315)
>>    [junit4]    >        at org.apache.lucene.index.RandomIndexWriter.getReader(RandomIndexWriter.java:257)
>>    [junit4]    >        at org.apache.lucene.index.TestTermVectorsWriter.doTestMixup(TestTermVectorsWriter.java:666)
>>    [junit4]    >        at org.apache.lucene.index.TestTermVectorsWriter.testInconsistentTermVectorOptions(TestTermVectorsWriter.java:599)
>>    [junit4]    >        at java.lang.Thread.run(Thread.java:724)
>>    [junit4]   2> NOTE: test params are: codec=Lucene46: {tvtest=PostingsFormat(name=FSTPulsing41),
termVector=PostingsFormat(name=Direct), field=PostingsFormat(name=FSTOrdPulsing41)}, docValues:{},
sim=RandomSimilarityProvider(queryNorm=true,coord=no): {tvtest=DFR I(ne)2, field=DefaultSimilarity},
locale=fr_CH, timezone=Australia/Broken_Hill
>>    [junit4]   2> NOTE: Linux 3.2.0-26-generic amd64/Oracle Corporation 1.7.0_25
(64-bit)/cpus=8,threads=1,free=85831928,total=329777152
>>    [junit4]   2> NOTE: All tests run in this JVM: [TestMultiPhraseQuery, TestNorms,
TestIndexCommit, TestBasicOperations, TestCompiledAutomaton, TestLucene3xTermVectorsFormat,
TestRollingBuffer, TestOmitTf, TestDocTermOrdsRangeFilter, TestIndexWriterLockRelease, TestConsistentFieldNumbers,
TestSortRandom, TestBufferedChecksum, TestDirectoryReaderReopen, TestDocIdBitSet, TestDocCount,
Nested1, TestByteBlockPool, TestDeterminizeLexicon, TestLucene3xStoredFieldsFormat, TestTermVectorsWriter]
>>    [junit4] Completed on J7 in 1.18s, 14 tests, 1 failure <<< FAILURES!
>>
>> [...truncated 915 lines...]
>> BUILD FAILED
>> /var/lib/jenkins/workspace/Lucene-4x-Linux-Java7-64-test-only/checkout/lucene/build.xml:49:
The following error occurred while executing this line:
>> /var/lib/jenkins/workspace/Lucene-4x-Linux-Java7-64-test-only/checkout/lucene/common-build.xml:1297:
The following error occurred while executing this line:
>> /var/lib/jenkins/workspace/Lucene-4x-Linux-Java7-64-test-only/checkout/lucene/common-build.xml:921:
There were test failures: 400 suites, 3113 tests, 1 failure, 110 ignored (100 assumptions)
>>
>> Total time: 5 minutes 25 seconds
>> Build step 'Invoke Ant' marked build as failure
>> Recording test results
>> Email was triggered for: Failure
>> Sending email for trigger: Failure
>>
>>
>>
>>
>> ---------------------------------------------------------------------
>> To unsubscribe, e-mail: dev-unsubscribe@lucene.apache.org
>> For additional commands, e-mail: dev-help@lucene.apache.org

---------------------------------------------------------------------
To unsubscribe, e-mail: dev-unsubscribe@lucene.apache.org
For additional commands, e-mail: dev-help@lucene.apache.org


Mime
View raw message