lucene-dev mailing list archives

Site index · List index
Message view « Date » · « Thread »
Top « Date » · « Thread »
From Michael McCandless <luc...@mikemccandless.com>
Subject Re: [JENKINS] Lucene-Solr-SmokeRelease-trunk - Build # 172 - Failure
Date Mon, 21 Apr 2014 09:34:21 GMT
Looks like a real issue, and it reproduces.  I opened
https://issues.apache.org/jira/browse/LUCENE-5623 but I haven't dug
yet ...

Mike McCandless

http://blog.mikemccandless.com


On Sun, Apr 20, 2014 at 7:31 AM, Robert Muir <rcmuir@gmail.com> wrote:
> TestEarlyTermination failed. looks like a bug.
>
> On Sun, Apr 20, 2014 at 6:51 AM, Apache Jenkins Server
> <jenkins@builds.apache.org> wrote:
>> Build: https://builds.apache.org/job/Lucene-Solr-SmokeRelease-trunk/172/
>>
>> No tests ran.
>>
>> Build Log:
>> [...truncated 52526 lines...]
>> prepare-release-no-sign:
>>     [mkdir] Created dir: /usr/home/hudson/hudson-slave/workspace/Lucene-Solr-SmokeRelease-trunk/lucene/build/fakeRelease
>>      [copy] Copying 431 files to /usr/home/hudson/hudson-slave/workspace/Lucene-Solr-SmokeRelease-trunk/lucene/build/fakeRelease/lucene
>>      [copy] Copying 230 files to /usr/home/hudson/hudson-slave/workspace/Lucene-Solr-SmokeRelease-trunk/lucene/build/fakeRelease/solr
>>      [exec] JAVA7_HOME is /home/hudson/tools/java/latest1.7
>>      [exec] NOTE: output encoding is US-ASCII
>>      [exec]
>>      [exec] Load release URL "file:/usr/home/hudson/hudson-slave/workspace/Lucene-Solr-SmokeRelease-trunk/lucene/build/fakeRelease/"...
>>      [exec]
>>      [exec] Test Lucene...
>>      [exec]   test basics...
>>      [exec]   get KEYS
>>      [exec]     0.1 MB in 0.04 sec (2.2 MB/sec)
>>      [exec]   check changes HTML...
>>      [exec]   download lucene-5.0.0-src.tgz...
>>      [exec]     27.1 MB in 0.04 sec (658.6 MB/sec)
>>      [exec]     verify md5/sha1 digests
>>      [exec]   download lucene-5.0.0.tgz...
>>      [exec]     61.7 MB in 0.09 sec (655.9 MB/sec)
>>      [exec]     verify md5/sha1 digests
>>      [exec]   download lucene-5.0.0.zip...
>>      [exec]     71.0 MB in 0.15 sec (487.0 MB/sec)
>>      [exec]     verify md5/sha1 digests
>>      [exec]   unpack lucene-5.0.0.tgz...
>>      [exec]     verify JAR metadata/identity/no javax.* or java.* classes...
>>      [exec]     test demo with 1.7...
>>      [exec]       got 5489 hits for query "lucene"
>>      [exec]     check Lucene's javadoc JAR
>>      [exec]   unpack lucene-5.0.0.zip...
>>      [exec]     verify JAR metadata/identity/no javax.* or java.* classes...
>>      [exec]     test demo with 1.7...
>>      [exec]       got 5489 hits for query "lucene"
>>      [exec]     check Lucene's javadoc JAR
>>      [exec]   unpack lucene-5.0.0-src.tgz...
>>      [exec]     make sure no JARs/WARs in src dist...
>>      [exec]     run "ant validate"
>>      [exec]     run tests w/ Java 7 and testArgs='-Dtests.jettyConnector=Socket  -Dtests.disableHdfs=true'...
>>      [exec]
>>      [exec] command "export JAVA_HOME="/home/hudson/tools/java/latest1.7" PATH="/home/hudson/tools/java/latest1.7/bin:$PATH" JAVACMD="/home/hudson/tools/java/latest1.7/bin/java"; ant clean test -Dtests.jettyConnector=Socket  -Dtests.disableHdfs=true" failed:
>>      [exec] Buildfile: /usr/home/hudson/hudson-slave/workspace/Lucene-Solr-SmokeRelease-trunk/lucene/build/fakeReleaseTmp/unpack/lucene-5.0.0/build.xml
>>      [exec]
>>      [exec] clean:
>>      [exec]    [delete] Deleting directory /usr/home/hudson/hudson-slave/workspace/Lucene-Solr-SmokeRelease-trunk/lucene/build/fakeReleaseTmp/unpack/lucene-5.0.0/build
>>      [exec]
>>      [exec] ivy-availability-check:
>>      [exec]
>>      [exec] ivy-fail:
>>      [exec]
>>      [exec] ivy-configure:
>>      [exec] [ivy:configure] :: Apache Ivy 2.3.0 - 20130110142753 :: http://ant.apache.org/ivy/ ::
>>      [exec] [ivy:configure] :: loading settings :: file = /usr/home/hudson/hudson-slave/workspace/Lucene-Solr-SmokeRelease-trunk/lucene/build/fakeReleaseTmp/unpack/lucene-5.0.0/ivy-settings.xml
>>      [exec]
>>      [exec] -clover.load:
>>      [exec]
>>      [exec] resolve-groovy:
>>      [exec] [ivy:cachepath] :: resolving dependencies :: org.codehaus.groovy#groovy-all-caller;working
>>      [exec] [ivy:cachepath]     confs: [default]
>>      [exec] [ivy:cachepath]     found org.codehaus.groovy#groovy-all;2.2.2 in public
>>      [exec] [ivy:cachepath] :: resolution report :: resolve 135ms :: artifacts dl 3ms
>>      [exec]     ---------------------------------------------------------------------
>>      [exec]     |                  |            modules            ||   artifacts   |
>>      [exec]     |       conf       | number| search|dwnlded|evicted|| number|dwnlded|
>>      [exec]     ---------------------------------------------------------------------
>>      [exec]     |      default     |   1   |   0   |   0   |   0   ||   1   |   0   |
>>      [exec]     ---------------------------------------------------------------------
>>      [exec]
>>      [exec] -init-totals:
>>      [exec]
>>      [exec] test-core:
>>      [exec]
>>      [exec] -clover.disable:
>>      [exec]
>>      [exec] ivy-availability-check:
>>      [exec]
>>      [exec] ivy-fail:
>>      [exec]
>>      [exec] ivy-configure:
>>      [exec] [ivy:configure] :: loading settings :: file = /usr/home/hudson/hudson-slave/workspace/Lucene-Solr-SmokeRelease-trunk/lucene/build/fakeReleaseTmp/unpack/lucene-5.0.0/ivy-settings.xml
>>      [exec]
>>      [exec] -clover.load:
>>      [exec]
>>      [exec] -clover.classpath:
>>      [exec]
>>      [exec] -clover.setup:
>>      [exec]
>>      [exec] clover:
>>      [exec]
>>      [exec] resolve:
>>      [exec]
>>      [exec] init:
>>      [exec]
>>      [exec] compile-core:
>>      [exec]     [mkdir] Created dir: /usr/home/hudson/hudson-slave/workspace/Lucene-Solr-SmokeRelease-trunk/lucene/build/fakeReleaseTmp/unpack/lucene-5.0.0/build/core/classes/java
>>      [exec]     [javac] Compiling 699 source files to /usr/home/hudson/hudson-slave/workspace/Lucene-Solr-SmokeRelease-trunk/lucene/build/fakeReleaseTmp/unpack/lucene-5.0.0/build/core/classes/java
>>      [exec]     [javac] Note: Some input files use or override a deprecated API.
>>      [exec]     [javac] Note: Recompile with -Xlint:deprecation for details.
>>      [exec]      [copy] Copying 3 files to /usr/home/hudson/hudson-slave/workspace/Lucene-Solr-SmokeRelease-trunk/lucene/build/fakeReleaseTmp/unpack/lucene-5.0.0/build/core/classes/java
>>      [exec]
>>      [exec] compile-test-framework:
>>      [exec]
>>      [exec] ivy-availability-check:
>>      [exec]
>>      [exec] ivy-fail:
>>      [exec]
>>      [exec] ivy-configure:
>>      [exec] [ivy:configure] :: loading settings :: file = /usr/home/hudson/hudson-slave/workspace/Lucene-Solr-SmokeRelease-trunk/lucene/build/fakeReleaseTmp/unpack/lucene-5.0.0/ivy-settings.xml
>>      [exec]
>>      [exec] resolve:
>>      [exec]
>>      [exec] init:
>>      [exec]
>>      [exec] compile-lucene-core:
>>      [exec]
>>      [exec] ivy-availability-check:
>>      [exec]
>>      [exec] ivy-fail:
>>      [exec]
>>      [exec] ivy-configure:
>>      [exec] [ivy:configure] :: loading settings :: file = /usr/home/hudson/hudson-slave/workspace/Lucene-Solr-SmokeRelease-trunk/lucene/build/fakeReleaseTmp/unpack/lucene-5.0.0/ivy-settings.xml
>>      [exec]
>>      [exec] resolve:
>>      [exec]
>>      [exec] init:
>>      [exec]
>>      [exec] -clover.disable:
>>      [exec]
>>      [exec] -clover.load:
>>      [exec]
>>      [exec] -clover.classpath:
>>      [exec]
>>      [exec] -clover.setup:
>>      [exec]
>>      [exec] clover:
>>      [exec]
>>      [exec] compile-core:
>>      [exec]
>>      [exec] compile-codecs:
>>      [exec]      [echo] Building codecs...
>>      [exec]
>>      [exec] ivy-availability-check:
>>      [exec]      [echo] Building codecs...
>>      [exec]
>>      [exec] ivy-fail:
>>      [exec]
>>      [exec] ivy-configure:
>>      [exec] [ivy:configure] :: loading settings :: file = /usr/home/hudson/hudson-slave/workspace/Lucene-Solr-SmokeRelease-trunk/lucene/build/fakeReleaseTmp/unpack/lucene-5.0.0/ivy-settings.xml
>>      [exec]
>>      [exec] resolve:
>>      [exec]
>>      [exec] common.init:
>>      [exec]
>>      [exec] compile-lucene-core:
>>      [exec]
>>      [exec] init:
>>      [exec]
>>      [exec] -clover.disable:
>>      [exec]
>>      [exec] -clover.load:
>>      [exec]
>>      [exec] -clover.classpath:
>>      [exec]
>>      [exec] -clover.setup:
>>      [exec]
>>      [exec] clover:
>>      [exec]
>>      [exec] compile-core:
>>      [exec]     [mkdir] Created dir: /usr/home/hudson/hudson-slave/workspace/Lucene-Solr-SmokeRelease-trunk/lucene/build/fakeReleaseTmp/unpack/lucene-5.0.0/build/codecs/classes/java
>>      [exec]     [javac] Compiling 60 source files to /usr/home/hudson/hudson-slave/workspace/Lucene-Solr-SmokeRelease-trunk/lucene/build/fakeReleaseTmp/unpack/lucene-5.0.0/build/codecs/classes/java
>>      [exec]     [javac] Note: Some input files use or override a deprecated API.
>>      [exec]     [javac] Note: Recompile with -Xlint:deprecation for details.
>>      [exec]      [copy] Copying 3 files to /usr/home/hudson/hudson-slave/workspace/Lucene-Solr-SmokeRelease-trunk/lucene/build/fakeReleaseTmp/unpack/lucene-5.0.0/build/codecs/classes/java
>>      [exec]
>>      [exec] -clover.disable:
>>      [exec]
>>      [exec] -clover.load:
>>      [exec]
>>      [exec] -clover.classpath:
>>      [exec]
>>      [exec] -clover.setup:
>>      [exec]
>>      [exec] clover:
>>      [exec]
>>      [exec] common.compile-core:
>>      [exec]     [mkdir] Created dir: /usr/home/hudson/hudson-slave/workspace/Lucene-Solr-SmokeRelease-trunk/lucene/build/fakeReleaseTmp/unpack/lucene-5.0.0/build/test-framework/classes/java
>>      [exec]     [javac] Compiling 128 source files to /usr/home/hudson/hudson-slave/workspace/Lucene-Solr-SmokeRelease-trunk/lucene/build/fakeReleaseTmp/unpack/lucene-5.0.0/build/test-framework/classes/java
>>      [exec]     [javac] Note: Some input files use or override a deprecated API.
>>      [exec]     [javac] Note: Recompile with -Xlint:deprecation for details.
>>      [exec]      [copy] Copying 4 files to /usr/home/hudson/hudson-slave/workspace/Lucene-Solr-SmokeRelease-trunk/lucene/build/fakeReleaseTmp/unpack/lucene-5.0.0/build/test-framework/classes/java
>>      [exec]
>>      [exec] compile-core:
>>      [exec]
>>      [exec] compile-test:
>>      [exec]     [mkdir] Created dir: /usr/home/hudson/hudson-slave/workspace/Lucene-Solr-SmokeRelease-trunk/lucene/build/fakeReleaseTmp/unpack/lucene-5.0.0/build/core/classes/test
>>      [exec]     [javac] Compiling 407 source files to /usr/home/hudson/hudson-slave/workspace/Lucene-Solr-SmokeRelease-trunk/lucene/build/fakeReleaseTmp/unpack/lucene-5.0.0/build/core/classes/test
>>      [exec]     [javac] Note: Some input files use or override a deprecated API.
>>      [exec]     [javac] Note: Recompile with -Xlint:deprecation for details.
>>      [exec]      [copy] Copying 38 files to /usr/home/hudson/hudson-slave/workspace/Lucene-Solr-SmokeRelease-trunk/lucene/build/fakeReleaseTmp/unpack/lucene-5.0.0/build/core/classes/test
>>      [exec]
>>      [exec] install-junit4-taskdef:
>>      [exec]
>>      [exec] validate:
>>      [exec]
>>      [exec] resolve-groovy:
>>      [exec]
>>      [exec] -init-totals:
>>      [exec]
>>      [exec] -test:
>>      [exec]     [mkdir] Created dir: /usr/home/hudson/hudson-slave/workspace/Lucene-Solr-SmokeRelease-trunk/lucene/build/fakeReleaseTmp/unpack/lucene-5.0.0/build/core/test
>>      [exec]     [mkdir] Created dir: /usr/home/hudson/hudson-slave/workspace/Lucene-Solr-SmokeRelease-trunk/lucene/build/fakeReleaseTmp/unpack/lucene-5.0.0/build/core/test/temp
>>      [exec]     [mkdir] Created dir: /usr/home/hudson/hudson-slave/workspace/Lucene-Solr-SmokeRelease-trunk/lucene/build/fakeReleaseTmp/unpack/.caches/test-stats/core
>>      [exec]    [junit4] <JUnit4> says ??! Master seed: 2363A2D66176CD70
>>      [exec]    [junit4] Your default console's encoding may not display certain unicode glyphs: US-ASCII
>>      [exec]    [junit4] Executing 391 suites with 4 JVMs.
>>      [exec]    [junit4]
>>      [exec]    [junit4] Started J1 PID(38026@lucene.zones.apache.org).
>>      [exec]    [junit4] Started J2 PID(38024@lucene.zones.apache.org).
>>      [exec]    [junit4] Started J3 PID(38025@lucene.zones.apache.org).
>>      [exec]    [junit4] Started J0 PID(38027@lucene.zones.apache.org).
>>      [exec]    [junit4] Suite: org.apache.lucene.index.TestNoMergeScheduler
>>      [exec]    [junit4] Completed on J2 in 2.05s, 3 tests
>>      [exec]    [junit4]
>>      [exec]    [junit4] Suite: org.apache.lucene.index.TestCodecHoldsOpenFiles
>>      [exec]    [junit4] Completed on J1 in 4.31s, 1 test
>>      [exec]    [junit4]
>>      [exec]    [junit4] Suite: org.apache.lucene.document.TestDocument
>>      [exec]    [junit4] Completed on J2 in 2.77s, 12 tests
>>      [exec]    [junit4]
>>      [exec]    [junit4] Suite: org.apache.lucene.index.TestPayloadsOnVectors
>>      [exec]    [junit4] Completed on J2 in 0.32s, 3 tests
>>      [exec]    [junit4]
>>      [exec]    [junit4] Suite: org.apache.lucene.index.TestTermVectorsWriter
>>      [exec]    [junit4] Completed on J3 in 5.15s, 13 tests
>>      [exec]    [junit4]
>>      [exec]    [junit4] Suite: org.apache.lucene.index.TestParallelAtomicReader
>>      [exec]    [junit4] Completed on J2 in 0.63s, 7 tests
>>      [exec]    [junit4]
>>      [exec]    [junit4] Suite: org.apache.lucene.search.TestCachingWrapperFilter
>>      [exec]    [junit4] Completed on J1 in 2.76s, 11 tests
>>      [exec]    [junit4]
>>      [exec]    [junit4] Suite: org.apache.lucene.util.TestBytesRefArray
>>      [exec]    [junit4] Completed on J1 in 0.19s, 2 tests
>>      [exec]    [junit4]
>>      [exec]    [junit4] Suite: org.apache.lucene.index.TestDocumentsWriterStallControl
>>      [exec]    [junit4] Completed on J1 in 0.45s, 3 tests
>>      [exec]    [junit4]
>>      [exec]    [junit4] Suite: org.apache.lucene.index.TestSumDocFreq
>>      [exec]    [junit4] Completed on J1 in 0.58s, 1 test
>>      [exec]    [junit4]
>>      [exec]    [junit4] Suite: org.apache.lucene.util.TestVirtualMethod
>>      [exec]    [junit4] Completed on J1 in 0.10s, 2 tests
>>      [exec]    [junit4]
>>      [exec]    [junit4] Suite: org.apache.lucene.search.TestEarlyTermination
>>      [exec]    [junit4] Completed on J1 in 0.11s, 1 test
>>      [exec]    [junit4]
>>      [exec]    [junit4] Suite: org.apache.lucene.index.TestCompoundFile
>>      [exec]    [junit4] Completed on J3 in 3.39s, 18 tests
>>      [exec]    [junit4]
>>      [exec]    [junit4] Suite: org.apache.lucene.index.TestTransactionRollback
>>      [exec]    [junit4] Completed on J3 in 1.27s, 2 tests
>>      [exec]    [junit4]
>>      [exec]    [junit4] Suite: org.apache.lucene.codecs.lucene40.TestLucene40DocValuesFormat
>>      [exec]    [junit4] IGNOR/A 0.17s J0 | TestLucene40DocValuesFormat.testSortedSetFixedLengthVsStoredFields
>>      [exec]    [junit4]    > Assumption #1: Codec does not support SORTED_SET
>>      [exec]    [junit4] IGNOR/A 0.02s J0 | TestLucene40DocValuesFormat.testSortedSetFixedLengthVsUninvertedField
>>      [exec]    [junit4]    > Assumption #1: Codec does not support SORTED_SET
>>      [exec]    [junit4] IGNOR/A 0.02s J0 | TestLucene40DocValuesFormat.testSortedSetTwoDocumentsMerged
>>      [exec]    [junit4]    > Assumption #1: Codec does not support SORTED_SET
>>      [exec]    [junit4] IGNOR/A 0.03s J0 | TestLucene40DocValuesFormat.testTwoBytesOneMissing
>>      [exec]    [junit4]    > Assumption #1: Codec does not support getDocsWithField
>>      [exec]    [junit4] IGNOR/A 0.01s J0 | TestLucene40DocValuesFormat.testSortedSetOneValue
>>      [exec]    [junit4]    > Assumption #1: Codec does not support SORTED_SET
>>      [exec]    [junit4] IGNOR/A 0.01s J0 | TestLucene40DocValuesFormat.testSortedSetTwoDocumentsFirstMissingMerge
>>      [exec]    [junit4]    > Assumption #1: Codec does not support SORTED_SET
>>      [exec]    [junit4] IGNOR/A 0.01s J0 | TestLucene40DocValuesFormat.testSortedSetTwoDocumentsFirstMissing
>>      [exec]    [junit4]    > Assumption #1: Codec does not support SORTED_SET
>>      [exec]    [junit4] IGNOR/A 0.01s J0 | TestLucene40DocValuesFormat.testTwoNumbersOneMissingWithMerging
>>      [exec]    [junit4]    > Assumption #1: Codec does not support getDocsWithField
>>      [exec]    [junit4] IGNOR/A 0.01s J0 | TestLucene40DocValuesFormat.testByteMissingVsFieldCache
>>      [exec]    [junit4]    > Assumption #1: Codec does not support getDocsWithField
>>      [exec]    [junit4] IGNOR/A 0.02s J0 | TestLucene40DocValuesFormat.testShortMissingVsFieldCache
>>      [exec]    [junit4]    > Assumption #1: Codec does not support getDocsWithField
>>      [exec]    [junit4] IGNOR/A 0.02s J0 | TestLucene40DocValuesFormat.testSortedSetVariableLengthVsUninvertedField
>>      [exec]    [junit4]    > Assumption #1: Codec does not support SORTED_SET
>>      [exec]    [junit4] IGNOR/A 0.01s J0 | TestLucene40DocValuesFormat.testSortedSetFixedLengthSingleValuedVsStoredFields
>>      [exec]    [junit4]    > Assumption #1: Codec does not support SORTED_SET
>>      [exec]    [junit4] IGNOR/A 0.01s J0 | TestLucene40DocValuesFormat.testSortedSetVariableLengthSingleValuedVsStoredFields
>>      [exec]    [junit4]    > Assumption #1: Codec does not support SORTED_SET
>>      [exec]    [junit4] IGNOR/A 0.01s J0 | TestLucene40DocValuesFormat.testIntMissingVsFieldCache
>>      [exec]    [junit4]    > Assumption #1: Codec does not support getDocsWithField
>>      [exec]    [junit4] IGNOR/A 0.01s J0 | TestLucene40DocValuesFormat.testSortedSetMergeAwayAllValues
>>      [exec]    [junit4]    > Assumption #1: Codec does not support SORTED_SET
>>      [exec]    [junit4] IGNOR/A 0.01s J0 | TestLucene40DocValuesFormat.testLongMissingVsFieldCache
>>      [exec]    [junit4]    > Assumption #1: Codec does not support getDocsWithField
>>      [exec]    [junit4] IGNOR/A 0.01s J0 | TestLucene40DocValuesFormat.testThreads2
>>      [exec]    [junit4]    > Assumption #1: Codec does not support getDocsWithField
>>      [exec]    [junit4] IGNOR/A 0.01s J0 | TestLucene40DocValuesFormat.testSortedSetTwoDocumentsLastMissingMerge
>>      [exec]    [junit4]    > Assumption #1: Codec does not support SORTED_SET
>>      [exec]    [junit4] IGNOR/A 0.01s J0 | TestLucene40DocValuesFormat.testThreeBytesOneMissingWithMerging
>>      [exec]    [junit4]    > Assumption #1: Codec does not support getDocsWithField
>>      [exec]    [junit4] IGNOR/A 0.01s J0 | TestLucene40DocValuesFormat.testTwoNumbersOneMissing
>>      [exec]    [junit4]    > Assumption #1: Codec does not support getDocsWithField
>>      [exec]    [junit4] IGNOR/A 0.01s J0 | TestLucene40DocValuesFormat.testTwoBytesOneMissingWithMerging
>>      [exec]    [junit4]    > Assumption #1: Codec does not support getDocsWithField
>>      [exec]    [junit4] IGNOR/A 0.01s J0 | TestLucene40DocValuesFormat.testSortedSetThreeValuesTwoDocs
>>      [exec]    [junit4]    > Assumption #1: Codec does not support SORTED_SET
>>      [exec]    [junit4] IGNOR/A 0.01s J0 | TestLucene40DocValuesFormat.testThreeNumbersOneMissingWithMerging
>>      [exec]    [junit4]    > Assumption #1: Codec does not support getDocsWithField
>>      [exec]    [junit4] IGNOR/A 0.01s J0 | TestLucene40DocValuesFormat.testSortedSetTermsEnum
>>      [exec]    [junit4]    > Assumption #1: Codec does not support SORTED_SET
>>      [exec]    [junit4] IGNOR/A 0.01s J0 | TestLucene40DocValuesFormat.testSortedSetTwoValuesUnordered
>>      [exec]    [junit4]    > Assumption #1: Codec does not support SORTED_SET
>>      [exec]    [junit4] IGNOR/A 0.01s J0 | TestLucene40DocValuesFormat.testSortedSetVariableLengthVsStoredFields
>>      [exec]    [junit4]    > Assumption #1: Codec does not support SORTED_SET
>>      [exec]    [junit4] IGNOR/A 0.01s J0 | TestLucene40DocValuesFormat.testSortedSetTwoFields
>>      [exec]    [junit4]    > Assumption #1: Codec does not support SORTED_SET
>>      [exec]    [junit4] IGNOR/A 0.01s J0 | TestLucene40DocValuesFormat.testSortedSetTwoDocumentsLastMissing
>>      [exec]    [junit4]    > Assumption #1: Codec does not support SORTED_SET
>>      [exec]    [junit4] IGNOR/A 0.01s J0 | TestLucene40DocValuesFormat.testSortedSetTwoValues
>>      [exec]    [junit4]    > Assumption #1: Codec does not support SORTED_SET
>>      [exec]    [junit4] Completed on J0 in 12.58s, 79 tests, 29 skipped
>>      [exec]    [junit4]
>>      [exec]    [junit4] Suite: org.apache.lucene.index.TestTieredMergePolicy
>>      [exec]    [junit4] Completed on J3 in 3.64s, 5 tests
>>      [exec]    [junit4]
>>      [exec]    [junit4] Suite: org.apache.lucene.search.TestSortDocValues
>>      [exec]    [junit4] Completed on J3 in 0.76s, 23 tests
>>      [exec]    [junit4]
>>      [exec]    [junit4] Suite: org.apache.lucene.util.TestInPlaceMergeSorter
>>      [exec]    [junit4] Completed on J3 in 0.67s, 9 tests
>>      [exec]    [junit4]
>>      [exec]    [junit4] Suite: org.apache.lucene.search.TestSimpleSearchEquivalence
>>      [exec]    [junit4] Completed on J3 in 1.44s, 12 tests
>>      [exec]    [junit4]
>>      [exec]    [junit4] Suite: org.apache.lucene.search.TestNumericRangeQuery64
>>      [exec]    [junit4] Completed on J2 in 12.58s, 34 tests
>>      [exec]    [junit4]
>>      [exec]    [junit4] Suite: org.apache.lucene.util.TestDocIdBitSet
>>      [exec]    [junit4] Completed on J2 in 0.32s, 4 tests
>>      [exec]    [junit4]
>>      [exec]    [junit4] Suite: org.apache.lucene.util.automaton.TestMinimize
>>      [exec]    [junit4] Completed on J3 in 2.65s, 3 tests
>>      [exec]    [junit4]
>>      [exec]    [junit4] Suite: org.apache.lucene.search.TestMultiValuedNumericRangeQuery
>>      [exec]    [junit4] Completed on J2 in 1.19s, 1 test
>>      [exec]    [junit4]
>>      [exec]    [junit4] Suite: org.apache.lucene.util.TestRecyclingIntBlockAllocator
>>      [exec]    [junit4] Completed on J3 in 0.45s, 3 tests
>>      [exec]    [junit4]
>>      [exec]    [junit4] Suite: org.apache.lucene.TestSearch
>>      [exec]    [junit4] Completed on J3 in 0.18s, 2 tests
>>      [exec]    [junit4]
>>      [exec]    [junit4] Suite: org.apache.lucene.util.automaton.TestCompiledAutomaton
>>      [exec]    [junit4] Completed on J2 in 0.61s, 2 tests
>>      [exec]    [junit4]
>>      [exec]    [junit4] Suite: org.apache.lucene.util.TestPriorityQueue
>>      [exec]    [junit4] Completed on J2 in 0.04s, 4 tests
>>      [exec]    [junit4]
>>      [exec]    [junit4] Suite: org.apache.lucene.analysis.TestMockCharFilter
>>      [exec]    [junit4] Completed on J2 in 0.05s, 1 test
>>      [exec]    [junit4]
>>      [exec]    [junit4] Suite: org.apache.lucene.search.TestMultiThreadTermVectors
>>      [exec]    [junit4] Completed on J2 in 1.08s, 1 test
>>      [exec]    [junit4]
>>      [exec]    [junit4] Suite: org.apache.lucene.index.TestCrashCausesCorruptIndex
>>      [exec]    [junit4] Completed on J2 in 0.43s, 1 test
>>      [exec]    [junit4]
>>      [exec]    [junit4] Suite: org.apache.lucene.analysis.TestMockAnalyzer
>>      [exec]    [junit4] Completed on J0 in 9.06s, 17 tests
>>      [exec]    [junit4]
>>      [exec]    [junit4] Suite: org.apache.lucene.index.TestTryDelete
>>      [exec]    [junit4] Completed on J2 in 0.11s, 3 tests
>>      [exec]    [junit4]
>>      [exec]    [junit4] Suite: org.apache.lucene.search.spans.TestSpanExplanationsOfNonMatches
>>      [exec]    [junit4] Completed on J2 in 0.28s, 31 tests
>>      [exec]    [junit4]
>>      [exec]    [junit4] Suite: org.apache.lucene.search.TestSimpleExplanations
>>      [exec]    [junit4] Completed on J3 in 2.72s, 69 tests
>>      [exec]    [junit4]
>>      [exec]    [junit4] Suite: org.apache.lucene.index.TestForTooMuchCloning
>>      [exec]    [junit4] Completed on J3 in 0.40s, 1 test
>>      [exec]    [junit4]
>>      [exec]    [junit4] Suite: org.apache.lucene.search.TestBooleanScorer
>>      [exec]    [junit4] Completed on J3 in 0.15s, 4 tests
>>      [exec]    [junit4]
>>      [exec]    [junit4] Suite: org.apache.lucene.search.spans.TestSpansAdvanced2
>>      [exec]    [junit4] Completed on J3 in 0.37s, 4 tests
>>      [exec]    [junit4]
>>      [exec]    [junit4] Suite: org.apache.lucene.index.TestSameTokenSamePosition
>>      [exec]    [junit4] Completed on J3 in 0.14s, 2 tests
>>      [exec]    [junit4]
>>      [exec]    [junit4] Suite: org.apache.lucene.index.TestIndexWriterUnicode
>>      [exec]    [junit4] Completed on J2 in 2.34s, 5 tests
>>      [exec]    [junit4]
>>      [exec]    [junit4] Suite: org.apache.lucene.util.TestFixedBitSet
>>      [exec]    [junit4] Completed on J2 in 2.25s, 11 tests
>>      [exec]    [junit4]
>>      [exec]    [junit4] Suite: org.apache.lucene.util.TestIOUtils
>>      [exec]    [junit4] Completed on J2 in 0.02s, 1 test
>>      [exec]    [junit4]
>>      [exec]    [junit4] Suite: org.apache.lucene.util.TestRamUsageEstimator
>>      [exec]    [junit4] Completed on J2 in 0.03s, 3 tests
>>      [exec]    [junit4]
>>      [exec]    [junit4] Suite: org.apache.lucene.index.TestIndexWriterExceptions
>>      [exec]    [junit4] Completed on J1 in 18.58s, 29 tests
>>      [exec]    [junit4]
>>      [exec]    [junit4] Suite: org.apache.lucene.index.TestIntBlockPool
>>      [exec]    [junit4] Completed on J1 in 0.70s, 2 tests
>>      [exec]    [junit4]
>>      [exec]    [junit4] Suite: org.apache.lucene.util.junitcompat.TestBeforeAfterOverrides
>>      [exec]    [junit4] Completed on J1 in 0.16s, 2 tests
>>      [exec]    [junit4]
>>      [exec]    [junit4] Suite: org.apache.lucene.util.TestOfflineSorter
>>      [exec]    [junit4] IGNOR/A 0.20s J3 | TestOfflineSorter.testLargerRandom
>>      [exec]    [junit4]    > Assumption #1: 'nightly' test group is disabled (@Nightly())
>>      [exec]    [junit4] Completed on J3 in 4.75s, 6 tests, 1 skipped
>>      [exec]    [junit4]
>>      [exec]    [junit4] Suite: org.apache.lucene.index.TestConsistentFieldNumbers
>>      [exec]    [junit4] Completed on J2 in 2.26s, 4 tests
>>      [exec]    [junit4]
>>      [exec]    [junit4] Suite: org.apache.lucene.search.TestFieldCache
>>      [exec]    [junit4] Completed on J1 in 1.75s, 10 tests
>>      [exec]    [junit4]
>>      [exec]    [junit4] Suite: org.apache.lucene.index.TestDirectoryReader
>>      [exec]    [junit4] Completed on J1 in 2.33s, 25 tests
>>      [exec]    [junit4]
>>      [exec]    [junit4] Suite: org.apache.lucene.search.TestControlledRealTimeReopenThread
>>      [exec]    [junit4] Completed on J0 in 10.25s, 5 tests
>>      [exec]    [junit4]
>>      [exec]    [junit4] Suite: org.apache.lucene.util.TestOpenBitSet
>>      [exec]    [junit4] Completed on J3 in 3.96s, 9 tests
>>      [exec]    [junit4]
>>      [exec]    [junit4] Suite: org.apache.lucene.index.TestDocumentsWriterDeleteQueue
>>      [exec]    [junit4] Completed on J0 in 0.44s, 5 tests
>>      [exec]    [junit4]
>>      [exec]    [junit4] Suite: org.apache.lucene.util.TestSentinelIntSet
>>      [exec]    [junit4] Completed on J3 in 0.33s, 2 tests
>>      [exec]    [junit4]
>>      [exec]    [junit4] Suite: org.apache.lucene.index.TestFieldInfos
>>      [exec]    [junit4] Completed on J3 in 0.03s, 2 tests
>>      [exec]    [junit4]
>>      [exec]    [junit4] Suite: org.apache.lucene.index.TestParallelTermEnum
>>      [exec]    [junit4] Completed on J3 in 0.04s, 1 test
>>      [exec]    [junit4]
>>      [exec]    [junit4] Suite: org.apache.lucene.search.TestSimpleExplanationsOfNonMatches
>>      [exec]    [junit4] Completed on J0 in 0.47s, 69 tests
>>      [exec]    [junit4]
>>      [exec]    [junit4] Suite: org.apache.lucene.search.TestDateFilter
>>      [exec]    [junit4] Completed on J0 in 0.20s, 2 tests
>>      [exec]    [junit4]
>>      [exec]    [junit4] Suite: org.apache.lucene.index.Test4GBStoredFields
>>      [exec]    [junit4] IGNOR/A 0.01s J0 | Test4GBStoredFields.test
>>      [exec]    [junit4]    > Assumption #1: 'nightly' test group is disabled (@Nightly())
>>      [exec]    [junit4] Completed on J0 in 0.03s, 1 test, 1 skipped
>>      [exec]    [junit4]
>>      [exec]    [junit4] Suite: org.apache.lucene.search.spans.TestPayloadSpans
>>      [exec]    [junit4] Completed on J1 in 1.26s, 10 tests
>>      [exec]    [junit4]
>>      [exec]    [junit4] Suite: org.apache.lucene.util.TestSetOnce
>>      [exec]    [junit4] Completed on J0 in 0.04s, 4 tests
>>      [exec]    [junit4]
>>      [exec]    [junit4] Suite: org.apache.lucene.index.TestIndexWriterDelete
>>      [exec]    [junit4] IGNOR/A 0.12s J2 | TestIndexWriterDelete.testApplyDeletesOnFlush
>>      [exec]    [junit4]    > Assumption #1: 'nightly' test group is disabled (@Nightly())
>>      [exec]    [junit4] Completed on J2 in 5.24s, 22 tests, 1 skipped
>>      [exec]    [junit4]
>>      [exec]    [junit4] Suite: org.apache.lucene.index.TestPostingsFormat
>>      [exec]    [junit4] IGNOR/A 0.01s J0 | TestPostingsFormat.testMergeStability
>>      [exec]    [junit4]    > Assumption #1: The MockRandom PF randomizes content on the fly, so we can't check it
>>      [exec]    [junit4] Completed on J0 in 1.62s, 12 tests, 1 skipped
>>      [exec]    [junit4]
>>      [exec]    [junit4] Suite: org.apache.lucene.codecs.lucene41.TestForUtil
>>      [exec]    [junit4] Completed on J0 in 0.08s, 1 test
>>      [exec]    [junit4]
>>      [exec]    [junit4] Suite: org.apache.lucene.index.TestPayloads
>>      [exec]    [junit4] Completed on J0 in 0.37s, 7 tests
>>      [exec]    [junit4]
>>      [exec]    [junit4] Suite: org.apache.lucene.index.TestNorms
>>      [exec]    [junit4] Completed on J0 in 0.98s, 2 tests
>>      [exec]    [junit4]
>>      [exec]    [junit4] Suite: org.apache.lucene.index.TestLongPostings
>>      [exec]    [junit4] Completed on J1 in 3.70s, 2 tests
>>      [exec]    [junit4]
>>      [exec]    [junit4] Suite: org.apache.lucene.codecs.perfield.TestPerFieldPostingsFormat
>>      [exec]    [junit4] IGNOR/A 0.01s J2 | TestPerFieldPostingsFormat.testMergeStability
>>      [exec]    [junit4]    > Assumption #1: The MockRandom PF randomizes content on the fly, so we can't check it
>>      [exec]    [junit4] Completed on J2 in 3.28s, 12 tests, 1 skipped
>>      [exec]    [junit4]
>>      [exec]    [junit4] Suite: org.apache.lucene.util.junitcompat.TestGroupFiltering
>>      [exec]    [junit4] IGNOR/A 0.00s J2 | TestGroupFiltering.testJira
>>      [exec]    [junit4]    > Assumption #1: 'jira' test group is disabled (@Jira(bug=JIRA bug reference))
>>      [exec]    [junit4] IGNOR/A 0.00s J2 | TestGroupFiltering.testBar
>>      [exec]    [junit4]    > Assumption #1: 'bar' test group is disabled (@Bar())
>>      [exec]    [junit4] IGNOR/A 0.00s J2 | TestGroupFiltering.testFoo
>>      [exec]    [junit4]    > Assumption #1: 'foo' test group is disabled (@Foo())
>>      [exec]    [junit4] IGNOR/A 0.00s J2 | TestGroupFiltering.testFooBar
>>      [exec]    [junit4]    > Assumption #1: 'bar' test group is disabled (@Bar())
>>      [exec]    [junit4] Completed on J2 in 0.05s, 4 tests, 4 skipped
>>      [exec]    [junit4]
>>      [exec]    [junit4] Suite: org.apache.lucene.index.TestStressIndexing
>>      [exec]    [junit4] Completed on J0 in 1.29s, 1 test
>>      [exec]    [junit4]
>>      [exec]    [junit4] Suite: org.apache.lucene.index.TestNRTReaderWithThreads
>>      [exec]    [junit4] Completed on J1 in 1.20s, 1 test
>>      [exec]    [junit4]
>>      [exec]    [junit4] Suite: org.apache.lucene.index.TestCodecs
>>      [exec]    [junit4] Completed on J0 in 0.44s, 4 tests
>>      [exec]    [junit4]
>>      [exec]    [junit4] Suite: org.apache.lucene.index.Test2BPositions
>>      [exec]    [junit4] IGNOR/A 0.19s J1 | Test2BPositions.test
>>      [exec]    [junit4]    > Assumption #1: 'monster' test group is disabled (@Monster(value=uses lots of space and takes a few minutes))
>>      [exec]    [junit4] Completed on J1 in 0.23s, 1 test, 1 skipped
>>      [exec]    [junit4]
>>      [exec]    [junit4] Suite: org.apache.lucene.search.TestQueryRescorer
>>      [exec]    [junit4] Completed on J1 in 1.14s, 5 tests
>>      [exec]    [junit4]
>>      [exec]    [junit4] Suite: org.apache.lucene.search.TestPhraseQuery
>>      [exec]    [junit4] Completed on J2 in 2.33s, 18 tests
>>      [exec]    [junit4]
>>      [exec]    [junit4] Suite: org.apache.lucene.search.TestTermRangeFilter
>>      [exec]    [junit4] Completed on J0 in 1.57s, 3 tests
>>      [exec]    [junit4]
>>      [exec]    [junit4] Suite: org.apache.lucene.util.junitcompat.TestFailOnFieldCacheInsanity
>>      [exec]    [junit4] Completed on J0 in 0.09s, 1 test
>>      [exec]    [junit4]
>>      [exec]    [junit4] Suite: org.apache.lucene.index.TestOmitTf
>>      [exec]    [junit4] Completed on J2 in 0.65s, 6 tests
>>      [exec]    [junit4]
>>      [exec]    [junit4] Suite: org.apache.lucene.util.TestFieldCacheSanityChecker
>>      [exec]    [junit4] Completed on J0 in 0.72s, 3 tests
>>      [exec]    [junit4]
>>      [exec]    [junit4] Suite: org.apache.lucene.index.TestReaderClosed
>>      [exec]    [junit4] Completed on J0 in 0.11s, 2 tests
>>      [exec]    [junit4]
>>      [exec]    [junit4] Suite: org.apache.lucene.util.TestBroadWord
>>      [exec]    [junit4] Completed on J2 in 0.86s, 11 tests
>>      [exec]    [junit4]
>>      [exec]    [junit4] Suite: org.apache.lucene.index.TestSegmentMerger
>>      [exec]    [junit4] Completed on J0 in 0.72s, 3 tests
>>      [exec]    [junit4]
>>      [exec]    [junit4] Suite: org.apache.lucene.index.Test2BNumericDocValues
>>      [exec]    [junit4] IGNOR/A 0.00s J0 | Test2BNumericDocValues.testNumerics
>>      [exec]    [junit4]    > Assumption #1: 'monster' test group is disabled (@Monster(value=takes ~ 30 minutes))
>>      [exec]    [junit4] Completed on J0 in 0.01s, 1 test, 1 skipped
>>      [exec]    [junit4]
>>      [exec]    [junit4] Suite: org.apache.lucene.util.automaton.TestLevenshteinAutomata
>>      [exec]    [junit4] Completed on J0 in 1.23s, 4 tests
>>      [exec]    [junit4]
>>      [exec]    [junit4] Suite: org.apache.lucene.util.TestIdentityHashSet
>>      [exec]    [junit4] Completed on J0 in 0.11s, 1 test
>>      [exec]    [junit4]
>>      [exec]    [junit4] Suite: org.apache.lucene.index.TestNoMergePolicy
>>      [exec]    [junit4] Completed on J0 in 0.02s, 4 tests
>>      [exec]    [junit4]
>>      [exec]    [junit4] Suite: org.apache.lucene.util.TestStringHelper
>>      [exec]    [junit4] Completed on J0 in 0.01s, 1 test
>>      [exec]    [junit4]
>>      [exec]    [junit4] Suite: org.apache.lucene.index.TestAllFilesHaveCodecHeader
>>      [exec]    [junit4] Completed on J0 in 0.17s, 1 test
>>      [exec]    [junit4]
>>      [exec]    [junit4] Suite: org.apache.lucene.document.TestDateTools
>>      [exec]    [junit4] Completed on J0 in 0.05s, 5 tests
>>      [exec]    [junit4]
>>      [exec]    [junit4] Suite: org.apache.lucene.search.TestTopScoreDocCollector
>>      [exec]    [junit4] Completed on J0 in 0.03s, 1 test
>>      [exec]    [junit4]
>>      [exec]    [junit4] Suite: org.apache.lucene.index.TestNRTThreads
>>      [exec]    [junit4] Completed on J1 in 3.53s, 1 test
>>      [exec]    [junit4]
>>      [exec]    [junit4] Suite: org.apache.lucene.index.TestSizeBoundedForceMerge
>>      [exec]    [junit4] Completed on J1 in 0.13s, 11 tests
>>      [exec]    [junit4]
>>      [exec]    [junit4] Suite: org.apache.lucene.index.TestPerSegmentDeletes
>>      [exec]    [junit4] Completed on J0 in 0.10s, 1 test
>>      [exec]    [junit4]
>>      [exec]    [junit4] Suite: org.apache.lucene.search.TestCustomSearcherSort
>>      [exec]    [junit4] Completed on J0 in 0.78s, 2 tests
>>      [exec]    [junit4]
>>      [exec]    [junit4] Suite: org.apache.lucene.search.TestSloppyPhraseQuery
>>      [exec]    [junit4] Completed on J1 in 2.32s, 9 tests
>>      [exec]    [junit4]
>>      [exec]    [junit4] Suite: org.apache.lucene.index.TestIndexReaderClose
>>      [exec]    [junit4] Completed on J0 in 1.73s, 1 test
>>      [exec]    [junit4]
>>      [exec]    [junit4] Suite: org.apache.lucene.util.junitcompat.TestReproduceMessage
>>      [exec]    [junit4] Completed on J1 in 0.44s, 21 tests
>>      [exec]    [junit4]
>>      [exec]    [junit4] Suite: org.apache.lucene.search.TestMinShouldMatch2
>>      [exec]    [junit4] Completed on J1 in 2.36s, 6 tests
>>      [exec]    [junit4]
>>      [exec]    [junit4] Suite: org.apache.lucene.analysis.TestCharFilter
>>      [exec]    [junit4] Completed on J1 in 0.02s, 4 tests
>>      [exec]    [junit4]
>>      [exec]    [junit4] Suite: org.apache.lucene.util.TestRamUsageEstimatorOnWildAnimals
>>      [exec]    [junit4] Completed on J1 in 0.45s, 1 test
>>      [exec]    [junit4]
>>      [exec]    [junit4] Suite: org.apache.lucene.index.TestMaxTermFrequency
>>      [exec]    [junit4] Completed on J1 in 0.16s, 1 test
>>      [exec]    [junit4]
>>      [exec]    [junit4] Suite: org.apache.lucene.search.TestTermVectors
>>      [exec]    [junit4] Completed on J1 in 0.18s, 4 tests
>>      [exec]    [junit4]
>>      [exec]    [junit4] Suite: org.apache.lucene.codecs.lucene41.TestBlockPostingsFormat3
>>      [exec]    [junit4] Completed on J2 in 7.65s, 1 test
>>      [exec]    [junit4]
>>      [exec]    [junit4] Suite: org.apache.lucene.util.TestSmallFloat
>>      [exec]    [junit4] Completed on J2 in 0.08s, 2 tests
>>      [exec]    [junit4]
>>      [exec]    [junit4] Suite: org.apache.lucene.index.TestBinaryTerms
>>      [exec]    [junit4] Completed on J1 in 0.12s, 2 tests
>>      [exec]    [junit4]
>>      [exec]    [junit4] Suite: org.apache.lucene.codecs.lucene40.TestLucene40StoredFieldsFormat
>>      [exec]    [junit4] IGNOR/A 0.00s J2 | TestLucene40StoredFieldsFormat.testBigDocuments
>>      [exec]    [junit4]    > Assumption #1: 'nightly' test group is disabled (@Nightly())
>>      [exec]    [junit4] Completed on J2 in 1.57s, 12 tests, 1 skipped
>>      [exec]    [junit4]
>>      [exec]    [junit4] Suite: org.apache.lucene.util.junitcompat.TestExceptionInBeforeClassHooks
>>      [exec]    [junit4] Completed on J2 in 0.22s, 3 tests
>>      [exec]    [junit4]
>>      [exec]    [junit4] Suite: org.apache.lucene.search.TestDocIdSet
>>      [exec]    [junit4] Completed on J2 in 0.05s, 3 tests
>>      [exec]    [junit4]
>>      [exec]    [junit4] Suite: org.apache.lucene.search.spans.TestSpanSearchEquivalence
>>      [exec]    [junit4] Completed on J2 in 0.51s, 8 tests
>>      [exec]    [junit4]
>>      [exec]    [junit4] Suite: org.apache.lucene.util.TestFilterIterator
>>      [exec]    [junit4] Completed on J2 in 0.08s, 8 tests
>>      [exec]    [junit4]
>>      [exec]    [junit4] Suite: org.apache.lucene.index.TestIndexCommit
>>      [exec]    [junit4] Completed on J2 in 0.01s, 1 test
>>      [exec]    [junit4]
>>      [exec]    [junit4] Suite: org.apache.lucene.index.TestIndexFileDeleter
>>      [exec]    [junit4] Completed on J2 in 0.11s, 1 test
>>      [exec]    [junit4]
>>      [exec]    [junit4] Suite: org.apache.lucene.index.TestRollback
>>      [exec]    [junit4] Completed on J2 in 0.02s, 1 test
>>      [exec]    [junit4]
>>      [exec]    [junit4] Suite: org.apache.lucene.codecs.lucene40.TestBitVector
>>      [exec]    [junit4] Completed on J2 in 0.96s, 9 tests
>>      [exec]    [junit4]
>>      [exec]    [junit4] Suite: org.apache.lucene.codecs.perfield.TestPerFieldPostingsFormat2
>>      [exec]    [junit4] Completed on J2 in 0.46s, 5 tests
>>      [exec]    [junit4]
>>      [exec]    [junit4] Suite: org.apache.lucene.codecs.compressing.TestFastDecompressionMode
>>      [exec]    [junit4] Completed on J2 in 1.14s, 11 tests
>>      [exec]    [junit4]
>>      [exec]    [junit4] Suite: org.apache.lucene.search.TestBoolean2
>>      [exec]    [junit4] Completed on J2 in 1.92s, 11 tests
>>      [exec]    [junit4]
>>      [exec]    [junit4] Suite: org.apache.lucene.search.spans.TestNearSpansOrdered
>>      [exec]    [junit4] Completed on J2 in 0.15s, 10 tests
>>      [exec]    [junit4]
>>      [exec]    [junit4] Suite: org.apache.lucene.search.TestTermScorer
>>      [exec]    [junit4] Completed on J2 in 0.04s, 3 tests
>>      [exec]    [junit4]
>>      [exec]    [junit4] Suite: org.apache.lucene.codecs.perfield.TestPerFieldDocValuesFormat
>>      [exec]    [junit4] IGNOR/A 0.01s J1 | TestPerFieldDocValuesFormat.testHugeBinaryValueLimit
>>      [exec]    [junit4]    > Assumption #1: test requires codec with limits on max binary field length
>>      [exec]    [junit4] Completed on J1 in 8.17s, 80 tests, 1 skipped
>>      [exec]    [junit4]
>>      [exec]    [junit4] Suite: org.apache.lucene.search.TestSort
>>      [exec]    [junit4] Completed on J1 in 0.57s, 43 tests
>>      [exec]    [junit4]
>>      [exec]    [junit4] Suite: org.apache.lucene.store.TestByteArrayDataInput
>>      [exec]    [junit4] Completed on J1 in 0.01s, 1 test
>>      [exec]    [junit4]
>>      [exec]    [junit4] Suite: org.apache.lucene.util.TestMergedIterator
>>      [exec]    [junit4] Completed on J1 in 1.12s, 25 tests
>>      [exec]    [junit4]
>>      [exec]    [junit4] Suite: org.apache.lucene.util.TestAttributeSource
>>      [exec]    [junit4] Completed on J1 in 0.04s, 5 tests
>>      [exec]    [junit4]
>>      [exec]    [junit4] Suite: org.apache.lucene.util.TestCharsRef
>>      [exec]    [junit4] Completed on J1 in 0.05s, 8 tests
>>      [exec]    [junit4]
>>      [exec]    [junit4] Suite: org.apache.lucene.index.TestOmitNorms
>>      [exec]    [junit4] Completed on J1 in 0.71s, 5 tests
>>      [exec]    [junit4]
>>      [exec]    [junit4] Suite: org.apache.lucene.search.spans.TestBasics
>>      [exec]    [junit4] Completed on J2 in 3.91s, 28 tests
>>      [exec]    [junit4]
>>      [exec]    [junit4] Suite: org.apache.lucene.search.TestComplexExplanationsOfNonMatches
>>      [exec]    [junit4] Completed on J2 in 0.20s, 22 tests
>>      [exec]    [junit4]
>>      [exec]    [junit4] Suite: org.apache.lucene.util.TestCloseableThreadLocal
>>      [exec]    [junit4] Completed on J2 in 0.02s, 3 tests
>>      [exec]    [junit4]
>>      [exec]    [junit4] Suite: org.apache.lucene.codecs.lucene41.TestLucene41StoredFieldsFormat
>>      [exec]    [junit4] IGNOR/A 0.00s J2 | TestLucene41StoredFieldsFormat.testBigDocuments
>>      [exec]    [junit4]    > Assumption #1: 'nightly' test group is disabled (@Nightly())
>>      [exec]    [junit4] Completed on J2 in 1.74s, 12 tests, 1 skipped
>>      [exec]    [junit4]
>>      [exec]    [junit4] Suite: org.apache.lucene.search.similarities.TestSimilarityBase
>>      [exec]    [junit4] Completed on J2 in 0.65s, 30 tests
>>      [exec]    [junit4]
>>      [exec]    [junit4] Suite: org.apache.lucene.codecs.lucene40.TestLucene40TermVectorsFormat
>>      [exec]    [junit4] Completed on J1 in 3.33s, 8 tests
>>      [exec]    [junit4]
>>      [exec]    [junit4] Suite: org.apache.lucene.index.TestLazyProxSkipping
>>      [exec]    [junit4] Completed on J2 in 0.56s, 2 tests
>>      [exec]    [junit4]
>>      [exec]    [junit4] Suite: org.apache.lucene.index.TestBinaryDocValuesUpdates
>>      [exec]    [junit4] Completed on J3 in 34.78s, 31 tests
>>      [exec]    [junit4]
>>      [exec]    [junit4] Suite: org.apache.lucene.util.junitcompat.TestSetupTeardownChaining
>>      [exec]    [junit4] Completed on J3 in 0.10s, 2 tests
>>      [exec]    [junit4]
>>      [exec]    [junit4] Suite: org.apache.lucene.search.TestSortRandom
>>      [exec]    [junit4] Completed on J3 in 0.17s, 1 test
>>      [exec]    [junit4]
>>      [exec]    [junit4] Suite: org.apache.lucene.index.TestMultiDocValues
>>      [exec]    [junit4] Completed on J1 in 5.50s, 7 tests
>>      [exec]    [junit4]
>>      [exec]    [junit4] Suite: org.apache.lucene.index.TestThreadedForceMerge
>>      [exec]    [junit4] Completed on J3 in 0.93s, 1 test
>>      [exec]    [junit4]
>>      [exec]    [junit4] Suite: org.apache.lucene.util.TestTimSorter
>>      [exec]    [junit4] Completed on J1 in 0.26s, 9 tests
>>      [exec]    [junit4]
>>      [exec]    [junit4] Suite: org.apache.lucene.util.TestWeakIdentityMap
>>      [exec]    [junit4] Completed on J1 in 1.04s, 2 tests
>>      [exec]    [junit4]
>>      [exec]    [junit4] Suite: org.apache.lucene.store.TestNRTCachingDirectory
>>      [exec]    [junit4] IGNOR/A 0.01s J3 | TestNRTCachingDirectory.testFsyncDoesntCreateNewFiles
>>      [exec]    [junit4]    > Assumption #1: test only works for FSDirectory subclasses
>>      [exec]    [junit4] Completed on J3 in 3.39s, 26 tests, 1 skipped
>>      [exec]    [junit4]
>>      [exec]    [junit4] Suite: org.apache.lucene.index.TestFlushByRamOrCountsPolicy
>>      [exec]    [junit4] Completed on J1 in 2.10s, 5 tests
>>      [exec]    [junit4]
>>      [exec]    [junit4] Suite: org.apache.lucene.index.TestIndexWriterConfig
>>      [exec]    [junit4] Completed on J1 in 0.09s, 9 tests
>>      [exec]    [junit4]
>>      [exec]    [junit4] Suite: org.apache.lucene.util.TestPForDeltaDocIdSet
>>      [exec]    [junit4] Completed on J1 in 0.29s, 4 tests
>>      [exec]    [junit4]
>>      [exec]    [junit4] Suite: org.apache.lucene.index.TestDocTermOrds
>>      [exec]    [junit4] Completed on J1 in 0.10s, 5 tests
>>      [exec]    [junit4]
>>      [exec]    [junit4] Suite: org.apache.lucene.index.TestCrash
>>      [exec]    [junit4] Completed on J1 in 0.86s, 5 tests
>>      [exec]    [junit4]
>>      [exec]    [junit4] Suite: org.apache.lucene.search.TestCachingCollector
>>      [exec]    [junit4] Completed on J1 in 0.06s, 5 tests
>>      [exec]    [junit4]
>>      [exec]    [junit4] Suite: org.apache.lucene.util.TestIntsRef
>>      [exec]    [junit4] Completed on J1 in 0.01s, 2 tests
>>      [exec]    [junit4]
>>      [exec]    [junit4] Suite: org.apache.lucene.util.TestByteBlockPool
>>      [exec]    [junit4] Completed on J1 in 0.02s, 1 test
>>      [exec]    [junit4]
>>      [exec]    [junit4] Suite: org.apache.lucene.search.TestSloppyPhraseQuery2
>>      [exec]    [junit4] Completed on J1 in 0.33s, 9 tests
>>      [exec]    [junit4]
>>      [exec]    [junit4] Suite: org.apache.lucene.search.TestPositionIncrement
>>      [exec]    [junit4] Completed on J1 in 0.03s, 2 tests
>>      [exec]    [junit4]
>>      [exec]    [junit4] Suite: org.apache.lucene.index.TestParallelCompositeReader
>>      [exec]    [junit4] Completed on J1 in 0.75s, 13 tests
>>      [exec]    [junit4]
>>      [exec]    [junit4] Suite: org.apache.lucene.index.TestNumericDocValuesUpdates
>>      [exec]    [junit4] Completed on J0 in 30.03s, 31 tests
>>      [exec]    [junit4]
>>      [exec]    [junit4] Suite: org.apache.lucene.util.junitcompat.TestFailIfUnreferencedFiles
>>      [exec]    [junit4] Completed on J0 in 0.03s, 1 test
>>      [exec]    [junit4]
>>      [exec]    [junit4] Suite: org.apache.lucene.index.TestCheckIndex
>>      [exec]    [junit4] Completed on J0 in 0.05s, 2 tests
>>      [exec]    [junit4]
>>      [exec]    [junit4] Suite: org.apache.lucene.util.TestBytesRefHash
>>      [exec]    [junit4] Completed on J0 in 0.72s, 8 tests
>>      [exec]    [junit4]
>>      [exec]    [junit4] Suite: org.apache.lucene.index.TestDocValuesWithThreads
>>      [exec]    [junit4] Completed on J0 in 0.07s, 2 tests
>>      [exec]    [junit4]
>>      [exec]    [junit4] Suite: org.apache.lucene.index.TestAtomicUpdate
>>      [exec]    [junit4] Completed on J3 in 4.78s, 1 test
>>      [exec]    [junit4]
>>      [exec]    [junit4] Suite: org.apache.lucene.util.TestUnicodeUtil
>>      [exec]    [junit4] Completed on J3 in 0.36s, 4 tests
>>      [exec]    [junit4]
>>      [exec]    [junit4] Suite: org.apache.lucene.index.Test2BTerms
>>      [exec]    [junit4] IGNOR/A 0.00s J3 | Test2BTerms.test2BTerms
>>      [exec]    [junit4]    > Assumption #1: 'monster' test group is disabled (@Monster(value=very slow, use 8g heap))
>>      [exec]    [junit4] Completed on J3 in 0.02s, 1 test, 1 skipped
>>      [exec]    [junit4]
>>      [exec]    [junit4] Suite: org.apache.lucene.util.junitcompat.TestLeaveFilesIfTestFails
>>      [exec]    [junit4] IGNOR/A 0.01s J3 | TestLeaveFilesIfTestFails.testWindowsUnremovableFile
>>      [exec]    [junit4]    > Assumption #1: Requires Windows.
>>      [exec]    [junit4] Completed on J3 in 0.04s, 2 tests, 1 skipped
>>      [exec]    [junit4]
>>      [exec]    [junit4] Suite: org.apache.lucene.search.TestPositiveScoresOnlyCollector
>>      [exec]    [junit4] Completed on J3 in 0.03s, 1 test
>>      [exec]    [junit4]
>>      [exec]    [junit4] Suite: org.apache.lucene.store.TestBufferedChecksum
>>      [exec]    [junit4] Completed on J3 in 0.04s, 2 tests
>>      [exec]    [junit4]
>>      [exec]    [junit4] Suite: org.apache.lucene.util.TestLongBitSet
>>      [exec]    [junit4] Completed on J3 in 1.53s, 7 tests
>>      [exec]    [junit4]
>>      [exec]    [junit4] Suite: org.apache.lucene.index.TestMultiLevelSkipList
>>      [exec]    [junit4] Completed on J3 in 0.58s, 1 test
>>      [exec]    [junit4]
>>      [exec]    [junit4] Suite: org.apache.lucene.index.TestParallelReaderEmptyIndex
>>      [exec]    [junit4] Completed on J3 in 0.05s, 2 tests
>>      [exec]    [junit4]
>>      [exec]    [junit4] Suite: org.apache.lucene.index.TestTwoPhaseCommitTool
>>      [exec]    [junit4] Completed on J3 in 0.04s, 3 tests
>>      [exec]    [junit4]
>>      [exec]    [junit4] Suite: org.apache.lucene.index.Test2BPostings
>>      [exec]    [junit4] IGNOR/A 0.00s J3 | Test2BPostings.test
>>      [exec]    [junit4]    > Assumption #1: 'nightly' test group is disabled (@Nightly())
>>      [exec]    [junit4] Completed on J3 in 0.01s, 1 test, 1 skipped
>>      [exec]    [junit4]
>>      [exec]    [junit4] Suite: org.apache.lucene.search.TestShardSearching
>>      [exec]    [junit4] Completed on J0 in 3.88s, 1 test
>>      [exec]    [junit4]
>>      [exec]    [junit4] Suite: org.apache.lucene.search.TestSearchAfter
>>      [exec]    [junit4] Completed on J1 in 6.80s, 1 test
>>      [exec]    [junit4]
>>      [exec]    [junit4] Suite: org.apache.lucene.index.TestByteSlices
>>      [exec]    [junit4] Completed on J3 in 2.05s, 1 test
>>      [exec]    [junit4]
>>      [exec]    [junit4] Suite: org.apache.lucene.index.TestBackwardsCompatibility
>>      [exec]    [junit4] Completed on J2 in 18.64s, 15 tests
>>      [exec]    [junit4]
>>      [exec]    [junit4] Suite: org.apache.lucene.search.TestComplexExplanations
>>      [exec]    [junit4] Completed on J0 in 1.74s, 22 tests
>>      [exec]    [junit4]
>>      [exec]    [junit4] Suite: org.apache.lucene.search.TestMatchAllDocsQuery
>>      [exec]    [junit4] Completed on J0 in 0.03s, 2 tests
>>      [exec]    [junit4]
>>      [exec]    [junit4] Suite: org.apache.lucene.util.junitcompat.TestSystemPropertiesInvariantRule
>>      [exec]    [junit4] Completed on J0 in 0.14s, 5 tests
>>      [exec]    [junit4]
>>      [exec]    [junit4] Suite: org.apache.lucene.index.TestSegmentReader
>>      [exec]    [junit4] Completed on J2 in 0.87s, 7 tests
>>      [exec]    [junit4]
>>      [exec]    [junit4] Suite: org.apache.lucene.codecs.lucene41.TestBlockPostingsFormat
>>      [exec]    [junit4] Completed on J3 in 1.89s, 12 tests
>>      [exec]    [junit4]
>>      [exec]    [junit4] Suite: org.apache.lucene.search.TestLiveFieldValues
>>      [exec]    [junit4] Completed on J3 in 1.30s, 1 test
>>      [exec]    [junit4]
>>      [exec]    [junit4] Suite: org.apache.lucene.search.spans.TestSpanFirstQuery
>>      [exec]    [junit4] Completed on J3 in 0.04s, 1 test
>>      [exec]    [junit4]
>>      [exec]    [junit4] Suite: org.apache.lucene.search.TestTopFieldCollector
>>      [exec]    [junit4] Completed on J3 in 0.10s, 8 tests
>>      [exec]    [junit4]
>>      [exec]    [junit4] Suite: org.apache.lucene.search.spans.TestFieldMaskingSpanQuery
>>      [exec]    [junit4] IGNOR/A 0.01s J3 | TestFieldMaskingSpanQuery.testSpans2
>>      [exec]    [junit4]    > Assumption #1: Broken scoring: LUCENE-3723
>>      [exec]    [junit4] IGNOR/A 0.01s J3 | TestFieldMaskingSpanQuery.testSimple2
>>      [exec]    [junit4]    > Assumption #1: Broken scoring: LUCENE-3723
>>      [exec]    [junit4] Completed on J3 in 0.73s, 11 tests, 2 skipped
>>      [exec]    [junit4]
>>      [exec]    [junit4] Suite: org.apache.lucene.search.TestNGramPhraseQuery
>>      [exec]    [junit4] Completed on J3 in 0.02s, 1 test
>>      [exec]    [junit4]
>>      [exec]    [junit4] Suite: org.apache.lucene.util.TestDoubleBarrelLRUCache
>>      [exec]    [junit4] Completed on J3 in 1.10s, 2 tests
>>      [exec]    [junit4]
>>      [exec]    [junit4] Suite: org.apache.lucene.index.TestBagOfPositions
>>      [exec]    [junit4] Completed on J3 in 3.08s, 1 test
>>      [exec]    [junit4]
>>      [exec]    [junit4] Suite: org.apache.lucene.index.TestDuelingCodecs
>>      [exec]    [junit4] Completed on J0 in 7.73s, 1 test
>>      [exec]    [junit4]
>>      [exec]    [junit4] Suite: org.apache.lucene.search.TestScoreCachingWrappingScorer
>>      [exec]    [junit4] Completed on J0 in 0.02s, 1 test
>>      [exec]    [junit4]
>>      [exec]    [junit4] Suite: org.apache.lucene.search.TestWildcard
>>      [exec]    [junit4] Completed on J3 in 0.23s, 8 tests
>>      [exec]    [junit4]
>>      [exec]    [junit4] Suite: org.apache.lucene.index.TestStressIndexing2
>>      [exec]    [junit4] Completed on J3 in 0.58s, 3 tests
>>      [exec]    [junit4]
>>      [exec]    [junit4] Suite: org.apache.lucene.index.TestDocValuesFormat
>>      [exec]    [junit4] IGNOR/A 0.01s J2 | TestDocValuesFormat.testHugeBinaryValueLimit
>>      [exec]    [junit4]    > Assumption #1: test requires codec with limits on max binary field length
>>      [exec]    [junit4] Completed on J2 in 8.02s, 79 tests, 1 skipped
>>      [exec]    [junit4]
>>      [exec]    [junit4] Suite: org.apache.lucene.index.TestDocValuesIndexing
>>      [exec]    [junit4] Completed on J3 in 0.60s, 30 tests
>>      [exec]    [junit4]
>>      [exec]    [junit4] Suite: org.apache.lucene.search.FuzzyTermOnShortTermsTest
>>      [exec]    [junit4] Completed on J3 in 0.27s, 1 test
>>      [exec]    [junit4]
>>      [exec]    [junit4] Suite: org.apache.lucene.store.TestSimpleFSDirectory
>>      [exec]    [junit4] Completed on J0 in 4.84s, 25 tests
>>      [exec]    [junit4]
>>      [exec]    [junit4] Suite: org.apache.lucene.index.Test2BDocs
>>      [exec]    [junit4] Completed on J0 in 0.64s, 2 tests
>>      [exec]    [junit4]
>>      [exec]    [junit4] Suite: org.apache.lucene.index.TestTermVectorsFormat
>>      [exec]    [junit4] IGNOR/A 0.01s J3 | TestTermVectorsFormat.testMergeStability
>>      [exec]    [junit4]    > Assumption #1: The MockRandom PF randomizes content on the fly, so we can't check it
>>      [exec]    [junit4] Completed on J3 in 4.23s, 8 tests, 1 skipped
>>      [exec]    [junit4]
>>      [exec]    [junit4] Suite: org.apache.lucene.search.TestQueryWrapperFilter
>>      [exec]    [junit4] Completed on J0 in 0.46s, 3 tests
>>      [exec]    [junit4]
>>      [exec]    [junit4] Suite: org.apache.lucene.index.TestIndexWriterForceMerge
>>      [exec]    [junit4] Completed on J0 in 2.34s, 4 tests
>>      [exec]    [junit4]
>>      [exec]    [junit4] Suite: org.apache.lucene.util.TestMathUtil
>>      [exec]    [junit4] Completed on J0 in 0.03s, 5 tests
>>      [exec]    [junit4]
>>      [exec]    [junit4] Suite: org.apache.lucene.search.TestFieldValueFilter
>>      [exec]    [junit4] Completed on J0 in 0.09s, 2 tests
>>      [exec]    [junit4]
>>      [exec]    [junit4] Suite: org.apache.lucene.search.TestFuzzyQuery
>>      [exec]    [junit4] Completed on J0 in 0.10s, 6 tests
>>      [exec]    [junit4]
>>      [exec]    [junit4] Suite: org.apache.lucene.search.TestNot
>>      [exec]    [junit4] Completed on J0 in 0.02s, 1 test
>>      [exec]    [junit4]
>>      [exec]    [junit4] Suite: org.apache.lucene.index.TestIndexWriterReader
>>      [exec]    [junit4] Completed on J2 in 8.23s, 22 tests
>>      [exec]    [junit4]
>>      [exec]    [junit4] Suite: org.apache.lucene.index.TestIndexWriter
>>      [exec]    [junit4] Completed on J1 in 18.16s, 63 tests
>>      [exec]    [junit4]
>>      [exec]    [junit4] Suite: org.apache.lucene.util.fst.TestBytesStore
>>      [exec]    [junit4] Completed on J1 in 2.80s, 1 test
>>      [exec]    [junit4]
>>      [exec]    [junit4] Suite: org.apache.lucene.util.fst.TestFSTs
>>      [exec]    [junit4] IGNOR/A 0.00s J2 | TestFSTs.testBigSet
>>      [exec]    [junit4]    > Assumption #1: 'nightly' test group is disabled (@Nightly())
>>      [exec]    [junit4] Completed on J2 in 7.91s, 19 tests, 1 skipped
>>      [exec]    [junit4]
>>      [exec]    [junit4] Suite: org.apache.lucene.codecs.compressing.TestCompressingTermVectorsFormat
>>      [exec]    [junit4] Completed on J3 in 14.71s, 45 tests
>>      [exec]    [junit4]
>>      [exec]    [junit4] Suite: org.apache.lucene.util.packed.TestPackedInts
>>      [exec]    [junit4] IGNOR/A 0.01s J1 | TestPackedInts.testBlockReaderOverflow
>>      [exec]    [junit4]    > Assumption #1: 'nightly' test group is disabled (@Nightly())
>>      [exec]    [junit4] Completed on J1 in 9.17s, 27 tests, 3 skipped
>>      [exec]    [junit4]
>>      [exec]    [junit4] Suite: org.apache.lucene.codecs.lucene42.TestLucene42DocValuesFormat
>>      [exec]    [junit4] IGNOR/A 0.01s J2 | TestLucene42DocValuesFormat.testTwoBytesOneMissingWithMerging
>>      [exec]    [junit4]    > Assumption #1: Codec does not support getDocsWithField
>>      [exec]    [junit4] IGNOR/A 0.01s J2 | TestLucene42DocValuesFormat.testShortMissingVsFieldCache
>>      [exec]    [junit4]    > Assumption #1: Codec does not support getDocsWithField
>>      [exec]    [junit4] IGNOR/A 0.01s J2 | TestLucene42DocValuesFormat.testThreeBytesOneMissingWithMerging
>>      [exec]    [junit4]    > Assumption #1: Codec does not support getDocsWithField
>>      [exec]    [junit4] IGNOR/A 0.01s J2 | TestLucene42DocValuesFormat.testByteMissingVsFieldCache
>>      [exec]    [junit4]    > Assumption #1: Codec does not support getDocsWithField
>>      [exec]    [junit4] IGNOR/A 0.01s J2 | TestLucene42DocValuesFormat.testThreeNumbersOneMissingWithMerging
>>      [exec]    [junit4]    > Assumption #1: Codec does not support getDocsWithField
>>      [exec]    [junit4] IGNOR/A 0.01s J2 | TestLucene42DocValuesFormat.testTwoBytesOneMissing
>>      [exec]    [junit4]    > Assumption #1: Codec does not support getDocsWithField
>>      [exec]    [junit4] IGNOR/A 0.01s J2 | TestLucene42DocValuesFormat.testThreads2
>>      [exec]    [junit4]    > Assumption #1: Codec does not support getDocsWithField
>>      [exec]    [junit4] IGNOR/A 0.01s J2 | TestLucene42DocValuesFormat.testTwoNumbersOneMissing
>>      [exec]    [junit4]    > Assumption #1: Codec does not support getDocsWithField
>>      [exec]    [junit4] IGNOR/A 0.00s J2 | TestLucene42DocValuesFormat.testIntMissingVsFieldCache
>>      [exec]    [junit4]    > Assumption #1: Codec does not support getDocsWithField
>>      [exec]    [junit4] IGNOR/A 0.01s J2 | TestLucene42DocValuesFormat.testLongMissingVsFieldCache
>>      [exec]    [junit4]    > Assumption #1: Codec does not support getDocsWithField
>>      [exec]    [junit4] IGNOR/A 0.01s J2 | TestLucene42DocValuesFormat.testTwoNumbersOneMissingWithMerging
>>      [exec]    [junit4]    > Assumption #1: Codec does not support getDocsWithField
>>      [exec]    [junit4] Completed on J2 in 6.15s, 82 tests, 11 skipped
>>      [exec]    [junit4]
>>      [exec]    [junit4] Suite: org.apache.lucene.search.TestNumericRangeQuery32
>>      [exec]    [junit4] Completed on J1 in 2.63s, 27 tests
>>      [exec]    [junit4]
>>      [exec]    [junit4] Suite: org.apache.lucene.index.TestIndexWriterWithThreads
>>      [exec]    [junit4] Completed on J3 in 5.50s, 12 tests
>>      [exec]    [junit4]
>>      [exec]    [junit4] Suite: org.apache.lucene.index.TestIndexWriterMerging
>>      [exec]    [junit4] Completed on J0 in 19.33s, 6 tests
>>      [exec]    [junit4]
>>      [exec]    [junit4] Suite: org.apache.lucene.analysis.TestGraphTokenizers
>>      [exec]    [junit4] Completed on J2 in 5.79s, 21 tests
>>      [exec]    [junit4]
>>      [exec]    [junit4] Suite: org.apache.lucene.index.TestAddIndexes
>>      [exec]    [junit4] Completed on J3 in 3.63s, 23 tests
>>      [exec]    [junit4]
>>      [exec]    [junit4] Suite: org.apache.lucene.analysis.TestLookaheadTokenFilter
>>      [exec]    [junit4] Completed on J1 in 5.29s, 3 tests
>>      [exec]    [junit4]
>>      [exec]    [junit4] Suite: org.apache.lucene.search.TestBooleanOr
>>      [exec]    [junit4] Completed on J1 in 0.93s, 6 tests
>>      [exec]    [junit4]
>>      [exec]    [junit4] Suite: org.apache.lucene.search.TestSearcherManager
>>      [exec]    [junit4] Completed on J2 in 1.92s, 8 tests
>>      [exec]    [junit4]
>>      [exec]    [junit4] Suite: org.apache.lucene.index.TestDeletionPolicy
>>      [exec]    [junit4] Completed on J3 in 4.11s, 6 tests
>>      [exec]    [junit4]
>>      [exec]    [junit4] Suite: org.apache.lucene.index.TestPersistentSnapshotDeletionPolicy
>>      [exec]    [junit4] Completed on J2 in 2.36s, 13 tests
>>      [exec]    [junit4]
>>      [exec]    [junit4] Suite: org.apache.lucene.index.TestStressAdvance
>>      [exec]    [junit4] Completed on J3 in 0.99s, 1 test
>>      [exec]    [junit4]
>>      [exec]    [junit4] Suite: org.apache.lucene.index.TestIndexWriterMergePolicy
>>      [exec]    [junit4] Completed on J1 in 4.52s, 7 tests
>>      [exec]    [junit4]
>>      [exec]    [junit4] Suite: org.apache.lucene.index.TestDirectoryReaderReopen
>>      [exec]    [junit4] Completed on J3 in 1.90s, 6 tests
>>      [exec]    [junit4]
>>      [exec]    [junit4] Suite: org.apache.lucene.index.TestIndexWriterCommit
>>      [exec]    [junit4] Completed on J2 in 3.16s, 12 tests
>>      [exec]    [junit4]
>>      [exec]    [junit4] Suite: org.apache.lucene.search.TestSearchWithThreads
>>      [exec]    [junit4] Completed on J3 in 1.59s, 1 test
>>      [exec]    [junit4]
>>      [exec]    [junit4] Suite: org.apache.lucene.search.TestTimeLimitingCollector
>>      [exec]    [junit4] Completed on J1 in 2.72s, 6 tests
>>      [exec]    [junit4]
>>      [exec]    [junit4] Suite: org.apache.lucene.store.TestMultiMMap
>>      [exec]    [junit4] Completed on J0 in 11.55s, 36 tests
>>      [exec]    [junit4]
>>      [exec]    [junit4] Suite: org.apache.lucene.index.TestNeverDelete
>>      [exec]    [junit4] Completed on J1 in 1.43s, 1 test
>>      [exec]    [junit4]
>>      [exec]    [junit4] Suite: org.apache.lucene.codecs.compressing.TestHighCompressionMode
>>      [exec]    [junit4] Completed on J3 in 1.53s, 7 tests
>>      [exec]    [junit4]
>>      [exec]    [junit4] Suite: org.apache.lucene.index.TestRollingUpdates
>>      [exec]    [junit4] Completed on J1 in 0.81s, 2 tests
>>      [exec]    [junit4]
>>      [exec]    [junit4] Suite: org.apache.lucene.codecs.lucene41.TestBlockPostingsFormat2
>>      [exec]    [junit4] Completed on J3 in 2.18s, 4 tests
>>      [exec]    [junit4]
>>      [exec]    [junit4] Suite: org.apache.lucene.search.TestDocTermOrdsRewriteMethod
>>      [exec]    [junit4] Completed on J1 in 1.60s, 2 tests
>>      [exec]    [junit4]
>>      [exec]    [junit4] Suite: org.apache.lucene.search.TestTopDocsMerge
>>      [exec]    [junit4] Completed on J0 in 3.76s, 2 tests
>>      [exec]    [junit4]
>>      [exec]    [junit4] Suite: org.apache.lucene.codecs.lucene40.TestLucene40PostingsReader
>>      [exec]    [junit4] Completed on J1 in 1.47s, 1 test
>>      [exec]    [junit4]
>>      [exec]    [junit4] Suite: org.apache.lucene.index.TestSnapshotDeletionPolicy
>>      [exec]    [junit4] Completed on J3 in 2.01s, 7 tests
>>      [exec]    [junit4]
>>      [exec]    [junit4] Suite: org.apache.lucene.store.TestBufferedIndexInput
>>      [exec]    [junit4] Completed on J1 in 0.34s, 4 tests
>>      [exec]    [junit4]
>>      [exec]    [junit4] Suite: org.apache.lucene.index.TestConcurrentMergeScheduler
>>      [exec]    [junit4] Completed on J2 in 7.66s, 6 tests
>>      [exec]    [junit4]
>>      [exec]    [junit4] Suite: org.apache.lucene.util.TestArrayUtil
>>      [exec]    [junit4] Completed on J0 in 1.78s, 11 tests
>>      [exec]    [junit4]
>>      [exec]    [junit4] Suite: org.apache.lucene.search.TestDocTermOrdsRangeFilter
>>      [exec]    [junit4] Completed on J1 in 0.42s, 1 test
>>      [exec]    [junit4]
>>      [exec]    [junit4] Suite: org.apache.lucene.store.TestLockFactory
>>      [exec]    [junit4] IGNOR/A 0.00s J0 | TestLockFactory.testStressLocksNativeFSLockFactory
>>      [exec]    [junit4]    > Assumption #1: 'nightly' test group is disabled (@Nightly())
>>      [exec]    [junit4] IGNOR/A 0.00s J0 | TestLockFactory.testStressLocks
>>      [exec]    [junit4]    > Assumption #1: 'nightly' test group is disabled (@Nightly())
>>      [exec]    [junit4] Completed on J0 in 1.09s, 11 tests, 2 skipped
>>      [exec]    [junit4]
>>      [exec]    [junit4] Suite: org.apache.lucene.index.TestTermsEnum
>>      [exec]    [junit4] Completed on J3 in 1.82s, 9 tests
>>      [exec]    [junit4]
>>      [exec]    [junit4] Suite: org.apache.lucene.search.TestRegexpRandom2
>>      [exec]    [junit4] Completed on J0 in 1.17s, 1 test
>>      [exec]    [junit4]
>>      [exec]    [junit4] Suite: org.apache.lucene.search.TestFieldCacheRewriteMethod
>>      [exec]    [junit4] Completed on J0 in 0.66s, 2 tests
>>      [exec]    [junit4]
>>      [exec]    [junit4] Suite: org.apache.lucene.util.TestCollectionUtil
>>      [exec]    [junit4] Completed on J1 in 3.50s, 4 tests
>>      [exec]    [junit4]
>>      [exec]    [junit4] Suite: org.apache.lucene.index.TestIndexWriterNRTIsCurrent
>>      [exec]    [junit4] Completed on J3 in 2.06s, 1 test
>>      [exec]    [junit4]
>>      [exec]    [junit4] Suite: org.apache.lucene.index.TestSegmentTermDocs
>>      [exec]    [junit4] Completed on J3 in 0.29s, 4 tests
>>      [exec]    [junit4]
>>      [exec]    [junit4] Suite: org.apache.lucene.index.TestTransactions
>>      [exec]    [junit4] Completed on J1 in 0.67s, 1 test
>>      [exec]    [junit4]
>>      [exec]    [junit4] Suite: org.apache.lucene.codecs.lucene40.TestReuseDocsEnum
>>      [exec]    [junit4] Completed on J3 in 0.37s, 3 tests
>>      [exec]    [junit4]
>>      [exec]    [junit4] Suite: org.apache.lucene.analysis.TestToken
>>      [exec]    [junit4] Completed on J1 in 0.88s, 10 tests
>>      [exec]    [junit4]
>>      [exec]    [junit4] Suite: org.apache.lucene.index.TestFieldsReader
>>      [exec]    [junit4] Completed on J3 in 0.59s, 2 tests
>>      [exec]    [junit4]
>>      [exec]    [junit4] Suite: org.apache.lucene.search.payloads.TestPayloadTermQuery
>>      [exec]    [junit4] Completed on J1 in 0.34s, 6 tests
>>      [exec]    [junit4]
>>      [exec]    [junit4] Suite: org.apache.lucene.search.TestBooleanMinShouldMatch
>>      [exec]    [junit4] Completed on J1 in 1.39s, 17 tests
>>      [exec]    [junit4]
>>      [exec]    [junit4] Suite: org.apache.lucene.codecs.compressing.TestCompressingStoredFieldsFormat
>>      [exec]    [junit4] IGNOR/A 0.00s J2 | TestCompressingStoredFieldsFormat.testBigDocuments {#0 seed=[2363A2D66176CD70:D249F889D25A6357]}
>>      [exec]    [junit4]    > Assumption #1: 'nightly' test group is disabled (@Nightly())
>>      [exec]    [junit4] IGNOR/A 0.00s J2 | TestCompressingStoredFieldsFormat.testBigDocuments {#1 seed=[2363A2D66176CD70:661F4475E698A87B]}
>>      [exec]    [junit4]    > Assumption #1: 'nightly' test group is disabled (@Nightly())
>>      [exec]    [junit4] IGNOR/A 0.01s J2 | TestCompressingStoredFieldsFormat.testBigDocuments {#2 seed=[2363A2D66176CD70:E8F6D2A9B75CE0B0]}
>>      [exec]    [junit4]    > Assumption #1: 'nightly' test group is disabled (@Nightly())
>>      [exec]    [junit4] IGNOR/A 0.00s J2 | TestCompressingStoredFieldsFormat.testBigDocuments {#3 seed=[2363A2D66176CD70:D918794CDBA2BB99]}
>>      [exec]    [junit4]    > Assumption #1: 'nightly' test group is disabled (@Nightly())
>>      [exec]    [junit4] IGNOR/A 0.00s J2 | TestCompressingStoredFieldsFormat.testBigDocuments {#4 seed=[2363A2D66176CD70:95D9FCE17AAA7B22]}
>>      [exec]    [junit4]    > Assumption #1: 'nightly' test group is disabled (@Nightly())
>>      [exec]    [junit4] Completed on J2 in 7.98s, 65 tests, 5 skipped
>>      [exec]    [junit4]
>>      [exec]    [junit4] Suite: org.apache.lucene.index.TestTermsEnum2
>>      [exec]    [junit4] Completed on J1 in 0.26s, 4 tests
>>      [exec]    [junit4]
>>      [exec]    [junit4] Suite: org.apache.lucene.util.TestNumericUtils
>>      [exec]    [junit4] Completed on J2 in 0.59s, 12 tests
>>      [exec]    [junit4]
>>      [exec]    [junit4] Suite: org.apache.lucene.util.automaton.TestDeterminizeLexicon
>>      [exec]    [junit4] Completed on J1 in 0.93s, 1 test
>>      [exec]    [junit4]
>>      [exec]    [junit4] Suite: org.apache.lucene.index.TestIndexWriterOnDiskFull
>>      [exec]    [junit4] Completed on J2 in 0.36s, 4 tests
>>      [exec]    [junit4]
>>      [exec]    [junit4] Suite: org.apache.lucene.search.spans.TestSpans
>>      [exec]    [junit4] Completed on J1 in 0.30s, 26 tests
>>      [exec]    [junit4]
>>      [exec]    [junit4] Suite: org.apache.lucene.index.TestCustomNorms
>>      [exec]    [junit4] Completed on J2 in 0.34s, 1 test
>>      [exec]    [junit4]
>>      [exec]    [junit4] Suite: org.apache.lucene.index.TestPostingsOffsets
>>      [exec]    [junit4] Completed on J1 in 0.49s, 11 tests
>>      [exec]    [junit4]
>>      [exec]    [junit4] Suite: org.apache.lucene.index.TestMixedCodecs
>>      [exec]    [junit4] Completed on J2 in 1.10s, 1 test
>>      [exec]    [junit4]
>>      [exec]    [junit4] Suite: org.apache.lucene.index.TestFlex
>>      [exec]    [junit4] Completed on J2 in 0.11s, 2 tests
>>      [exec]    [junit4]
>>      [exec]    [junit4] Suite: org.apache.lucene.util.TestPagedBytes
>>      [exec]    [junit4] Completed on J0 in 7.80s, 3 tests, 1 skipped
>>      [exec]    [junit4]
>>      [exec]    [junit4] Suite: org.apache.lucene.codecs.lucene40.TestLucene40PostingsFormat
>>      [exec]    [junit4] Completed on J1 in 1.27s, 12 tests
>>      [exec]    [junit4]
>>      [exec]    [junit4] Suite: org.apache.lucene.search.spans.TestSpanExplanations
>>      [exec]    [junit4] Completed on J0 in 0.71s, 31 tests
>>      [exec]    [junit4]
>>      [exec]    [junit4] Suite: org.apache.lucene.util.automaton.TestUTF32ToUTF8
>>      [exec]    [junit4] Completed on J2 in 0.77s, 5 tests
>>      [exec]    [junit4]
>>      [exec]    [junit4] Suite: org.apache.lucene.codecs.compressing.TestFastCompressionMode
>>      [exec]    [junit4] Completed on J1 in 0.40s, 11 tests
>>      [exec]    [junit4]
>>      [exec]    [junit4] Suite: org.apache.lucene.search.TestMultiPhraseQuery
>>      [exec]    [junit4] Completed on J1 in 0.11s, 17 tests, 1 skipped
>>      [exec]    [junit4]
>>      [exec]    [junit4] Suite: org.apache.lucene.store.TestRAMDirectory
>>      [exec]    [junit4] IGNOR/A 0.01s J2 | TestRAMDirectory.testFsyncDoesntCreateNewFiles
>>      [exec]    [junit4]    > Assumption #1: test only works for FSDirectory subclasses
>>      [exec]    [junit4] Completed on J2 in 0.61s, 28 tests, 1 skipped
>>      [exec]    [junit4]
>>      [exec]    [junit4] Suite: org.apache.lucene.util.automaton.TestDeterminism
>>      [exec]    [junit4] Completed on J1 in 0.40s, 2 tests
>>      [exec]    [junit4]
>>      [exec]    [junit4] Suite: org.apache.lucene.index.TestDocsAndPositions
>>      [exec]    [junit4] Completed on J2 in 0.23s, 6 tests
>>      [exec]    [junit4]
>>      [exec]    [junit4] Suite: org.apache.lucene.store.TestHugeRamFile
>>      [exec]    [junit4] Completed on J3 in 7.36s, 1 test
>>      [exec]    [junit4]
>>      [exec]    [junit4] Suite: org.apache.lucene.TestMergeSchedulerExternal
>>      [exec]    [junit4] Completed on J1 in 0.73s, 2 tests
>>      [exec]    [junit4]
>>      [exec]    [junit4] Suite: org.apache.lucene.search.TestFieldCacheRangeFilter
>>      [exec]    [junit4] Completed on J2 in 0.98s, 8 tests
>>      [exec]    [junit4]
>>      [exec]    [junit4] Suite: org.apache.lucene.index.TestOmitPositions
>>      [exec]    [junit4] Completed on J2 in 0.25s, 4 tests
>>      [exec]    [junit4]
>>      [exec]    [junit4] Suite: org.apache.lucene.analysis.tokenattributes.TestCharTermAttributeImpl
>>      [exec]    [junit4] Completed on J1 in 0.94s, 12 tests
>>      [exec]    [junit4]
>>      [exec]    [junit4] Suite: org.apache.lucene.util.TestMaxFailuresRule
>>      [exec]    [junit4] Completed on J0 in 2.76s, 2 tests
>>      [exec]    [junit4]
>>      [exec]    [junit4] Suite: org.apache.lucene.search.payloads.TestPayloadExplanations
>>      [exec]    [junit4] Completed on J2 in 0.30s, 5 tests
>>      [exec]    [junit4]
>>      [exec]    [junit4] Suite: org.apache.lucene.index.TestBagOfPostings
>>      [exec]    [junit4] Completed on J3 in 2.40s, 1 test
>>      [exec]    [junit4]
>>      [exec]    [junit4] Suite: org.apache.lucene.search.TestFilteredQuery
>>      [exec]    [junit4] Completed on J2 in 0.48s, 12 tests
>>      [exec]    [junit4]
>>      [exec]    [junit4] Suite: org.apache.lucene.index.TestIndexInput
>>      [exec]    [junit4] Completed on J0 in 0.78s, 3 tests
>>      [exec]    [junit4]
>>      [exec]    [junit4] Suite: org.apache.lucene.search.TestDisjunctionMaxQuery
>>      [exec]    [junit4] Completed on J3 in 0.37s, 11 tests
>>      [exec]    [junit4]
>>      [exec]    [junit4] Suite: org.apache.lucene.util.automaton.TestSpecialOperations
>>      [exec]    [junit4] Completed on J2 in 0.16s, 2 tests
>>      [exec]    [junit4]
>>      [exec]    [junit4] Suite: org.apache.lucene.index.TestForceMergeForever
>>      [exec]    [junit4] Completed on J0 in 0.39s, 1 test
>>      [exec]    [junit4]
>>      [exec]    [junit4] Suite: org.apache.lucene.search.TestTermRangeQuery
>>      [exec]    [junit4] Completed on J0 in 0.18s, 7 tests
>>      [exec]    [junit4]
>>      [exec]    [junit4] Suite: org.apache.lucene.index.TestMultiFields
>>      [exec]    [junit4] Completed on J2 in 0.73s, 3 tests
>>      [exec]    [junit4]
>>      [exec]    [junit4] Suite: org.apache.lucene.search.TestSameScoresWithThreads
>>      [exec]    [junit4] Completed on J3 in 0.80s, 1 test
>>      [exec]    [junit4]
>>      [exec]    [junit4] Suite: org.apache.lucene.search.payloads.TestPayloadNearQuery
>>      [exec]    [junit4] Completed on J0 in 0.41s, 7 tests
>>      [exec]    [junit4]
>>      [exec]    [junit4] Suite: org.apache.lucene.index.TestDocumentWriter
>>      [exec]    [junit4] Completed on J2 in 0.24s, 7 tests
>>      [exec]    [junit4]
>>      [exec]    [junit4] Suite: org.apache.lucene.index.TestDoc
>>      [exec]    [junit4] Completed on J2 in 0.47s, 1 test
>>      [exec]    [junit4]
>>      [exec]    [junit4] Suite: org.apache.lucene.index.TestStressNRT
>>      [exec]    [junit4] Completed on J1 in 3.09s, 1 test
>>      [exec]    [junit4]
>>      [exec]    [junit4] Suite: org.apache.lucene.search.TestMultiTermConstantScore
>>      [exec]    [junit4] Completed on J0 in 0.74s, 8 tests
>>      [exec]    [junit4]
>>      [exec]    [junit4] Suite: org.apache.lucene.search.similarities.TestSimilarity2
>>      [exec]    [junit4] Completed on J2 in 0.12s, 7 tests
>>      [exec]    [junit4]
>>      [exec]    [junit4] Suite: org.apache.lucene.TestExternalCodecs
>>      [exec]    [junit4] Completed on J1 in 0.20s, 1 test
>>      [exec]    [junit4]
>>      [exec]    [junit4] Suite: org.apache.lucene.search.TestRegexpQuery
>>      [exec]    [junit4] Completed on J2 in 0.09s, 7 tests
>>      [exec]    [junit4]
>>      [exec]    [junit4] Suite: org.apache.lucene.index.TestNoDeletionPolicy
>>      [exec]    [junit4] Completed on J0 in 0.28s, 4 tests
>>      [exec]    [junit4]
>>      [exec]    [junit4] Suite: org.apache.lucene.index.TestTermVectorsReader
>>      [exec]    [junit4] Completed on J1 in 0.07s, 6 tests
>>      [exec]    [junit4]
>>      [exec]    [junit4] Suite: org.apache.lucene.search.TestPrefixInBooleanQuery
>>      [exec]    [junit4] Completed on J2 in 0.21s, 4 tests
>>      [exec]    [junit4]
>>      [exec]    [junit4] Suite: org.apache.lucene.search.TestTopDocsCollector
>>      [exec]    [junit4] Completed on J0 in 0.11s, 8 tests
>>      [exec]    [junit4]
>>      [exec]    [junit4] Suite: org.apache.lucene.index.TestSegmentTermEnum
>>      [exec]    [junit4] Completed on J1 in 0.03s, 2 tests
>>      [exec]    [junit4]
>>      [exec]    [junit4] Suite: org.apache.lucene.index.TestUniqueTermCount
>>      [exec]    [junit4] Completed on J2 in 0.05s, 1 test
>>      [exec]    [junit4]
>>      [exec]    [junit4] Suite: org.apache.lucene.util.automaton.TestBasicOperations
>>      [exec]    [junit4] Completed on J1 in 0.21s, 8 tests
>>      [exec]    [junit4]
>>      [exec]    [junit4] Suite: org.apache.lucene.search.TestBooleanQuery
>>      [exec]    [junit4] Completed on J0 in 0.27s, 7 tests
>>      [exec]    [junit4]
>>      [exec]    [junit4] Suite: org.apache.lucene.index.TestPrefixCodedTerms
>>      [exec]    [junit4] Completed on J2 in 0.33s, 5 tests
>>      [exec]    [junit4]
>>      [exec]    [junit4] Suite: org.apache.lucene.search.TestScorerPerf
>>      [exec]    [junit4] Completed on J3 in 2.52s, 1 test
>>      [exec]    [junit4]
>>      [exec]    [junit4] Suite: org.apache.lucene.index.TestIndexableField
>>      [exec]    [junit4] Completed on J2 in 0.21s, 1 test
>>      [exec]    [junit4]
>>      [exec]    [junit4] Suite: org.apache.lucene.search.TestDocValuesScoring
>>      [exec]    [junit4] Completed on J3 in 0.05s, 1 test
>>      [exec]    [junit4]
>>      [exec]    [junit4] Suite: org.apache.lucene.store.TestWindowsMMap
>>      [exec]    [junit4] Completed on J2 in 0.21s, 1 test
>>      [exec]    [junit4]
>>      [exec]    [junit4] Suite: org.apache.lucene.search.TestAutomatonQuery
>>      [exec]    [junit4] Completed on J1 in 0.95s, 7 tests
>>      [exec]    [junit4]
>>      [exec]    [junit4] Suite: org.apache.lucene.search.TestWildcardRandom
>>      [exec]    [junit4] Completed on J3 in 0.06s, 1 test
>>      [exec]    [junit4]
>>      [exec]    [junit4] Suite: org.apache.lucene.search.TestPrefixRandom
>>      [exec]    [junit4] Completed on J2 in 0.14s, 1 test
>>      [exec]    [junit4]
>>      [exec]    [junit4] Suite: org.apache.lucene.search.TestRegexpRandom
>>      [exec]    [junit4] Completed on J3 in 0.17s, 1 test
>>      [exec]    [junit4]
>>      [exec]    [junit4] Suite: org.apache.lucene.search.spans.TestSpanMultiTermQueryWrapper
>>      [exec]    [junit4] Completed on J2 in 0.16s, 8 tests
>>      [exec]    [junit4]
>>      [exec]    [junit4] Suite: org.apache.lucene.store.TestDirectory
>>      [exec]    [junit4] IGNOR/A 0.01s J1 | TestDirectory.testThreadSafety
>>      [exec]    [junit4]    > Assumption #1: 'nightly' test group is disabled (@Nightly())
>>      [exec]    [junit4] IGNOR/A 0.01s J1 | TestDirectory.testFsyncDoesntCreateNewFiles
>>      [exec]    [junit4]    > Assumption #1: test only works for FSDirectory subclasses
>>      [exec]    [junit4] Completed on J1 in 0.46s, 28 tests, 2 skipped
>>      [exec]    [junit4]
>>      [exec]    [junit4] Suite: org.apache.lucene.search.TestBooleanQueryVisitSubscorers
>>      [exec]    [junit4] Completed on J3 in 0.04s, 3 tests
>>      [exec]    [junit4]
>>      [exec]    [junit4] Suite: org.apache.lucene.TestSearchForDuplicates
>>      [exec]    [junit4] Completed on J2 in 0.07s, 1 test
>>      [exec]    [junit4]
>>      [exec]    [junit4] Suite: org.apache.lucene.search.TestConstantScoreQuery
>>      [exec]    [junit4] Completed on J1 in 0.05s, 4 tests
>>      [exec]    [junit4]
>>      [exec]    [junit4] Suite: org.apache.lucene.search.TestPrefixQuery
>>      [exec]    [junit4] Completed on J3 in 0.03s, 1 test
>>      [exec]    [junit4]
>>      [exec]    [junit4] Suite: org.apache.lucene.search.TestElevationComparator
>>      [exec]    [junit4] Completed on J2 in 0.04s, 1 test
>>      [exec]    [junit4]
>>      [exec]    [junit4] Suite: org.apache.lucene.search.TestFilteredSearch
>>      [exec]    [junit4] Completed on J1 in 0.03s, 1 test
>>      [exec]    [junit4]
>>      [exec]    [junit4] Suite: org.apache.lucene.search.TestSubScorerFreqs
>>      [exec]    [junit4] Completed on J3 in 0.05s, 3 tests
>>      [exec]    [junit4]
>>      [exec]    [junit4] Suite: org.apache.lucene.search.TestConjunctions
>>      [exec]    [junit4] Completed on J2 in 0.08s, 1 test
>>      [exec]    [junit4]
>>      [exec]    [junit4] Suite: org.apache.lucene.search.TestMultiTermQueryRewrites
>>      [exec]    [junit4] Completed on J1 in 0.07s, 3 tests
>>      [exec]    [junit4]
>>      [exec]    [junit4] Suite: org.apache.lucene.util.junitcompat.TestSameRandomnessLocalePassedOrNot
>>      [exec]    [junit4] Completed on J3 in 0.05s, 1 test
>>      [exec]    [junit4]
>>      [exec]    [junit4] Suite: org.apache.lucene.document.TestField
>>      [exec]    [junit4] Completed on J2 in 0.07s, 18 tests
>>      [exec]    [junit4]
>>      [exec]    [junit4] Suite: org.apache.lucene.search.TestDateSort
>>      [exec]    [junit4] Completed on J1 in 0.06s, 1 test
>>      [exec]    [junit4]
>>      [exec]    [junit4] Suite: org.apache.lucene.search.TestSimilarity
>>      [exec]    [junit4] Completed on J3 in 0.04s, 1 test
>>      [exec]    [junit4]
>>      [exec]    [junit4] Suite: org.apache.lucene.util.TestRollingBuffer
>>      [exec]    [junit4] Completed on J2 in 0.16s, 1 test
>>      [exec]    [junit4]
>>      [exec]    [junit4] Suite: org.apache.lucene.search.TestSimilarityProvider
>>      [exec]    [junit4] Completed on J1 in 0.03s, 1 test
>>      [exec]    [junit4]
>>      [exec]    [junit4] Suite: org.apache.lucene.analysis.TestNumericTokenStream
>>      [exec]    [junit4] Completed on J3 in 0.03s, 4 tests
>>      [exec]    [junit4]
>>      [exec]    [junit4] Suite: org.apache.lucene.index.TestFilterAtomicReader
>>      [exec]    [junit4] Completed on J2 in 0.05s, 2 tests
>>      [exec]    [junit4]
>>      [exec]    [junit4] Suite: org.apache.lucene.analysis.TestCachingTokenFilter
>>      [exec]    [junit4] Completed on J1 in 0.12s, 1 test
>>      [exec]    [junit4]
>>      [exec]    [junit4] Suite: org.apache.lucene.util.junitcompat.TestSeedFromUncaught
>>      [exec]    [junit4] Completed on J3 in 0.08s, 1 test
>>      [exec]    [junit4]
>>      [exec]    [junit4] Suite: org.apache.lucene.search.spans.TestSpansAdvanced
>>      [exec]    [junit4] Completed on J2 in 0.08s, 1 test
>>      [exec]    [junit4]
>>      [exec]    [junit4] Suite: org.apache.lucene.index.TestDocCount
>>      [exec]    [junit4] Completed on J1 in 0.08s, 1 test
>>      [exec]    [junit4]
>>      [exec]    [junit4] Suite: org.apache.lucene.document.TestBinaryDocument
>>      [exec]    [junit4] Completed on J3 in 0.03s, 2 tests
>>      [exec]    [junit4]
>>      [exec]    [junit4] Suite: org.apache.lucene.search.TestAutomatonQueryUnicode
>>      [exec]    [junit4] Completed on J2 in 0.03s, 1 test
>>      [exec]    [junit4]
>>      [exec]    [junit4] Suite: org.apache.lucene.search.TestFieldCacheTermsFilter
>>      [exec]    [junit4] Completed on J1 in 0.04s, 1 test
>>      [exec]    [junit4]
>>      [exec]    [junit4] Suite: org.apache.lucene.search.TestTotalHitCountCollector
>>      [exec]    [junit4] Completed on J3 in 0.02s, 1 test
>>      [exec]    [junit4]
>>      [exec]    [junit4] Suite: org.apache.lucene.util.TestRecyclingByteBlockAllocator
>>      [exec]    [junit4] Completed on J2 in 0.15s, 3 tests
>>      [exec]    [junit4]
>>      [exec]    [junit4] Suite: org.apache.lucene.store.TestLock
>>      [exec]    [junit4] Completed on J1 in 0.03s, 1 test
>>      [exec]    [junit4]
>>      [exec]    [junit4] Suite: org.apache.lucene.store.TestMockDirectoryWrapper
>>      [exec]    [junit4] Completed on J3 in 0.02s, 3 tests
>>      [exec]    [junit4]
>>      [exec]    [junit4] Suite: org.apache.lucene.util.junitcompat.TestJUnitRuleOrder
>>      [exec]    [junit4] Completed on J2 in 0.03s, 1 test
>>      [exec]    [junit4]
>>      [exec]    [junit4] Suite: org.apache.lucene.index.TestIsCurrent
>>      [exec]    [junit4] Completed on J1 in 0.07s, 2 tests
>>      [exec]    [junit4]
>>      [exec]    [junit4] Suite: org.apache.lucene.util.TestNamedSPILoader
>>      [exec]    [junit4] Completed on J3 in 0.02s, 3 tests
>>      [exec]    [junit4]
>>      [exec]    [junit4] Suite: org.apache.lucene.index.TestIndexWriterLockRelease
>>      [exec]    [junit4] Completed on J2 in 0.03s, 1 test
>>      [exec]    [junit4]
>>      [exec]    [junit4] Suite: org.apache.lucene.search.TestPhrasePrefixQuery
>>      [exec]    [junit4] Completed on J1 in 0.02s, 1 test
>>      [exec]    [junit4]
>>      [exec]    [junit4] Suite: org.apache.lucene.util.TestBytesRef
>>      [exec]    [junit4] Completed on J3 in 0.02s, 5 tests
>>      [exec]    [junit4]
>>      [exec]    [junit4] Suite: org.apache.lucene.TestDemo
>>      [exec]    [junit4] Completed on J2 in 0.02s, 1 test
>>      [exec]    [junit4]
>>      [exec]    [junit4] Suite: org.apache.lucene.TestAssertions
>>      [exec]    [junit4] Completed on J1 in 0.03s, 1 test
>>      [exec]    [junit4]
>>      [exec]    [junit4] Suite: org.apache.lucene.search.TestExplanations
>>      [exec]    [junit4] Completed on J3 in 0.03s, 1 test
>>      [exec]    [junit4]
>>      [exec]    [junit4] Suite: org.apache.lucene.util.TestVersionComparator
>>      [exec]    [junit4] Completed on J2 in 0.01s, 1 test
>>      [exec]    [junit4]
>>      [exec]    [junit4] Suite: org.apache.lucene.index.TestIndexWriterOnJRECrash
>>      [exec]    [junit4] IGNOR/A 0.00s J1 | TestIndexWriterOnJRECrash.testNRTThreads
>>      [exec]    [junit4]    > Assumption #1: 'nightly' test group is disabled (@Nightly())
>>      [exec]    [junit4] Completed on J1 in 0.01s, 1 test, 1 skipped
>>      [exec]    [junit4]
>>      [exec]    [junit4] Suite: org.apache.lucene.search.TestPrefixFilter
>>      [exec]    [junit4] Completed on J3 in 0.02s, 1 test
>>      [exec]    [junit4]
>>      [exec]    [junit4] Suite: org.apache.lucene.util.TestVersion
>>      [exec]    [junit4] Completed on J2 in 0.02s, 4 tests
>>      [exec]    [junit4]
>>      [exec]    [junit4] Suite: org.apache.lucene.util.junitcompat.TestCodecReported
>>      [exec]    [junit4] Completed on J1 in 0.03s, 1 test
>>      [exec]    [junit4]
>>      [exec]    [junit4] Suite: org.apache.lucene.search.MultiCollectorTest
>>      [exec]    [junit4] Completed on J3 in 0.04s, 3 tests
>>      [exec]    [junit4]
>>      [exec]    [junit4] Suite: org.apache.lucene.search.TestDocBoost
>>      [exec]    [junit4] Completed on J2 in 0.02s, 1 test
>>      [exec]    [junit4]
>>      [exec]    [junit4] Suite: org.apache.lucene.util.junitcompat.TestFailIfDirectoryNotClosed
>>      [exec]    [junit4] Completed on J1 in 0.03s, 1 test
>>      [exec]    [junit4]
>>      [exec]    [junit4] Suite: org.apache.lucene.TestWorstCaseTestBehavior
>>      [exec]    [junit4] Completed on J3 in 0.01s, 6 tests, 6 skipped
>>      [exec]    [junit4]
>>      [exec]    [junit4] Suite: org.apache.lucene.analysis.tokenattributes.TestSimpleAttributeImpl
>>      [exec]    [junit4] Completed on J2 in 0.02s, 1 test
>>      [exec]    [junit4]
>>      [exec]    [junit4] Suite: org.apache.lucene.index.TestTermdocPerf
>>      [exec]    [junit4] Completed on J1 in 0.01s, 1 test
>>      [exec]    [junit4]
>>      [exec]    [junit4] Suite: org.apache.lucene.index.TestTerm
>>      [exec]    [junit4] Completed on J3 in 0.01s, 1 test
>>      [exec]    [junit4]
>>      [exec]    [junit4] Suite: org.apache.lucene.index.Test2BPostingsBytes
>>      [exec]    [junit4] IGNOR/A 0.00s J2 | Test2BPostingsBytes.test
>>      [exec]    [junit4]    > Assumption #1: 'monster' test group is disabled (@Monster(value=takes ~20GB-30GB of space and 10 minutes, and more heap space sometimes))
>>      [exec]    [junit4] Completed on J2 in 0.00s, 1 test, 1 skipped
>>      [exec]    [junit4]
>>      [exec]    [junit4] Suite: org.apache.lucene.index.TestNewestSegment
>>      [exec]    [junit4] Completed on J1 in 0.02s, 1 test
>>      [exec]    [junit4]
>>      [exec]    [junit4] Suite: org.apache.lucene.index.Test2BBinaryDocValues
>>      [exec]    [junit4] IGNOR/A 0.00s J3 | Test2BBinaryDocValues.testFixedBinary
>>      [exec]    [junit4]    > Assumption #1: 'monster' test group is disabled (@Monster(value=takes ~ 45 minutes))
>>      [exec]    [junit4] IGNOR/A 0.00s J3 | Test2BBinaryDocValues.testVariableBinary
>>      [exec]    [junit4]    > Assumption #1: 'monster' test group is disabled (@Monster(value=takes ~ 45 minutes))
>>      [exec]    [junit4] Completed on J3 in 0.01s, 2 tests, 2 skipped
>>      [exec]    [junit4]
>>      [exec]    [junit4] Suite: org.apache.lucene.index.Test2BSortedDocValues
>>      [exec]    [junit4] IGNOR/A 0.00s J2 | Test2BSortedDocValues.test2BOrds
>>      [exec]    [junit4]    > Assumption #1: 'monster' test group is disabled (@Monster(value=very slow))
>>      [exec]    [junit4] IGNOR/A 0.00s J2 | Test2BSortedDocValues.testFixedSorted
>>      [exec]    [junit4]    > Assumption #1: 'monster' test group is disabled (@Monster(value=very slow))
>>      [exec]    [junit4] Completed on J2 in 0.01s, 2 tests, 2 skipped
>>      [exec]    [junit4]
>>      [exec]    [junit4] Suite: org.apache.lucene.util.Test2BPagedBytes
>>      [exec]    [junit4] IGNOR/A 0.00s J1 | Test2BPagedBytes.test
>>      [exec]    [junit4]    > Assumption #1: 'monster' test group is disabled (@Monster(value=You must increase heap to > 2 G to run this))
>>      [exec]    [junit4] Completed on J1 in 0.01s, 1 test, 1 skipped
>>      [exec]    [junit4]
>>      [exec]    [junit4] Suite: org.apache.lucene.analysis.TestReusableStringReader
>>      [exec]    [junit4] Completed on J1 in 0.01s, 1 test
>>      [exec]    [junit4]
>>      [exec]    [junit4] Suite: org.apache.lucene.index.TestAllFilesHaveChecksumFooter
>>      [exec]    [junit4] Completed on J2 in 0.09s, 1 test
>>      [exec]    [junit4]
>>      [exec]    [junit4] Suite: org.apache.lucene.index.TestDocInverterPerFieldErrorInfo
>>      [exec]    [junit4] Completed on J1 in 0.03s, 2 tests
>>      [exec]    [junit4]
>>      [exec]    [junit4] Suite: org.apache.lucene.store.TestFileSwitchDirectory
>>      [exec]    [junit4] IGNOR/A 0.01s J0 | TestFileSwitchDirectory.testFsyncDoesntCreateNewFiles
>>      [exec]    [junit4]    > Assumption #1: test only works for FSDirectory subclasses
>>      [exec]    [junit4] Completed on J0 in 6.33s, 26 tests, 1 skipped
>>      [exec]    [junit4]
>>      [exec]    [junit4] Suite: org.apache.lucene.index.TestExceedMaxTermLength
>>      [exec]    [junit4] Completed on J2 in 0.02s, 1 test
>>      [exec]    [junit4]
>>      [exec]    [junit4] Suite: org.apache.lucene.index.TestLogMergePolicy
>>      [exec]    [junit4] Completed on J0 in 0.08s, 1 test
>>      [exec]    [junit4]
>>      [exec]    [junit4] Suite: org.apache.lucene.index.TestStoredFieldsFormat
>>      [exec]    [junit4] IGNOR/A 0.01s J0 | TestStoredFieldsFormat.testBigDocuments
>>      [exec]    [junit4]    > Assumption #1: 'nightly' test group is disabled (@Nightly())
>>      [exec]    [junit4] Completed on J0 in 2.04s, 12 tests, 1 skipped
>>      [exec]    [junit4]
>>      [exec]    [junit4] Suite: org.apache.lucene.search.TestIndexSearcher
>>      [exec]    [junit4] Completed on J0 in 0.23s, 2 tests
>>      [exec]    [junit4]
>>      [exec]    [junit4] Suite: org.apache.lucene.search.TestSortRescorer
>>      [exec]    [junit4] Completed on J0 in 0.26s, 2 tests
>>      [exec]    [junit4]
>>      [exec]    [junit4] Suite: org.apache.lucene.store.TestFilterDirectory
>>      [exec]    [junit4] Completed on J0 in 0.01s, 1 test
>>      [exec]    [junit4]
>>      [exec]    [junit4] Suite: org.apache.lucene.index.TestIndexWriterOutOfFileDescriptors
>>      [exec]    [junit4] Completed on J1 in 5.74s, 1 test
>>      [exec]    [junit4]
>>      [exec]    [junit4] Suite: org.apache.lucene.codecs.lucene45.TestLucene45DocValuesFormat
>>      [exec]    [junit4] IGNOR/A 0.01s J3 | TestLucene45DocValuesFormat.testHugeBinaryValueLimit
>>      [exec]    [junit4]    > Assumption #1: test requires codec with limits on max binary field length
>>      [exec]    [junit4] Completed on J3 in 7.68s, 82 tests, 1 skipped
>>      [exec]    [junit4]
>>      [exec]    [junit4] Suite: org.apache.lucene.store.TestRateLimitedDirectoryWrapper
>>      [exec]    [junit4] IGNOR/A 0.00s J3 | TestRateLimitedDirectoryWrapper.testThreadSafety
>>      [exec]    [junit4]    > Assumption #1: 'nightly' test group is disabled (@Nightly())
>>      [exec]    [junit4] IGNOR/A 0.01s J3 | TestRateLimitedDirectoryWrapper.testFsyncDoesntCreateNewFiles
>>      [exec]    [junit4]    > Assumption #1: test only works for FSDirectory subclasses
>>      [exec]    [junit4] Completed on J3 in 0.38s, 25 tests, 2 skipped
>>      [exec]    [junit4]
>>      [exec]    [junit4] Suite: org.apache.lucene.store.TestRateLimiter
>>      [exec]    [junit4] Completed on J3 in 1.21s, 1 test
>>      [exec]    [junit4]
>>      [exec]    [junit4] Suite: org.apache.lucene.util.TestConstants
>>      [exec]    [junit4] Completed on J3 in 0.02s, 2 tests
>>      [exec]    [junit4]
>>      [exec]    [junit4] Suite: org.apache.lucene.util.TestIntroSorter
>>      [exec]    [junit4] Completed on J3 in 0.21s, 9 tests
>>      [exec]    [junit4]
>>      [exec]    [junit4] Suite: org.apache.lucene.util.TestQueryBuilder
>>      [exec]    [junit4] Completed on J3 in 0.10s, 19 tests
>>      [exec]    [junit4]
>>      [exec]    [junit4] Suite: org.apache.lucene.util.TestSloppyMath
>>      [exec]    [junit4] Completed on J3 in 0.12s, 3 tests
>>      [exec]    [junit4]
>>      [exec]    [junit4] Suite: org.apache.lucene.util.TestWAH8DocIdSet
>>      [exec]    [junit4] Completed on J3 in 0.48s, 6 tests
>>      [exec]    [junit4]
>>      [exec]    [junit4] Suite: org.apache.lucene.util.junitcompat.TestReproduceMessageWithRepeated
>>      [exec]    [junit4] Completed on J3 in 0.04s, 1 test
>>      [exec]    [junit4]
>>      [exec]    [junit4] Suite: org.apache.lucene.util.packed.TestEliasFanoDocIdSet
>>      [exec]    [junit4] Completed on J3 in 0.25s, 4 tests
>>      [exec]    [junit4]
>>      [exec]    [junit4] Suite: org.apache.lucene.store.TestMmapDirectory
>>      [exec]    [junit4] Completed on J0 in 7.99s, 25 tests
>>      [exec]    [junit4]
>>      [exec]    [junit4] Suite: org.apache.lucene.store.TestNIOFSDirectory
>>      [exec]    [junit4] Completed on J1 in 6.23s, 25 tests
>>      [exec]    [junit4]
>>      [exec]    [junit4] Suite: org.apache.lucene.util.packed.TestEliasFanoSequence
>>      [exec]    [junit4] Completed on J3 in 3.46s, 24 tests
>>      [exec]    [junit4]
>>      [exec]    [junit4] Suite: org.apache.lucene.index.TestMixedDocValuesUpdates
>>      [exec]    [junit4] Completed on J2 in 30.17s, 4 tests
>>      [exec]    [junit4]
>>      [exec]    [junit4] JVM J0:     5.07 ..   181.08 =   176.00s
>>      [exec]    [junit4] JV
>>
>> [...truncated too long message...]
>>
>> Release-trunk/lucene/build/fakeReleaseTmp/unpack/lucene-5.0.0/ivy-settings.xml
>>      [exec]
>>      [exec] resolve:
>>      [exec]
>>      [exec] init:
>>      [exec]
>>      [exec] compile-lucene-core:
>>      [exec]
>>      [exec] compile-codecs:
>>      [exec]      [echo] Building codecs...
>>      [exec]
>>      [exec] ivy-availability-check:
>>      [exec]      [echo] Building codecs...
>>      [exec]
>>      [exec] ivy-fail:
>>      [exec]
>>      [exec] ivy-configure:
>>      [exec] [ivy:configure] :: loading settings :: file = /usr/home/hudson/hudson-slave/workspace/Lucene-Solr-SmokeRelease-trunk/lucene/build/fakeReleaseTmp/unpack/lucene-5.0.0/ivy-settings.xml
>>      [exec]
>>      [exec] resolve:
>>      [exec]
>>      [exec] common.init:
>>      [exec]
>>      [exec] compile-lucene-core:
>>      [exec]
>>      [exec] init:
>>      [exec]
>>      [exec] -clover.disable:
>>      [exec]
>>      [exec] -clover.load:
>>      [exec]
>>      [exec] -clover.classpath:
>>      [exec]
>>      [exec] -clover.setup:
>>      [exec]
>>      [exec] clover:
>>      [exec]
>>      [exec] compile-core:
>>      [exec]
>>      [exec] -clover.disable:
>>      [exec]
>>      [exec] -clover.load:
>>      [exec]
>>      [exec] -clover.classpath:
>>      [exec]
>>      [exec] -clover.setup:
>>      [exec]
>>      [exec] clover:
>>      [exec]
>>      [exec] common.compile-core:
>>      [exec]
>>      [exec] compile-core:
>>      [exec]
>>      [exec] common.compile-test:
>>      [exec]
>>      [exec] install-junit4-taskdef:
>>      [exec]
>>      [exec] validate:
>>      [exec]
>>      [exec] resolve-groovy:
>>      [exec]
>>      [exec] -init-totals:
>>      [exec]
>>      [exec] -test:
>>      [exec]     [mkdir] Created dir: /usr/home/hudson/hudson-slave/workspace/Lucene-Solr-SmokeRelease-trunk/lucene/build/fakeReleaseTmp/unpack/lucene-5.0.0/build/misc/test
>>      [exec]     [mkdir] Created dir: /usr/home/hudson/hudson-slave/workspace/Lucene-Solr-SmokeRelease-trunk/lucene/build/fakeReleaseTmp/unpack/lucene-5.0.0/build/misc/test/temp
>>      [exec]     [mkdir] Created dir: /usr/home/hudson/hudson-slave/workspace/Lucene-Solr-SmokeRelease-trunk/lucene/build/fakeReleaseTmp/unpack/.caches/test-stats/misc
>>      [exec]    [junit4] <JUnit4> says aloha! Master seed: 23B2828CD7A1C1BC
>>      [exec]    [junit4] Your default console's encoding may not display certain unicode glyphs: US-ASCII
>>      [exec]    [junit4] Executing 12 suites with 4 JVMs.
>>      [exec]    [junit4]
>>      [exec]    [junit4] Started J2 PID(38401@lucene.zones.apache.org).
>>      [exec]    [junit4] Started J1 PID(38402@lucene.zones.apache.org).
>>      [exec]    [junit4] Started J3 PID(38400@lucene.zones.apache.org).
>>      [exec]    [junit4] Started J0 PID(38403@lucene.zones.apache.org).
>>      [exec]    [junit4] Suite: org.apache.lucene.index.sorter.TestBlockJoinSorter
>>      [exec]    [junit4] Completed on J2 in 6.17s, 1 test
>>      [exec]    [junit4]
>>      [exec]    [junit4] Suite: org.apache.lucene.index.TestPKIndexSplitter
>>      [exec]    [junit4] Completed on J2 in 0.89s, 1 test
>>      [exec]    [junit4]
>>      [exec]    [junit4] Suite: org.apache.lucene.index.sorter.SortingAtomicReaderTest
>>      [exec]    [junit4] Completed on J1 in 6.87s, 9 tests
>>      [exec]    [junit4]
>>      [exec]    [junit4] Suite: org.apache.lucene.index.sorter.IndexSortingTest
>>      [exec]    [junit4] Completed on J3 in 7.55s, 8 tests
>>      [exec]    [junit4]
>>      [exec]    [junit4] Suite: org.apache.lucene.index.TestMultiPassIndexSplitter
>>      [exec]    [junit4] Completed on J3 in 0.53s, 2 tests
>>      [exec]    [junit4]
>>      [exec]    [junit4] Suite: org.apache.lucene.index.TestIndexSplitter
>>      [exec]    [junit4] Completed on J1 in 1.52s, 1 test
>>      [exec]    [junit4]
>>      [exec]    [junit4] Suite: org.apache.lucene.misc.SweetSpotSimilarityTest
>>      [exec]    [junit4] Completed on J1 in 0.14s, 3 tests
>>      [exec]    [junit4]
>>      [exec]    [junit4] Suite: org.apache.lucene.index.sorter.TestSortingMergePolicy
>>      [exec]    [junit4] Completed on J0 in 8.70s, 2 tests
>>      [exec]    [junit4]
>>      [exec]    [junit4] Suite: org.apache.lucene.misc.TestHighFreqTerms
>>      [exec]    [junit4] Completed on J3 in 0.53s, 9 tests
>>      [exec]    [junit4]
>>      [exec]    [junit4] Suite: org.apache.lucene.util.fst.TestFSTsMisc
>>      [exec]    [junit4] Completed on J2 in 2.66s, 3 tests
>>      [exec]    [junit4]
>>      [exec]    [junit4] Suite: org.apache.lucene.index.sorter.TestEarlyTermination
>>      [exec]    [junit4]   2> NOTE: reproduce with: ant test  -Dtestcase=TestEarlyTermination -Dtests.method=testEarlyTermination -Dtests.seed=23B2828CD7A1C1BC -Dtests.slow=true -Dtests.locale=en_AU -Dtests.timezone=Europe/Tirane -Dtests.file.encoding=UTF-8
>>      [exec]    [junit4] FAILURE 0.79s J1 | TestEarlyTermination.testEarlyTermination <<<
>>      [exec]    [junit4]    > Throwable #1: java.lang.AssertionError: expected:<16> but was:<33>
>>      [exec]    [junit4]    >    at __randomizedtesting.SeedInfo.seed([23B2828CD7A1C1BC:EC25C3D3EFCD51BF]:0)
>>      [exec]    [junit4]    >    at org.apache.lucene.index.sorter.TestEarlyTermination.assertTopDocsEquals(TestEarlyTermination.java:167)
>>      [exec]    [junit4]    >    at org.apache.lucene.index.sorter.TestEarlyTermination.testEarlyTermination(TestEarlyTermination.java:127)
>>      [exec]    [junit4]    >    at java.lang.Thread.run(Thread.java:724)
>>      [exec]    [junit4]   2> NOTE: test params are: codec=Lucene46: {s=Pulsing41(freqCutoff=16 minBlockSize=9 maxBlockSize=65)}, docValues:{ndv2=DocValuesFormat(name=Asserting), ndv1=DocValuesFormat(name=Disk)}, sim=DefaultSimilarity, locale=en_AU, timezone=Europe/Tirane
>>      [exec]    [junit4]   2> NOTE: FreeBSD 9.1-RELEASE-p3 amd64/Oracle Corporation 1.7.0_25 (64-bit)/cpus=16,threads=1,free=211910184,total=229965824
>>      [exec]    [junit4]   2> NOTE: All tests run in this JVM: [SortingAtomicReaderTest, TestIndexSplitter, SweetSpotSimilarityTest, TestEarlyTermination]
>>      [exec]    [junit4] Completed on J1 in 1.31s, 2 tests, 1 failure <<< FAILURES!
>>      [exec]    [junit4]
>>      [exec]    [junit4] Suite: org.apache.lucene.document.TestLazyDocument
>>      [exec]    [junit4] Completed on J0 in 1.95s, 1 test
>>      [exec]    [junit4]
>>      [exec]    [junit4]
>>      [exec]    [junit4] Tests with failures:
>>      [exec]    [junit4]   - org.apache.lucene.index.sorter.TestEarlyTermination.testEarlyTermination
>>      [exec]    [junit4]
>>      [exec]    [junit4]
>>      [exec]    [junit4] JVM J0:     4.32 ..    16.91 =    12.60s
>>      [exec]    [junit4] JVM J1:     4.32 ..    16.48 =    12.16s
>>      [exec]    [junit4] JVM J2:     4.08 ..    15.86 =    11.78s
>>      [exec]    [junit4] JVM J3:     4.32 ..    15.21 =    10.90s
>>      [exec]    [junit4] Execution time total: 16 seconds
>>      [exec]    [junit4] Tests summary: 12 suites, 42 tests, 1 failure
>>      [exec]
>>      [exec] BUILD FAILED
>>      [exec] /usr/home/hudson/hudson-slave/workspace/Lucene-Solr-SmokeRelease-trunk/lucene/build/fakeReleaseTmp/unpack/lucene-5.0.0/build.xml:539: The following error occurred while executing this line:
>>      [exec] /usr/home/hudson/hudson-slave/workspace/Lucene-Solr-SmokeRelease-trunk/lucene/build/fakeReleaseTmp/unpack/lucene-5.0.0/common-build.xml:2017: The following error occurred while executing this line:
>>      [exec] /usr/home/hudson/hudson-slave/workspace/Lucene-Solr-SmokeRelease-trunk/lucene/build/fakeReleaseTmp/unpack/lucene-5.0.0/module-build.xml:60: The following error occurred while executing this line:
>>      [exec] /usr/home/hudson/hudson-slave/workspace/Lucene-Solr-SmokeRelease-trunk/lucene/build/fakeReleaseTmp/unpack/lucene-5.0.0/common-build.xml:1296: The following error occurred while executing this line:
>>      [exec] /usr/home/hudson/hudson-slave/workspace/Lucene-Solr-SmokeRelease-trunk/lucene/build/fakeReleaseTmp/unpack/lucene-5.0.0/common-build.xml:920: There were test failures: 12 suites, 42 tests, 1 failure
>>      [exec]
>>      [exec] Total time: 12 minutes 13 seconds
>>      [exec]
>>      [exec]
>>      [exec] Traceback (most recent call last):
>>      [exec]   File "/usr/home/hudson/hudson-slave/workspace/Lucene-Solr-SmokeRelease-trunk/dev-tools/scripts/smokeTestRelease.py", line 1333, in <module>
>>      [exec]     main()
>>      [exec]   File "/usr/home/hudson/hudson-slave/workspace/Lucene-Solr-SmokeRelease-trunk/dev-tools/scripts/smokeTestRelease.py", line 1277, in main
>>      [exec]     smokeTest(baseURL, svnRevision, version, tmpDir, isSigned, testArgs)
>>      [exec]   File "/usr/home/hudson/hudson-slave/workspace/Lucene-Solr-SmokeRelease-trunk/dev-tools/scripts/smokeTestRelease.py", line 1315, in smokeTest
>>      [exec]     unpackAndVerify('lucene', tmpDir, 'lucene-%s-src.tgz' % version, svnRevision, version, testArgs, baseURL)
>>      [exec]   File "/usr/home/hudson/hudson-slave/workspace/Lucene-Solr-SmokeRelease-trunk/dev-tools/scripts/smokeTestRelease.py", line 627, in unpackAndVerify
>>      [exec]     verifyUnpacked(project, artifact, unpackPath, svnRevision, version, testArgs, tmpDir, baseURL)
>>      [exec]   File "/usr/home/hudson/hudson-slave/workspace/Lucene-Solr-SmokeRelease-trunk/dev-tools/scripts/smokeTestRelease.py", line 722, in verifyUnpacked
>>      [exec]     run('%s; ant clean test %s' % (javaExe('1.7'), testArgs), '%s/test.log' % unpackPath)
>>      [exec]   File "/usr/home/hudson/hudson-slave/workspace/Lucene-Solr-SmokeRelease-trunk/dev-tools/scripts/smokeTestRelease.py", line 552, in run
>>      [exec]     raise RuntimeError('command "%s" failed; see log file %s' % (command, logPath))
>>      [exec] RuntimeError: command "export JAVA_HOME="/home/hudson/tools/java/latest1.7" PATH="/home/hudson/tools/java/latest1.7/bin:$PATH" JAVACMD="/home/hudson/tools/java/latest1.7/bin/java"; ant clean test -Dtests.jettyConnector=Socket  -Dtests.disableHdfs=true" failed; see log file /usr/home/hudson/hudson-slave/workspace/Lucene-Solr-SmokeRelease-trunk/lucene/build/fakeReleaseTmp/unpack/lucene-5.0.0/test.log
>>
>> BUILD FAILED
>> /usr/home/hudson/hudson-slave/workspace/Lucene-Solr-SmokeRelease-trunk/build.xml:387: exec returned: 1
>>
>> Total time: 45 minutes 14 seconds
>> Build step 'Invoke Ant' marked build as failure
>> Email was triggered for: Failure
>> Sending email for trigger: Failure
>>
>>
>>
>>
>> ---------------------------------------------------------------------
>> To unsubscribe, e-mail: dev-unsubscribe@lucene.apache.org
>> For additional commands, e-mail: dev-help@lucene.apache.org
>
> ---------------------------------------------------------------------
> To unsubscribe, e-mail: dev-unsubscribe@lucene.apache.org
> For additional commands, e-mail: dev-help@lucene.apache.org
>

---------------------------------------------------------------------
To unsubscribe, e-mail: dev-unsubscribe@lucene.apache.org
For additional commands, e-mail: dev-help@lucene.apache.org


Mime
View raw message