lucene-dev mailing list archives

Site index · List index
Message view « Date » · « Thread »
Top « Date » · « Thread »
From Michael McCandless <luc...@mikemccandless.com>
Subject Re: [JENKINS] Lucene-trunk-Linux-Java7-64-test-only - Build # 81945 - Failure!
Date Wed, 09 Apr 2014 17:24:30 GMT
I'll dig.

Mike McCandless

http://blog.mikemccandless.com


On Wed, Apr 9, 2014 at 1:10 PM,  <builder@flonkings.com> wrote:
> Build: builds.flonkings.com/job/Lucene-trunk-Linux-Java7-64-test-only/81945/
>
> 1 tests failed.
> REGRESSION:  org.apache.lucene.index.TestIndexWriterMerging.testNoWaitClose
>
> Error Message:
> Index: 6643, Size: 6642
>
> Stack Trace:
> java.lang.IndexOutOfBoundsException: Index: 6643, Size: 6642
>         at __randomizedtesting.SeedInfo.seed([90F54518AC5CEE07:B704E4C97F4A3EF3]:0)
>         at java.util.ArrayList.rangeCheck(ArrayList.java:604)
>         at java.util.ArrayList.get(ArrayList.java:382)
>         at org.apache.lucene.store.RAMFile.getBuffer(RAMFile.java:61)
>         at org.apache.lucene.store.RAMOutputStream.switchCurrentBuffer(RAMOutputStream.java:148)
>         at org.apache.lucene.store.RAMOutputStream.writeBytes(RAMOutputStream.java:132)
>         at org.apache.lucene.store.MockIndexOutputWrapper.writeBytes(MockIndexOutputWrapper.java:131)
>         at org.apache.lucene.store.MockIndexOutputWrapper.writeByte(MockIndexOutputWrapper.java:117)
>         at org.apache.lucene.store.DataOutput.writeInt(DataOutput.java:70)
>         at org.apache.lucene.codecs.CodecUtil.writeFooter(CodecUtil.java:184)
>         at org.apache.lucene.store.CompoundFileWriter.close(CompoundFileWriter.java:144)
>         at org.apache.lucene.store.CompoundFileDirectory.close(CompoundFileDirectory.java:178)
>         at org.apache.lucene.util.IOUtils.closeWhileHandlingException(IOUtils.java:88)
>         at org.apache.lucene.index.IndexWriter.createCompoundFile(IndexWriter.java:4504)
>         at org.apache.lucene.index.IndexWriter.mergeMiddle(IndexWriter.java:4015)
>         at org.apache.lucene.index.IndexWriter.merge(IndexWriter.java:3568)
>         at org.apache.lucene.index.SerialMergeScheduler.merge(SerialMergeScheduler.java:40)
>         at org.apache.lucene.index.IndexWriter.maybeMerge(IndexWriter.java:1879)
>         at org.apache.lucene.index.IndexWriter.prepareCommitInternal(IndexWriter.java:2827)
>         at org.apache.lucene.index.IndexWriter.commitInternal(IndexWriter.java:2936)
>         at org.apache.lucene.index.IndexWriter.commit(IndexWriter.java:2903)
>         at org.apache.lucene.index.IndexWriter.shutdown(IndexWriter.java:882)
>         at org.apache.lucene.index.TestIndexWriterMerging.testNoWaitClose(TestIndexWriterMerging.java:440)
>         at sun.reflect.NativeMethodAccessorImpl.invoke0(Native Method)
>         at sun.reflect.NativeMethodAccessorImpl.invoke(NativeMethodAccessorImpl.java:57)
>         at sun.reflect.DelegatingMethodAccessorImpl.invoke(DelegatingMethodAccessorImpl.java:43)
>         at java.lang.reflect.Method.invoke(Method.java:606)
>         at com.carrotsearch.randomizedtesting.RandomizedRunner.invoke(RandomizedRunner.java:1618)
>         at com.carrotsearch.randomizedtesting.RandomizedRunner$6.evaluate(RandomizedRunner.java:827)
>         at com.carrotsearch.randomizedtesting.RandomizedRunner$7.evaluate(RandomizedRunner.java:863)
>         at com.carrotsearch.randomizedtesting.RandomizedRunner$8.evaluate(RandomizedRunner.java:877)
>         at org.apache.lucene.util.TestRuleSetupTeardownChained$1.evaluate(TestRuleSetupTeardownChained.java:50)
>         at org.apache.lucene.util.TestRuleFieldCacheSanity$1.evaluate(TestRuleFieldCacheSanity.java:51)
>         at org.apache.lucene.util.AbstractBeforeAfterRule$1.evaluate(AbstractBeforeAfterRule.java:46)
>         at com.carrotsearch.randomizedtesting.rules.SystemPropertiesInvariantRule$1.evaluate(SystemPropertiesInvariantRule.java:55)
>         at org.apache.lucene.util.TestRuleThreadAndTestName$1.evaluate(TestRuleThreadAndTestName.java:49)
>         at org.apache.lucene.util.TestRuleIgnoreAfterMaxFailures$1.evaluate(TestRuleIgnoreAfterMaxFailures.java:65)
>         at org.apache.lucene.util.TestRuleMarkFailure$1.evaluate(TestRuleMarkFailure.java:48)
>         at com.carrotsearch.randomizedtesting.rules.StatementAdapter.evaluate(StatementAdapter.java:36)
>         at com.carrotsearch.randomizedtesting.ThreadLeakControl$StatementRunner.run(ThreadLeakControl.java:360)
>         at com.carrotsearch.randomizedtesting.ThreadLeakControl.forkTimeoutingTask(ThreadLeakControl.java:793)
>         at com.carrotsearch.randomizedtesting.ThreadLeakControl$3.evaluate(ThreadLeakControl.java:453)
>         at com.carrotsearch.randomizedtesting.RandomizedRunner.runSingleTest(RandomizedRunner.java:836)
>         at com.carrotsearch.randomizedtesting.RandomizedRunner$3.evaluate(RandomizedRunner.java:738)
>         at com.carrotsearch.randomizedtesting.RandomizedRunner$4.evaluate(RandomizedRunner.java:772)
>         at com.carrotsearch.randomizedtesting.RandomizedRunner$5.evaluate(RandomizedRunner.java:783)
>         at org.apache.lucene.util.AbstractBeforeAfterRule$1.evaluate(AbstractBeforeAfterRule.java:46)
>         at org.apache.lucene.util.TestRuleStoreClassName$1.evaluate(TestRuleStoreClassName.java:42)
>         at com.carrotsearch.randomizedtesting.rules.SystemPropertiesInvariantRule$1.evaluate(SystemPropertiesInvariantRule.java:55)
>         at com.carrotsearch.randomizedtesting.rules.NoShadowingOrOverridesOnMethodsRule$1.evaluate(NoShadowingOrOverridesOnMethodsRule.java:39)
>         at com.carrotsearch.randomizedtesting.rules.NoShadowingOrOverridesOnMethodsRule$1.evaluate(NoShadowingOrOverridesOnMethodsRule.java:39)
>         at com.carrotsearch.randomizedtesting.rules.StatementAdapter.evaluate(StatementAdapter.java:36)
>         at com.carrotsearch.randomizedtesting.rules.StatementAdapter.evaluate(StatementAdapter.java:36)
>         at org.apache.lucene.util.TestRuleAssertionsRequired$1.evaluate(TestRuleAssertionsRequired.java:43)
>         at org.apache.lucene.util.TestRuleMarkFailure$1.evaluate(TestRuleMarkFailure.java:48)
>         at org.apache.lucene.util.TestRuleIgnoreAfterMaxFailures$1.evaluate(TestRuleIgnoreAfterMaxFailures.java:65)
>         at org.apache.lucene.util.TestRuleIgnoreTestSuites$1.evaluate(TestRuleIgnoreTestSuites.java:55)
>         at com.carrotsearch.randomizedtesting.rules.StatementAdapter.evaluate(StatementAdapter.java:36)
>         at com.carrotsearch.randomizedtesting.ThreadLeakControl$StatementRunner.run(ThreadLeakControl.java:360)
>         at java.lang.Thread.run(Thread.java:724)
>
>
>
>
> Build Log:
> [...truncated 1346 lines...]
>    [junit4] Suite: org.apache.lucene.index.TestIndexWriterMerging
>    [junit4]   1> java.lang.OutOfMemoryError: Java heap space
>    [junit4]   1>        at org.apache.lucene.store.RAMFile.newBuffer(RAMFile.java:75)
>    [junit4]   1>        at org.apache.lucene.store.RAMFile.addBuffer(RAMFile.java:48)
>    [junit4]   1>        at org.apache.lucene.store.RAMOutputStream.switchCurrentBuffer(RAMOutputStream.java:146)
>    [junit4]   1>        at org.apache.lucene.store.RAMOutputStream.writeBytes(RAMOutputStream.java:132)
>    [junit4]   1>        at org.apache.lucene.store.MockDirectoryWrapper$BufferedIndexOutputWrapper.flushBuffer(MockDirectoryWrapper.java:989)
>    [junit4]   1>        at org.apache.lucene.store.BufferedIndexOutput.flushBuffer(BufferedIndexOutput.java:117)
>    [junit4]   1>        at org.apache.lucene.store.BufferedIndexOutput.flush(BufferedIndexOutput.java:106)
>    [junit4]   1>        at org.apache.lucene.store.MockDirectoryWrapper$BufferedIndexOutputWrapper.flush(MockDirectoryWrapper.java:995)
>    [junit4]   1>        at org.apache.lucene.store.BufferedIndexOutput.writeBytes(BufferedIndexOutput.java:72)
>    [junit4]   1>        at org.apache.lucene.store.MockIndexOutputWrapper.writeBytes(MockIndexOutputWrapper.java:131)
>    [junit4]   1>        at org.apache.lucene.store.MockIndexOutputWrapper.writeByte(MockIndexOutputWrapper.java:117)
>    [junit4]   1>        at org.apache.lucene.codecs.lucene42.Lucene42NormsConsumer.addNumericField(Lucene42NormsConsumer.java:127)
>    [junit4]   1>        at org.apache.lucene.index.NumericDocValuesWriter.flush(NumericDocValuesWriter.java:91)
>    [junit4]   1>        at org.apache.lucene.index.NormsConsumerPerField.flush(NormsConsumerPerField.java:61)
>    [junit4]   1>        at org.apache.lucene.index.NormsConsumer.flush(NormsConsumer.java:56)
>    [junit4]   1>        at org.apache.lucene.index.DocInverter.flush(DocInverter.java:54)
>    [junit4]   1>        at org.apache.lucene.index.DocFieldProcessor.flush(DocFieldProcessor.java:81)
>    [junit4]   1>        at org.apache.lucene.index.DocumentsWriterPerThread.flush(DocumentsWriterPerThread.java:465)
>    [junit4]   1>        at org.apache.lucene.index.DocumentsWriter.doFlush(DocumentsWriter.java:524)
>    [junit4]   1>        at org.apache.lucene.index.DocumentsWriter.postUpdate(DocumentsWriter.java:390)
>    [junit4]   1>        at org.apache.lucene.index.DocumentsWriter.updateDocument(DocumentsWriter.java:488)
>    [junit4]   1>        at org.apache.lucene.index.IndexWriter.updateDocument(IndexWriter.java:1430)
>    [junit4]   1>        at org.apache.lucene.index.IndexWriter.addDocument(IndexWriter.java:1100)
>    [junit4]   1>        at org.apache.lucene.index.IndexWriter.addDocument(IndexWriter.java:1081)
>    [junit4]   1>        at org.apache.lucene.index.TestIndexWriterMerging$1.run(TestIndexWriterMerging.java:414)
>    [junit4]   2> NOTE: reproduce with: ant test  -Dtestcase=TestIndexWriterMerging
-Dtests.method=testNoWaitClose -Dtests.seed=90F54518AC5CEE07 -Dtests.slow=true -Dtests.locale=sv_SE
-Dtests.timezone=Pacific/Norfolk -Dtests.file.encoding=UTF-8
>    [junit4] ERROR    370s J7 | TestIndexWriterMerging.testNoWaitClose <<<
>    [junit4]    > Throwable #1: java.lang.IndexOutOfBoundsException: Index: 6643, Size:
6642
>    [junit4]    >        at __randomizedtesting.SeedInfo.seed([90F54518AC5CEE07:B704E4C97F4A3EF3]:0)
>    [junit4]    >        at java.util.ArrayList.rangeCheck(ArrayList.java:604)
>    [junit4]    >        at java.util.ArrayList.get(ArrayList.java:382)
>    [junit4]    >        at org.apache.lucene.store.RAMFile.getBuffer(RAMFile.java:61)
>    [junit4]    >        at org.apache.lucene.store.RAMOutputStream.switchCurrentBuffer(RAMOutputStream.java:148)
>    [junit4]    >        at org.apache.lucene.store.RAMOutputStream.writeBytes(RAMOutputStream.java:132)
>    [junit4]    >        at org.apache.lucene.store.MockIndexOutputWrapper.writeBytes(MockIndexOutputWrapper.java:131)
>    [junit4]    >        at org.apache.lucene.store.MockIndexOutputWrapper.writeByte(MockIndexOutputWrapper.java:117)
>    [junit4]    >        at org.apache.lucene.store.DataOutput.writeInt(DataOutput.java:70)
>    [junit4]    >        at org.apache.lucene.codecs.CodecUtil.writeFooter(CodecUtil.java:184)
>    [junit4]    >        at org.apache.lucene.store.CompoundFileWriter.close(CompoundFileWriter.java:144)
>    [junit4]    >        at org.apache.lucene.store.CompoundFileDirectory.close(CompoundFileDirectory.java:178)
>    [junit4]    >        at org.apache.lucene.util.IOUtils.closeWhileHandlingException(IOUtils.java:88)
>    [junit4]    >        at org.apache.lucene.index.IndexWriter.createCompoundFile(IndexWriter.java:4504)
>    [junit4]    >        at org.apache.lucene.index.IndexWriter.mergeMiddle(IndexWriter.java:4015)
>    [junit4]    >        at org.apache.lucene.index.IndexWriter.merge(IndexWriter.java:3568)
>    [junit4]    >        at org.apache.lucene.index.SerialMergeScheduler.merge(SerialMergeScheduler.java:40)
>    [junit4]    >        at org.apache.lucene.index.IndexWriter.maybeMerge(IndexWriter.java:1879)
>    [junit4]    >        at org.apache.lucene.index.IndexWriter.prepareCommitInternal(IndexWriter.java:2827)
>    [junit4]    >        at org.apache.lucene.index.IndexWriter.commitInternal(IndexWriter.java:2936)
>    [junit4]    >        at org.apache.lucene.index.IndexWriter.commit(IndexWriter.java:2903)
>    [junit4]    >        at org.apache.lucene.index.IndexWriter.shutdown(IndexWriter.java:882)
>    [junit4]    >        at org.apache.lucene.index.TestIndexWriterMerging.testNoWaitClose(TestIndexWriterMerging.java:440)
>    [junit4]    >        at java.lang.Thread.run(Thread.java:724)
>    [junit4]   2> NOTE: test params are: codec=Lucene46: {count=PostingsFormat(name=SimpleText),
termVector=PostingsFormat(name=SimpleText), tvtest=TestBloomFilteredLucene41Postings(BloomFilteringPostingsFormat(Lucene41(blocksize=128))),
id=PostingsFormat(name=SimpleText)}, docValues:{}, sim=DefaultSimilarity, locale=sv_SE, timezone=Pacific/Norfolk
>    [junit4]   2> NOTE: Linux 3.2.0-26-generic amd64/Oracle Corporation 1.7.0_25 (64-bit)/cpus=8,threads=1,free=295161888,total=344260608
>    [junit4]   2> NOTE: All tests run in this JVM: [TestEliasFanoSequence, TestIndexWriterMerging]
>    [junit4] Completed on J7 in 384.92s, 6 tests, 1 error <<< FAILURES!
>
> [...truncated 84 lines...]
> BUILD FAILED
> /var/lib/jenkins/workspace/Lucene-trunk-Linux-Java7-64-test-only/checkout/lucene/build.xml:49:
The following error occurred while executing this line:
> /var/lib/jenkins/workspace/Lucene-trunk-Linux-Java7-64-test-only/checkout/lucene/common-build.xml:1281:
The following error occurred while executing this line:
> /var/lib/jenkins/workspace/Lucene-trunk-Linux-Java7-64-test-only/checkout/lucene/common-build.xml:907:
There were test failures: 387 suites, 2839 tests, 1 error, 81 ignored (68 assumptions)
>
> Total time: 7 minutes 51 seconds
> Build step 'Invoke Ant' marked build as failure
> Archiving artifacts
> Recording test results
> Email was triggered for: Failure
> Sending email for trigger: Failure
>
>
>
>
> ---------------------------------------------------------------------
> To unsubscribe, e-mail: dev-unsubscribe@lucene.apache.org
> For additional commands, e-mail: dev-help@lucene.apache.org

---------------------------------------------------------------------
To unsubscribe, e-mail: dev-unsubscribe@lucene.apache.org
For additional commands, e-mail: dev-help@lucene.apache.org


Mime
View raw message