lucene-dev mailing list archives

Site index · List index
Message view « Date » · « Thread »
Top « Date » · « Thread »
From Michael McCandless <luc...@mikemccandless.com>
Subject Re: [JENKINS] Lucene-4x-Linux-Java7-64-test-only - Build # 18572 - Failure!
Date Sat, 12 Apr 2014 22:41:12 GMT
I'll fix; this is already fix in trunk (with LUCENE-4246) but that
issue was 5.0 only...

Mike McCandless

http://blog.mikemccandless.com


On Sat, Apr 12, 2014 at 6:24 PM,  <builder@flonkings.com> wrote:
> Build: builds.flonkings.com/job/Lucene-4x-Linux-Java7-64-test-only/18572/
>
> 1 tests failed.
> REGRESSION:  org.apache.lucene.index.TestIndexWriterWithThreads.testRollbackAndCommitWithThreads
>
> Error Message:
> Captured an uncaught exception in thread: Thread[id=385, name=Thread-309, state=RUNNABLE,
group=TGRP-TestIndexWriterWithThreads]
>
> Stack Trace:
> com.carrotsearch.randomizedtesting.UncaughtExceptionError: Captured an uncaught exception
in thread: Thread[id=385, name=Thread-309, state=RUNNABLE, group=TGRP-TestIndexWriterWithThreads]
> Caused by: java.lang.RuntimeException: java.lang.AssertionError
>         at __randomizedtesting.SeedInfo.seed([180365659FF27163]:0)
>         at org.apache.lucene.index.TestIndexWriterWithThreads$1.run(TestIndexWriterWithThreads.java:622)
> Caused by: java.lang.AssertionError
>         at org.apache.lucene.index.DocumentsWriterFlushQueue.forcePurge(DocumentsWriterFlushQueue.java:135)
>         at org.apache.lucene.index.DocumentsWriter.purgeBuffer(DocumentsWriter.java:196)
>         at org.apache.lucene.index.IndexWriter.purge(IndexWriter.java:4706)
>         at org.apache.lucene.index.DocumentsWriter$ForcedPurgeEvent.process(DocumentsWriter.java:713)
>         at org.apache.lucene.index.IndexWriter.processEvents(IndexWriter.java:4747)
>         at org.apache.lucene.index.IndexWriter.processEvents(IndexWriter.java:4739)
>         at org.apache.lucene.index.IndexWriter.rollbackInternal(IndexWriter.java:2151)
>         at org.apache.lucene.index.IndexWriter.rollback(IndexWriter.java:2086)
>         at org.apache.lucene.index.TestIndexWriterWithThreads$1.run(TestIndexWriterWithThreads.java:578)
>
>
>
>
> Build Log:
> [...truncated 693 lines...]
>    [junit4] Suite: org.apache.lucene.index.TestIndexWriterWithThreads
>    [junit4]   2> ??? 12, 2014 7:21:47 ? com.carrotsearch.randomizedtesting.RandomizedRunner$QueueUncaughtExceptionsHandler
uncaughtException
>    [junit4]   2> WARNING: Uncaught exception in thread: Thread[Thread-309,5,TGRP-TestIndexWriterWithThreads]
>    [junit4]   2> java.lang.RuntimeException: java.lang.AssertionError
>    [junit4]   2>        at __randomizedtesting.SeedInfo.seed([180365659FF27163]:0)
>    [junit4]   2>        at org.apache.lucene.index.TestIndexWriterWithThreads$1.run(TestIndexWriterWithThreads.java:622)
>    [junit4]   2> Caused by: java.lang.AssertionError
>    [junit4]   2>        at org.apache.lucene.index.DocumentsWriterFlushQueue.forcePurge(DocumentsWriterFlushQueue.java:135)
>    [junit4]   2>        at org.apache.lucene.index.DocumentsWriter.purgeBuffer(DocumentsWriter.java:196)
>    [junit4]   2>        at org.apache.lucene.index.IndexWriter.purge(IndexWriter.java:4706)
>    [junit4]   2>        at org.apache.lucene.index.DocumentsWriter$ForcedPurgeEvent.process(DocumentsWriter.java:713)
>    [junit4]   2>        at org.apache.lucene.index.IndexWriter.processEvents(IndexWriter.java:4747)
>    [junit4]   2>        at org.apache.lucene.index.IndexWriter.processEvents(IndexWriter.java:4739)
>    [junit4]   2>        at org.apache.lucene.index.IndexWriter.rollbackInternal(IndexWriter.java:2151)
>    [junit4]   2>        at org.apache.lucene.index.IndexWriter.rollback(IndexWriter.java:2086)
>    [junit4]   2>        at org.apache.lucene.index.TestIndexWriterWithThreads$1.run(TestIndexWriterWithThreads.java:578)
>    [junit4]   2>
>    [junit4]   2> NOTE: reproduce with: ant test  -Dtestcase=TestIndexWriterWithThreads
-Dtests.method=testRollbackAndCommitWithThreads -Dtests.seed=180365659FF27163 -Dtests.slow=true
-Dtests.locale=ar_BH -Dtests.timezone=AGT -Dtests.file.encoding=ISO-8859-1
>    [junit4] ERROR   0.63s J0 | TestIndexWriterWithThreads.testRollbackAndCommitWithThreads
<<<
>    [junit4]    > Throwable #1: java.lang.AssertionError
>    [junit4]    >        at org.apache.lucene.index.TestIndexWriterWithThreads.testRollbackAndCommitWithThreads(TestIndexWriterWithThreads.java:634)
>    [junit4]    >        at java.lang.Thread.run(Thread.java:724)Throwable #2: com.carrotsearch.randomizedtesting.UncaughtExceptionError:
Captured an uncaught exception in thread: Thread[id=385, name=Thread-309, state=RUNNABLE,
group=TGRP-TestIndexWriterWithThreads]
>    [junit4]    > Caused by: java.lang.RuntimeException: java.lang.AssertionError
>    [junit4]    >        at __randomizedtesting.SeedInfo.seed([180365659FF27163]:0)
>    [junit4]    >        at org.apache.lucene.index.TestIndexWriterWithThreads$1.run(TestIndexWriterWithThreads.java:622)
>    [junit4]    > Caused by: java.lang.AssertionError
>    [junit4]    >        at org.apache.lucene.index.DocumentsWriterFlushQueue.forcePurge(DocumentsWriterFlushQueue.java:135)
>    [junit4]    >        at org.apache.lucene.index.DocumentsWriter.purgeBuffer(DocumentsWriter.java:196)
>    [junit4]    >        at org.apache.lucene.index.IndexWriter.purge(IndexWriter.java:4706)
>    [junit4]    >        at org.apache.lucene.index.DocumentsWriter$ForcedPurgeEvent.process(DocumentsWriter.java:713)
>    [junit4]    >        at org.apache.lucene.index.IndexWriter.processEvents(IndexWriter.java:4747)
>    [junit4]    >        at org.apache.lucene.index.IndexWriter.processEvents(IndexWriter.java:4739)
>    [junit4]    >        at org.apache.lucene.index.IndexWriter.rollbackInternal(IndexWriter.java:2151)
>    [junit4]    >        at org.apache.lucene.index.IndexWriter.rollback(IndexWriter.java:2086)
>    [junit4]    >        at org.apache.lucene.index.TestIndexWriterWithThreads$1.run(TestIndexWriterWithThreads.java:578)
>    [junit4]   2> NOTE: test params are: codec=Lucene41, sim=DefaultSimilarity, locale=ar_BH,
timezone=AGT
>    [junit4]   2> NOTE: Linux 3.2.0-26-generic amd64/Oracle Corporation 1.7.0_25 (64-bit)/cpus=8,threads=1,free=66811784,total=201719808
>    [junit4]   2> NOTE: All tests run in this JVM: [TestConstantScoreQuery, TestIndexWriterOnJRECrash,
TestMultiTermConstantScore, TestWildcardRandom, TestSimilarityProvider, Test2BPostingsBytes,
TestStressIndexing, TestSearchWithThreads, TestSortDocValues, InBeforeClass, InAfterClass,
InTestMethod, NonStringProperties, TestDateSort, TestTermRangeQuery, TestSearcherManager,
TestPostingsFormat, Nested1, TestRegexpRandom2, TestForUtil, TestNRTReaderWithThreads, TestBufferedIndexInput,
TestLucene40PostingsFormat, TestNamedSPILoader, TestIntBlockPool, TestImpersonation, TestStressAdvance,
TestNumericDocValuesUpdates, TestIndexWriterWithThreads]
>    [junit4] Completed on J0 in 7.24s, 12 tests, 1 error <<< FAILURES!
>
> [...truncated 778 lines...]
> BUILD FAILED
> /var/lib/jenkins/workspace/Lucene-4x-Linux-Java7-64-test-only/checkout/lucene/build.xml:49:
The following error occurred while executing this line:
> /var/lib/jenkins/workspace/Lucene-4x-Linux-Java7-64-test-only/checkout/lucene/common-build.xml:1282:
The following error occurred while executing this line:
> /var/lib/jenkins/workspace/Lucene-4x-Linux-Java7-64-test-only/checkout/lucene/common-build.xml:908:
There were test failures: 395 suites, 2890 tests, 1 error, 92 ignored (79 assumptions)
>
> Total time: 5 minutes 43 seconds
> Build step 'Invoke Ant' marked build as failure
> Recording test results
> Email was triggered for: Failure
> Sending email for trigger: Failure
>
>
>
>
> ---------------------------------------------------------------------
> To unsubscribe, e-mail: dev-unsubscribe@lucene.apache.org
> For additional commands, e-mail: dev-help@lucene.apache.org

---------------------------------------------------------------------
To unsubscribe, e-mail: dev-unsubscribe@lucene.apache.org
For additional commands, e-mail: dev-help@lucene.apache.org


Mime
View raw message