lucene-dev mailing list archives

Site index · List index
Message view « Date » · « Thread »
Top « Date » · « Thread »
From Policeman Jenkins Server <jenk...@thetaphi.de>
Subject [JENKINS] Lucene-Solr-trunk-Linux (32bit/jdk1.8.0_05) - Build # 10287 - Failure!
Date Mon, 12 May 2014 14:54:02 GMT
Build: http://jenkins.thetaphi.de/job/Lucene-Solr-trunk-Linux/10287/
Java: 32bit/jdk1.8.0_05 -client -XX:+UseSerialGC

4 tests failed.
FAILED:  junit.framework.TestSuite.org.apache.solr.cloud.CollectionsAPIDistributedZkTest

Error Message:
ERROR: SolrZkClient opens=19 closes=18

Stack Trace:
java.lang.AssertionError: ERROR: SolrZkClient opens=19 closes=18
	at __randomizedtesting.SeedInfo.seed([38BD49695C88CB2C]:0)
	at org.junit.Assert.fail(Assert.java:93)
	at org.apache.solr.SolrTestCaseJ4.endTrackingZkClients(SolrTestCaseJ4.java:451)
	at org.apache.solr.SolrTestCaseJ4.afterClass(SolrTestCaseJ4.java:185)
	at sun.reflect.GeneratedMethodAccessor61.invoke(Unknown Source)
	at sun.reflect.DelegatingMethodAccessorImpl.invoke(DelegatingMethodAccessorImpl.java:43)
	at java.lang.reflect.Method.invoke(Method.java:483)
	at com.carrotsearch.randomizedtesting.RandomizedRunner.invoke(RandomizedRunner.java:1618)
	at com.carrotsearch.randomizedtesting.RandomizedRunner$5.evaluate(RandomizedRunner.java:790)
	at com.carrotsearch.randomizedtesting.rules.StatementAdapter.evaluate(StatementAdapter.java:36)
	at com.carrotsearch.randomizedtesting.rules.SystemPropertiesRestoreRule$1.evaluate(SystemPropertiesRestoreRule.java:53)
	at org.apache.lucene.util.AbstractBeforeAfterRule$1.evaluate(AbstractBeforeAfterRule.java:46)
	at org.apache.lucene.util.TestRuleStoreClassName$1.evaluate(TestRuleStoreClassName.java:42)
	at com.carrotsearch.randomizedtesting.rules.SystemPropertiesInvariantRule$1.evaluate(SystemPropertiesInvariantRule.java:55)
	at com.carrotsearch.randomizedtesting.rules.NoShadowingOrOverridesOnMethodsRule$1.evaluate(NoShadowingOrOverridesOnMethodsRule.java:39)
	at com.carrotsearch.randomizedtesting.rules.NoShadowingOrOverridesOnMethodsRule$1.evaluate(NoShadowingOrOverridesOnMethodsRule.java:39)
	at com.carrotsearch.randomizedtesting.rules.StatementAdapter.evaluate(StatementAdapter.java:36)
	at com.carrotsearch.randomizedtesting.rules.StatementAdapter.evaluate(StatementAdapter.java:36)
	at com.carrotsearch.randomizedtesting.rules.StatementAdapter.evaluate(StatementAdapter.java:36)
	at org.apache.lucene.util.TestRuleAssertionsRequired$1.evaluate(TestRuleAssertionsRequired.java:43)
	at org.apache.lucene.util.TestRuleMarkFailure$1.evaluate(TestRuleMarkFailure.java:48)
	at org.apache.lucene.util.TestRuleIgnoreAfterMaxFailures$1.evaluate(TestRuleIgnoreAfterMaxFailures.java:65)
	at org.apache.lucene.util.TestRuleIgnoreTestSuites$1.evaluate(TestRuleIgnoreTestSuites.java:55)
	at com.carrotsearch.randomizedtesting.rules.StatementAdapter.evaluate(StatementAdapter.java:36)
	at com.carrotsearch.randomizedtesting.ThreadLeakControl$StatementRunner.run(ThreadLeakControl.java:360)
	at java.lang.Thread.run(Thread.java:745)


FAILED:  junit.framework.TestSuite.org.apache.solr.cloud.CollectionsAPIDistributedZkTest

Error Message:
2 threads leaked from SUITE scope at org.apache.solr.cloud.CollectionsAPIDistributedZkTest:     1) Thread[id=3439, name=TEST-CollectionsAPIDistributedZkTest.testDistribSearch-seed#[38BD49695C88CB2C]-EventThread, state=WAITING, group=TGRP-CollectionsAPIDistributedZkTest]         at sun.misc.Unsafe.park(Native Method)         at java.util.concurrent.locks.LockSupport.park(LockSupport.java:175)         at java.util.concurrent.locks.AbstractQueuedSynchronizer$ConditionObject.await(AbstractQueuedSynchronizer.java:2039)         at java.util.concurrent.LinkedBlockingQueue.take(LinkedBlockingQueue.java:442)         at org.apache.zookeeper.ClientCnxn$EventThread.run(ClientCnxn.java:494)    2) Thread[id=3438, name=TEST-CollectionsAPIDistributedZkTest.testDistribSearch-seed#[38BD49695C88CB2C]-SendThread(127.0.0.1:55083), state=TIMED_WAITING, group=TGRP-CollectionsAPIDistributedZkTest]         at java.lang.Thread.sleep(Native Method)         at org.apache.zookeeper.ClientCnxnSocketNIO.cleanup(ClientCnxnSocketNIO.java:230)         at org.apache.zookeeper.ClientCnxn$SendThread.cleanup(ClientCnxn.java:1185)         at org.apache.zookeeper.ClientCnxn$SendThread.run(ClientCnxn.java:1110)

Stack Trace:
com.carrotsearch.randomizedtesting.ThreadLeakError: 2 threads leaked from SUITE scope at org.apache.solr.cloud.CollectionsAPIDistributedZkTest: 
   1) Thread[id=3439, name=TEST-CollectionsAPIDistributedZkTest.testDistribSearch-seed#[38BD49695C88CB2C]-EventThread, state=WAITING, group=TGRP-CollectionsAPIDistributedZkTest]
        at sun.misc.Unsafe.park(Native Method)
        at java.util.concurrent.locks.LockSupport.park(LockSupport.java:175)
        at java.util.concurrent.locks.AbstractQueuedSynchronizer$ConditionObject.await(AbstractQueuedSynchronizer.java:2039)
        at java.util.concurrent.LinkedBlockingQueue.take(LinkedBlockingQueue.java:442)
        at org.apache.zookeeper.ClientCnxn$EventThread.run(ClientCnxn.java:494)
   2) Thread[id=3438, name=TEST-CollectionsAPIDistributedZkTest.testDistribSearch-seed#[38BD49695C88CB2C]-SendThread(127.0.0.1:55083), state=TIMED_WAITING, group=TGRP-CollectionsAPIDistributedZkTest]
        at java.lang.Thread.sleep(Native Method)
        at org.apache.zookeeper.ClientCnxnSocketNIO.cleanup(ClientCnxnSocketNIO.java:230)
        at org.apache.zookeeper.ClientCnxn$SendThread.cleanup(ClientCnxn.java:1185)
        at org.apache.zookeeper.ClientCnxn$SendThread.run(ClientCnxn.java:1110)
	at __randomizedtesting.SeedInfo.seed([38BD49695C88CB2C]:0)


FAILED:  junit.framework.TestSuite.org.apache.solr.cloud.CollectionsAPIDistributedZkTest

Error Message:
There are still zombie threads that couldn't be terminated:    1) Thread[id=3438, name=TEST-CollectionsAPIDistributedZkTest.testDistribSearch-seed#[38BD49695C88CB2C]-SendThread(127.0.0.1:55083), state=TIMED_WAITING, group=TGRP-CollectionsAPIDistributedZkTest]         at java.lang.Thread.sleep(Native Method)         at org.apache.zookeeper.ClientCnxn$SendThread.run(ClientCnxn.java:994)

Stack Trace:
com.carrotsearch.randomizedtesting.ThreadLeakError: There are still zombie threads that couldn't be terminated:
   1) Thread[id=3438, name=TEST-CollectionsAPIDistributedZkTest.testDistribSearch-seed#[38BD49695C88CB2C]-SendThread(127.0.0.1:55083), state=TIMED_WAITING, group=TGRP-CollectionsAPIDistributedZkTest]
        at java.lang.Thread.sleep(Native Method)
        at org.apache.zookeeper.ClientCnxn$SendThread.run(ClientCnxn.java:994)
	at __randomizedtesting.SeedInfo.seed([38BD49695C88CB2C]:0)


REGRESSION:  org.apache.solr.cloud.CollectionsAPIDistributedZkTest.testDistribSearch

Error Message:
some core start times did not change on reload

Stack Trace:
java.lang.AssertionError: some core start times did not change on reload
	at __randomizedtesting.SeedInfo.seed([38BD49695C88CB2C:B95BC7712BD7AB10]:0)
	at org.junit.Assert.fail(Assert.java:93)
	at org.junit.Assert.assertTrue(Assert.java:43)
	at org.apache.solr.cloud.CollectionsAPIDistributedZkTest.testCollectionsAPI(CollectionsAPIDistributedZkTest.java:836)
	at org.apache.solr.cloud.CollectionsAPIDistributedZkTest.doTest(CollectionsAPIDistributedZkTest.java:203)
	at org.apache.solr.BaseDistributedSearchTestCase.testDistribSearch(BaseDistributedSearchTestCase.java:865)
	at sun.reflect.NativeMethodAccessorImpl.invoke0(Native Method)
	at sun.reflect.NativeMethodAccessorImpl.invoke(NativeMethodAccessorImpl.java:62)
	at sun.reflect.DelegatingMethodAccessorImpl.invoke(DelegatingMethodAccessorImpl.java:43)
	at java.lang.reflect.Method.invoke(Method.java:483)
	at com.carrotsearch.randomizedtesting.RandomizedRunner.invoke(RandomizedRunner.java:1618)
	at com.carrotsearch.randomizedtesting.RandomizedRunner$6.evaluate(RandomizedRunner.java:827)
	at com.carrotsearch.randomizedtesting.RandomizedRunner$7.evaluate(RandomizedRunner.java:863)
	at com.carrotsearch.randomizedtesting.RandomizedRunner$8.evaluate(RandomizedRunner.java:877)
	at com.carrotsearch.randomizedtesting.rules.SystemPropertiesRestoreRule$1.evaluate(SystemPropertiesRestoreRule.java:53)
	at org.apache.lucene.util.TestRuleSetupTeardownChained$1.evaluate(TestRuleSetupTeardownChained.java:50)
	at org.apache.lucene.util.TestRuleFieldCacheSanity$1.evaluate(TestRuleFieldCacheSanity.java:51)
	at org.apache.lucene.util.AbstractBeforeAfterRule$1.evaluate(AbstractBeforeAfterRule.java:46)
	at com.carrotsearch.randomizedtesting.rules.SystemPropertiesInvariantRule$1.evaluate(SystemPropertiesInvariantRule.java:55)
	at org.apache.lucene.util.TestRuleThreadAndTestName$1.evaluate(TestRuleThreadAndTestName.java:49)
	at org.apache.lucene.util.TestRuleIgnoreAfterMaxFailures$1.evaluate(TestRuleIgnoreAfterMaxFailures.java:65)
	at org.apache.lucene.util.TestRuleMarkFailure$1.evaluate(TestRuleMarkFailure.java:48)
	at com.carrotsearch.randomizedtesting.rules.StatementAdapter.evaluate(StatementAdapter.java:36)
	at com.carrotsearch.randomizedtesting.ThreadLeakControl$StatementRunner.run(ThreadLeakControl.java:360)
	at com.carrotsearch.randomizedtesting.ThreadLeakControl.forkTimeoutingTask(ThreadLeakControl.java:793)
	at com.carrotsearch.randomizedtesting.ThreadLeakControl$3.evaluate(ThreadLeakControl.java:453)
	at com.carrotsearch.randomizedtesting.RandomizedRunner.runSingleTest(RandomizedRunner.java:836)
	at com.carrotsearch.randomizedtesting.RandomizedRunner$3.evaluate(RandomizedRunner.java:738)
	at com.carrotsearch.randomizedtesting.RandomizedRunner$4.evaluate(RandomizedRunner.java:772)
	at com.carrotsearch.randomizedtesting.RandomizedRunner$5.evaluate(RandomizedRunner.java:783)
	at com.carrotsearch.randomizedtesting.rules.StatementAdapter.evaluate(StatementAdapter.java:36)
	at com.carrotsearch.randomizedtesting.rules.SystemPropertiesRestoreRule$1.evaluate(SystemPropertiesRestoreRule.java:53)
	at org.apache.lucene.util.AbstractBeforeAfterRule$1.evaluate(AbstractBeforeAfterRule.java:46)
	at org.apache.lucene.util.TestRuleStoreClassName$1.evaluate(TestRuleStoreClassName.java:42)
	at com.carrotsearch.randomizedtesting.rules.SystemPropertiesInvariantRule$1.evaluate(SystemPropertiesInvariantRule.java:55)
	at com.carrotsearch.randomizedtesting.rules.NoShadowingOrOverridesOnMethodsRule$1.evaluate(NoShadowingOrOverridesOnMethodsRule.java:39)
	at com.carrotsearch.randomizedtesting.rules.NoShadowingOrOverridesOnMethodsRule$1.evaluate(NoShadowingOrOverridesOnMethodsRule.java:39)
	at com.carrotsearch.randomizedtesting.rules.StatementAdapter.evaluate(StatementAdapter.java:36)
	at com.carrotsearch.randomizedtesting.rules.StatementAdapter.evaluate(StatementAdapter.java:36)
	at com.carrotsearch.randomizedtesting.rules.StatementAdapter.evaluate(StatementAdapter.java:36)
	at org.apache.lucene.util.TestRuleAssertionsRequired$1.evaluate(TestRuleAssertionsRequired.java:43)
	at org.apache.lucene.util.TestRuleMarkFailure$1.evaluate(TestRuleMarkFailure.java:48)
	at org.apache.lucene.util.TestRuleIgnoreAfterMaxFailures$1.evaluate(TestRuleIgnoreAfterMaxFailures.java:65)
	at org.apache.lucene.util.TestRuleIgnoreTestSuites$1.evaluate(TestRuleIgnoreTestSuites.java:55)
	at com.carrotsearch.randomizedtesting.rules.StatementAdapter.evaluate(StatementAdapter.java:36)
	at com.carrotsearch.randomizedtesting.ThreadLeakControl$StatementRunner.run(ThreadLeakControl.java:360)
	at java.lang.Thread.run(Thread.java:745)




Build Log:
[...truncated 11214 lines...]
   [junit4] Suite: org.apache.solr.cloud.CollectionsAPIDistributedZkTest
   [junit4]   2> Creating dataDir: /mnt/ssd/jenkins/workspace/Lucene-Solr-trunk-Linux/solr/build/solr-core/test/J1/./solr.cloud.CollectionsAPIDistributedZkTest-38BD49695C88CB2C-001/init-core-data-001
   [junit4]   2> 698852 T3291 oas.SolrTestCaseJ4.buildSSLConfig Randomized ssl (true) and clientAuth (false)
   [junit4]   2> 698853 T3291 oas.BaseDistributedSearchTestCase.initHostContext Setting hostContext system property: /dv/cp
   [junit4]   2> 698856 T3291 oas.SolrTestCaseJ4.setUp ###Starting testDistribSearch
   [junit4]   2> 698857 T3291 oasc.ZkTestServer.run STARTING ZK TEST SERVER
   [junit4]   1> client port:0.0.0.0/0.0.0.0:0
   [junit4]   2> 698857 T3292 oasc.ZkTestServer$ZKServerMain.runFromConfig Starting server
   [junit4]   2> 698957 T3291 oasc.ZkTestServer.run start zk server on port:55083
   [junit4]   2> 698959 T3291 oascc.ConnectionManager.waitForConnected Waiting for client to connect to ZooKeeper
   [junit4]   2> 699079 T3298 oascc.ConnectionManager.process Watcher org.apache.solr.common.cloud.ConnectionManager@1a32966 name:ZooKeeperConnection Watcher:127.0.0.1:55083 got event WatchedEvent state:SyncConnected type:None path:null path:null type:None
   [junit4]   2> 699080 T3291 oascc.ConnectionManager.waitForConnected Client is connected to ZooKeeper
   [junit4]   2> 699080 T3291 oascc.SolrZkClient.makePath makePath: /solr
   [junit4]   2> 699087 T3291 oascc.ConnectionManager.waitForConnected Waiting for client to connect to ZooKeeper
   [junit4]   2> 699089 T3300 oascc.ConnectionManager.process Watcher org.apache.solr.common.cloud.ConnectionManager@88d3e2 name:ZooKeeperConnection Watcher:127.0.0.1:55083/solr got event WatchedEvent state:SyncConnected type:None path:null path:null type:None
   [junit4]   2> 699089 T3291 oascc.ConnectionManager.waitForConnected Client is connected to ZooKeeper
   [junit4]   2> 699090 T3291 oascc.SolrZkClient.makePath makePath: /collections/collection1
   [junit4]   2> 699095 T3291 oascc.SolrZkClient.makePath makePath: /collections/collection1/shards
   [junit4]   2> 699100 T3291 oascc.SolrZkClient.makePath makePath: /collections/control_collection
   [junit4]   2> 699103 T3291 oascc.SolrZkClient.makePath makePath: /collections/control_collection/shards
   [junit4]   2> 699106 T3291 oasc.AbstractZkTestCase.putConfig put /mnt/ssd/jenkins/workspace/Lucene-Solr-trunk-Linux/solr/core/src/test-files/solr/collection1/conf/solrconfig-tlog.xml to /configs/conf1/solrconfig.xml
   [junit4]   2> 699107 T3291 oascc.SolrZkClient.makePath makePath: /configs/conf1/solrconfig.xml
   [junit4]   2> 699114 T3291 oasc.AbstractZkTestCase.putConfig put /mnt/ssd/jenkins/workspace/Lucene-Solr-trunk-Linux/solr/core/src/test-files/solr/collection1/conf/schema.xml to /configs/conf1/schema.xml
   [junit4]   2> 699115 T3291 oascc.SolrZkClient.makePath makePath: /configs/conf1/schema.xml
   [junit4]   2> 699120 T3291 oasc.AbstractZkTestCase.putConfig put /mnt/ssd/jenkins/workspace/Lucene-Solr-trunk-Linux/solr/core/src/test-files/solr/collection1/conf/solrconfig.snippet.randomindexconfig.xml to /configs/conf1/solrconfig.snippet.randomindexconfig.xml
   [junit4]   2> 699121 T3291 oascc.SolrZkClient.makePath makePath: /configs/conf1/solrconfig.snippet.randomindexconfig.xml
   [junit4]   2> 699125 T3291 oasc.AbstractZkTestCase.putConfig put /mnt/ssd/jenkins/workspace/Lucene-Solr-trunk-Linux/solr/core/src/test-files/solr/collection1/conf/stopwords.txt to /configs/conf1/stopwords.txt
   [junit4]   2> 699125 T3291 oascc.SolrZkClient.makePath makePath: /configs/conf1/stopwords.txt
   [junit4]   2> 699130 T3291 oasc.AbstractZkTestCase.putConfig put /mnt/ssd/jenkins/workspace/Lucene-Solr-trunk-Linux/solr/core/src/test-files/solr/collection1/conf/protwords.txt to /configs/conf1/protwords.txt
   [junit4]   2> 699131 T3291 oascc.SolrZkClient.makePath makePath: /configs/conf1/protwords.txt
   [junit4]   2> 699135 T3291 oasc.AbstractZkTestCase.putConfig put /mnt/ssd/jenkins/workspace/Lucene-Solr-trunk-Linux/solr/core/src/test-files/solr/collection1/conf/currency.xml to /configs/conf1/currency.xml
   [junit4]   2> 699136 T3291 oascc.SolrZkClient.makePath makePath: /configs/conf1/currency.xml
   [junit4]   2> 699140 T3291 oasc.AbstractZkTestCase.putConfig put /mnt/ssd/jenkins/workspace/Lucene-Solr-trunk-Linux/solr/core/src/test-files/solr/collection1/conf/enumsConfig.xml to /configs/conf1/enumsConfig.xml
   [junit4]   2> 699141 T3291 oascc.SolrZkClient.makePath makePath: /configs/conf1/enumsConfig.xml
   [junit4]   2> 699145 T3291 oasc.AbstractZkTestCase.putConfig put /mnt/ssd/jenkins/workspace/Lucene-Solr-trunk-Linux/solr/core/src/test-files/solr/collection1/conf/open-exchange-rates.json to /configs/conf1/open-exchange-rates.json
   [junit4]   2> 699146 T3291 oascc.SolrZkClient.makePath makePath: /configs/conf1/open-exchange-rates.json
   [junit4]   2> 699150 T3291 oasc.AbstractZkTestCase.putConfig put /mnt/ssd/jenkins/workspace/Lucene-Solr-trunk-Linux/solr/core/src/test-files/solr/collection1/conf/mapping-ISOLatin1Accent.txt to /configs/conf1/mapping-ISOLatin1Accent.txt
   [junit4]   2> 699151 T3291 oascc.SolrZkClient.makePath makePath: /configs/conf1/mapping-ISOLatin1Accent.txt
   [junit4]   2> 699156 T3291 oasc.AbstractZkTestCase.putConfig put /mnt/ssd/jenkins/workspace/Lucene-Solr-trunk-Linux/solr/core/src/test-files/solr/collection1/conf/old_synonyms.txt to /configs/conf1/old_synonyms.txt
   [junit4]   2> 699156 T3291 oascc.SolrZkClient.makePath makePath: /configs/conf1/old_synonyms.txt
   [junit4]   2> 699162 T3291 oasc.AbstractZkTestCase.putConfig put /mnt/ssd/jenkins/workspace/Lucene-Solr-trunk-Linux/solr/core/src/test-files/solr/collection1/conf/synonyms.txt to /configs/conf1/synonyms.txt
   [junit4]   2> 699162 T3291 oascc.SolrZkClient.makePath makePath: /configs/conf1/synonyms.txt
   [junit4]   2> 699167 T3291 oascc.ConnectionManager.waitForConnected Waiting for client to connect to ZooKeeper
   [junit4]   2> 699169 T3302 oascc.ConnectionManager.process Watcher org.apache.solr.common.cloud.ConnectionManager@1e27f30 name:ZooKeeperConnection Watcher:127.0.0.1:55083/solr got event WatchedEvent state:SyncConnected type:None path:null path:null type:None
   [junit4]   2> 699169 T3291 oascc.ConnectionManager.waitForConnected Client is connected to ZooKeeper
   [junit4]   2> Using new style solr.xml
   [junit4]   2> 699439 T3291 oejs.Server.doStart jetty-8.1.10.v20130312
   [junit4]   2> 699444 T3291 oejus.SslContextFactory.doStart Enabled Protocols [SSLv2Hello, SSLv3, TLSv1, TLSv1.1, TLSv1.2] of [SSLv2Hello, SSLv3, TLSv1, TLSv1.1, TLSv1.2]
   [junit4]   2> 699446 T3291 oejs.AbstractConnector.doStart Started SslSelectChannelConnector@127.0.0.1:53072
   [junit4]   2> 699448 T3291 oass.SolrDispatchFilter.init SolrDispatchFilter.init()
   [junit4]   2> 699449 T3291 oasc.SolrResourceLoader.locateSolrHome JNDI not configured for solr (NoInitialContextEx)
   [junit4]   2> 699450 T3291 oasc.SolrResourceLoader.locateSolrHome using system property solr.solr.home: ./solr.cloud.CollectionsAPIDistributedZkTest-38BD49695C88CB2C-001/tempDir-002
   [junit4]   2> 699451 T3291 oasc.SolrResourceLoader.<init> new SolrResourceLoader for directory: './solr.cloud.CollectionsAPIDistributedZkTest-38BD49695C88CB2C-001/tempDir-002/'
   [junit4]   2> 699476 T3291 oasc.ConfigSolr.fromFile Loading container configuration from /mnt/ssd/jenkins/workspace/Lucene-Solr-trunk-Linux/solr/build/solr-core/test/J1/./solr.cloud.CollectionsAPIDistributedZkTest-38BD49695C88CB2C-001/tempDir-002/solr.xml
   [junit4]   2> 699492 T3291 oasc.CorePropertiesLocator.<init> Config-defined core root directory: /mnt/ssd/jenkins/workspace/Lucene-Solr-trunk-Linux/solr/build/solr-core/test/J1/./solr.cloud.CollectionsAPIDistributedZkTest-38BD49695C88CB2C-001/tempDir-002
   [junit4]   2> 699493 T3291 oasc.CoreContainer.<init> New CoreContainer 31878495
   [junit4]   2> 699493 T3291 oasc.CoreContainer.load Loading cores into CoreContainer [instanceDir=./solr.cloud.CollectionsAPIDistributedZkTest-38BD49695C88CB2C-001/tempDir-002/]
   [junit4]   2> 699493 T3291 oashc.HttpShardHandlerFactory.getParameter Setting socketTimeout to: 90000
   [junit4]   2> 699494 T3291 oashc.HttpShardHandlerFactory.getParameter Setting urlScheme to: 
   [junit4]   2> 699494 T3291 oashc.HttpShardHandlerFactory.getParameter Setting connTimeout to: 15000
   [junit4]   2> 699494 T3291 oashc.HttpShardHandlerFactory.getParameter Setting maxConnectionsPerHost to: 20
   [junit4]   2> 699495 T3291 oashc.HttpShardHandlerFactory.getParameter Setting corePoolSize to: 0
   [junit4]   2> 699495 T3291 oashc.HttpShardHandlerFactory.getParameter Setting maximumPoolSize to: 2147483647
   [junit4]   2> 699496 T3291 oashc.HttpShardHandlerFactory.getParameter Setting maxThreadIdleTime to: 5
   [junit4]   2> 699496 T3291 oashc.HttpShardHandlerFactory.getParameter Setting sizeOfQueue to: -1
   [junit4]   2> 699497 T3291 oashc.HttpShardHandlerFactory.getParameter Setting fairnessPolicy to: false
   [junit4]   2> 699499 T3291 oasl.LogWatcher.createWatcher SLF4J impl is org.slf4j.impl.Log4jLoggerFactory
   [junit4]   2> 699500 T3291 oasl.LogWatcher.newRegisteredLogWatcher Registering Log Listener [Log4j (org.slf4j.impl.Log4jLoggerFactory)]
   [junit4]   2> 699500 T3291 oasc.CoreContainer.load Host Name: 127.0.0.1
   [junit4]   2> 699501 T3291 oasc.ZkContainer.initZooKeeper Zookeeper client=127.0.0.1:55083/solr
   [junit4]   2> 699501 T3291 oasc.ZkController.checkChrootPath zkHost includes chroot
   [junit4]   2> 699502 T3291 oascc.ConnectionManager.waitForConnected Waiting for client to connect to ZooKeeper
   [junit4]   2> 699504 T3313 oascc.ConnectionManager.process Watcher org.apache.solr.common.cloud.ConnectionManager@1d69c73 name:ZooKeeperConnection Watcher:127.0.0.1:55083 got event WatchedEvent state:SyncConnected type:None path:null path:null type:None
   [junit4]   2> 699505 T3291 oascc.ConnectionManager.waitForConnected Client is connected to ZooKeeper
   [junit4]   2> 699507 T3291 oascc.ConnectionManager.waitForConnected Waiting for client to connect to ZooKeeper
   [junit4]   2> 699508 T3315 oascc.ConnectionManager.process Watcher org.apache.solr.common.cloud.ConnectionManager@1558bdb name:ZooKeeperConnection Watcher:127.0.0.1:55083/solr got event WatchedEvent state:SyncConnected type:None path:null path:null type:None
   [junit4]   2> 699508 T3291 oascc.ConnectionManager.waitForConnected Client is connected to ZooKeeper
   [junit4]   2> 699510 T3291 oascc.SolrZkClient.makePath makePath: /overseer/queue
   [junit4]   2> 699516 T3291 oascc.SolrZkClient.makePath makePath: /overseer/collection-queue-work
   [junit4]   2> 699520 T3291 oascc.SolrZkClient.makePath makePath: /overseer/collection-map-running
   [junit4]   2> 699525 T3291 oascc.SolrZkClient.makePath makePath: /overseer/collection-map-completed
   [junit4]   2> 699529 T3291 oascc.SolrZkClient.makePath makePath: /overseer/collection-map-failure
   [junit4]   2> 699535 T3291 oascc.SolrZkClient.makePath makePath: /live_nodes
   [junit4]   2> 699538 T3291 oasc.ZkController.createEphemeralLiveNode Register node as live in ZooKeeper:/live_nodes/127.0.0.1:53072_dv%2Fcp
   [junit4]   2> 699540 T3291 oascc.SolrZkClient.makePath makePath: /live_nodes/127.0.0.1:53072_dv%2Fcp
   [junit4]   2> 699551 T3291 oascc.SolrZkClient.makePath makePath: /overseer_elect
   [junit4]   2> 699554 T3291 oascc.SolrZkClient.makePath makePath: /overseer_elect/election
   [junit4]   2> 699560 T3291 oasc.OverseerElectionContext.runLeaderProcess I am going to be the leader 127.0.0.1:53072_dv%2Fcp
   [junit4]   2> 699561 T3291 oascc.SolrZkClient.makePath makePath: /overseer_elect/leader
   [junit4]   2> 699565 T3291 oasc.Overseer.start Overseer (id=91744251075297284-127.0.0.1:53072_dv%2Fcp-n_0000000000) starting
   [junit4]   2> 699570 T3291 oascc.SolrZkClient.makePath makePath: /overseer/queue-work
   [junit4]   2> 699585 T3317 oasc.OverseerCollectionProcessor.run Process current queue of collection creations
   [junit4]   2> 699586 T3291 oascc.SolrZkClient.makePath makePath: /clusterstate.json
   [junit4]   2> 699586 T3317 oasc.OverseerCollectionProcessor.prioritizeOverseerNodes prioritizing overseer nodes at 127.0.0.1:53072_dv%2Fcp
   [junit4]   2> 699590 T3291 oascc.SolrZkClient.makePath makePath: /aliases.json
   [junit4]   2> 699593 T3291 oascc.ZkStateReader.createClusterStateWatchersAndUpdate Updating cluster state from ZooKeeper... 
   [junit4]   2> 699598 T3316 oasc.Overseer$ClusterStateUpdater.run Starting to work on the main queue
   [junit4]   2> 699599 T3291 oasc.CorePropertiesLocator.discover Looking for core definitions underneath /mnt/ssd/jenkins/workspace/Lucene-Solr-trunk-Linux/solr/build/solr-core/test/J1/./solr.cloud.CollectionsAPIDistributedZkTest-38BD49695C88CB2C-001/tempDir-002
   [junit4]   2> 699612 T3291 oasc.CorePropertiesLocator.discoverUnder Found core conf in /mnt/ssd/jenkins/workspace/Lucene-Solr-trunk-Linux/solr/build/solr-core/test/J1/./solr.cloud.CollectionsAPIDistributedZkTest-38BD49695C88CB2C-001/tempDir-002/conf/
   [junit4]   2> 699733 T3291 oasc.CorePropertiesLocator.discover Found 1 core definitions
   [junit4]   2> 699735 T3291 oass.SolrDispatchFilter.init user.dir=/mnt/ssd/jenkins/workspace/Lucene-Solr-trunk-Linux/solr/build/solr-core/test/J1
   [junit4]   2> 699735 T3291 oass.SolrDispatchFilter.init SolrDispatchFilter.init() done
   [junit4]   2> 699738 T3291 oascc.ConnectionManager.waitForConnected Waiting for client to connect to ZooKeeper
   [junit4]   2> 699740 T3320 oascc.ConnectionManager.process Watcher org.apache.solr.common.cloud.ConnectionManager@706ab name:ZooKeeperConnection Watcher:127.0.0.1:55083/solr got event WatchedEvent state:SyncConnected type:None path:null path:null type:None
   [junit4]   2> 699741 T3291 oascc.ConnectionManager.waitForConnected Client is connected to ZooKeeper
   [junit4]   2> 699742 T3291 oascc.ZkStateReader.createClusterStateWatchersAndUpdate Updating cluster state from ZooKeeper... 
   [junit4]   2> 699745 T3291 oasc.ChaosMonkey.monkeyLog monkey: init - expire sessions:false cause connection loss:false
   [junit4]   2> 700034 T3291 oasc.AbstractFullDistribZkTestBase.createJettys create jetty 1
   [junit4]   2> 700034 T3291 oejs.Server.doStart jetty-8.1.10.v20130312
   [junit4]   2> 700037 T3291 oejus.SslContextFactory.doStart Enabled Protocols [SSLv2Hello, SSLv3, TLSv1, TLSv1.1, TLSv1.2] of [SSLv2Hello, SSLv3, TLSv1, TLSv1.1, TLSv1.2]
   [junit4]   2> 700039 T3291 oejs.AbstractConnector.doStart Started SslSelectChannelConnector@127.0.0.1:53883
   [junit4]   2> 700041 T3291 oass.SolrDispatchFilter.init SolrDispatchFilter.init()
   [junit4]   2> 700041 T3291 oasc.SolrResourceLoader.locateSolrHome JNDI not configured for solr (NoInitialContextEx)
   [junit4]   2> 700042 T3291 oasc.SolrResourceLoader.locateSolrHome using system property solr.solr.home: ./solr.cloud.CollectionsAPIDistributedZkTest-38BD49695C88CB2C-001/tempDir-003
   [junit4]   2> 700043 T3291 oasc.SolrResourceLoader.<init> new SolrResourceLoader for directory: './solr.cloud.CollectionsAPIDistributedZkTest-38BD49695C88CB2C-001/tempDir-003/'
   [junit4]   2> 700062 T3291 oasc.ConfigSolr.fromFile Loading container configuration from /mnt/ssd/jenkins/workspace/Lucene-Solr-trunk-Linux/solr/build/solr-core/test/J1/./solr.cloud.CollectionsAPIDistributedZkTest-38BD49695C88CB2C-001/tempDir-003/solr.xml
   [junit4]   2> 700082 T3291 oasc.CorePropertiesLocator.<init> Config-defined core root directory: /mnt/ssd/jenkins/workspace/Lucene-Solr-trunk-Linux/solr/build/solr-core/test/J1/./solr.cloud.CollectionsAPIDistributedZkTest-38BD49695C88CB2C-001/tempDir-003
   [junit4]   2> 700082 T3291 oasc.CoreContainer.<init> New CoreContainer 32233261
   [junit4]   2> 700083 T3291 oasc.CoreContainer.load Loading cores into CoreContainer [instanceDir=./solr.cloud.CollectionsAPIDistributedZkTest-38BD49695C88CB2C-001/tempDir-003/]
   [junit4]   2> 700083 T3291 oashc.HttpShardHandlerFactory.getParameter Setting socketTimeout to: 90000
   [junit4]   2> 700084 T3291 oashc.HttpShardHandlerFactory.getParameter Setting urlScheme to: 
   [junit4]   2> 700084 T3291 oashc.HttpShardHandlerFactory.getParameter Setting connTimeout to: 15000
   [junit4]   2> 700085 T3291 oashc.HttpShardHandlerFactory.getParameter Setting maxConnectionsPerHost to: 20
   [junit4]   2> 700085 T3291 oashc.HttpShardHandlerFactory.getParameter Setting corePoolSize to: 0
   [junit4]   2> 700086 T3291 oashc.HttpShardHandlerFactory.getParameter Setting maximumPoolSize to: 2147483647
   [junit4]   2> 700086 T3291 oashc.HttpShardHandlerFactory.getParameter Setting maxThreadIdleTime to: 5
   [junit4]   2> 700086 T3291 oashc.HttpShardHandlerFactory.getParameter Setting sizeOfQueue to: -1
   [junit4]   2> 700087 T3291 oashc.HttpShardHandlerFactory.getParameter Setting fairnessPolicy to: false
   [junit4]   2> 700089 T3291 oasl.LogWatcher.createWatcher SLF4J impl is org.slf4j.impl.Log4jLoggerFactory
   [junit4]   2> 700090 T3291 oasl.LogWatcher.newRegisteredLogWatcher Registering Log Listener [Log4j (org.slf4j.impl.Log4jLoggerFactory)]
   [junit4]   2> 700090 T3291 oasc.CoreContainer.load Host Name: 127.0.0.1
   [junit4]   2> 700091 T3291 oasc.ZkContainer.initZooKeeper Zookeeper client=127.0.0.1:55083/solr
   [junit4]   2> 700091 T3291 oasc.ZkController.checkChrootPath zkHost includes chroot
   [junit4]   2> 700092 T3291 oascc.ConnectionManager.waitForConnected Waiting for client to connect to ZooKeeper
   [junit4]   2> 700094 T3331 oascc.ConnectionManager.process Watcher org.apache.solr.common.cloud.ConnectionManager@b4273e name:ZooKeeperConnection Watcher:127.0.0.1:55083 got event WatchedEvent state:SyncConnected type:None path:null path:null type:None
   [junit4]   2> 700095 T3291 oascc.ConnectionManager.waitForConnected Client is connected to ZooKeeper
   [junit4]   2> 700098 T3291 oascc.ConnectionManager.waitForConnected Waiting for client to connect to ZooKeeper
   [junit4]   2> 700099 T3333 oascc.ConnectionManager.process Watcher org.apache.solr.common.cloud.ConnectionManager@251a45 name:ZooKeeperConnection Watcher:127.0.0.1:55083/solr got event WatchedEvent state:SyncConnected type:None path:null path:null type:None
   [junit4]   2> 700099 T3291 oascc.ConnectionManager.waitForConnected Client is connected to ZooKeeper
   [junit4]   2> 700110 T3291 oascc.ZkStateReader.createClusterStateWatchersAndUpdate Updating cluster state from ZooKeeper... 
   [junit4]   2> 701115 T3291 oasc.ZkController.createEphemeralLiveNode Register node as live in ZooKeeper:/live_nodes/127.0.0.1:53883_dv%2Fcp
   [junit4]   2> 701117 T3291 oascc.SolrZkClient.makePath makePath: /live_nodes/127.0.0.1:53883_dv%2Fcp
   [junit4]   2> 701128 T3291 oasc.CorePropertiesLocator.discover Looking for core definitions underneath /mnt/ssd/jenkins/workspace/Lucene-Solr-trunk-Linux/solr/build/solr-core/test/J1/./solr.cloud.CollectionsAPIDistributedZkTest-38BD49695C88CB2C-001/tempDir-003
   [junit4]   2> 701140 T3291 oasc.CorePropertiesLocator.discoverUnder Found core conf in /mnt/ssd/jenkins/workspace/Lucene-Solr-trunk-Linux/solr/build/solr-core/test/J1/./solr.cloud.CollectionsAPIDistributedZkTest-38BD49695C88CB2C-001/tempDir-003/conf/
   [junit4]   2> 701247 T3291 oasc.CorePropertiesLocator.discover Found 1 core definitions
   [junit4]   2> 701249 T3291 oass.SolrDispatchFilter.init user.dir=/mnt/ssd/jenkins/workspace/Lucene-Solr-trunk-Linux/solr/build/solr-core/test/J1
   [junit4]   2> 701249 T3291 oass.SolrDispatchFilter.init SolrDispatchFilter.init() done
   [junit4]   2> 701507 T3291 oasc.AbstractFullDistribZkTestBase.createJettys create jetty 2
   [junit4]   2> 701508 T3291 oejs.Server.doStart jetty-8.1.10.v20130312
   [junit4]   2> 701512 T3291 oejus.SslContextFactory.doStart Enabled Protocols [SSLv2Hello, SSLv3, TLSv1, TLSv1.1, TLSv1.2] of [SSLv2Hello, SSLv3, TLSv1, TLSv1.1, TLSv1.2]
   [junit4]   2> 701513 T3291 oejs.AbstractConnector.doStart Started SslSelectChannelConnector@127.0.0.1:60366
   [junit4]   2> 701514 T3291 oass.SolrDispatchFilter.init SolrDispatchFilter.init()
   [junit4]   2> 701515 T3291 oasc.SolrResourceLoader.locateSolrHome JNDI not configured for solr (NoInitialContextEx)
   [junit4]   2> 701516 T3291 oasc.SolrResourceLoader.locateSolrHome using system property solr.solr.home: ./solr.cloud.CollectionsAPIDistributedZkTest-38BD49695C88CB2C-001/tempDir-004
   [junit4]   2> 701517 T3291 oasc.SolrResourceLoader.<init> new SolrResourceLoader for directory: './solr.cloud.CollectionsAPIDistributedZkTest-38BD49695C88CB2C-001/tempDir-004/'
   [junit4]   2> 701541 T3291 oasc.ConfigSolr.fromFile Loading container configuration from /mnt/ssd/jenkins/workspace/Lucene-Solr-trunk-Linux/solr/build/solr-core/test/J1/./solr.cloud.CollectionsAPIDistributedZkTest-38BD49695C88CB2C-001/tempDir-004/solr.xml
   [junit4]   2> 701569 T3291 oasc.CorePropertiesLocator.<init> Config-defined core root directory: /mnt/ssd/jenkins/workspace/Lucene-Solr-trunk-Linux/solr/build/solr-core/test/J1/./solr.cloud.CollectionsAPIDistributedZkTest-38BD49695C88CB2C-001/tempDir-004
   [junit4]   2> 701570 T3291 oasc.CoreContainer.<init> New CoreContainer 22507652
   [junit4]   2> 701571 T3291 oasc.CoreContainer.load Loading cores into CoreContainer [instanceDir=./solr.cloud.CollectionsAPIDistributedZkTest-38BD49695C88CB2C-001/tempDir-004/]
   [junit4]   2> 701572 T3291 oashc.HttpShardHandlerFactory.getParameter Setting socketTimeout to: 90000
   [junit4]   2> 701573 T3291 oashc.HttpShardHandlerFactory.getParameter Setting urlScheme to: 
   [junit4]   2> 701573 T3291 oashc.HttpShardHandlerFactory.getParameter Setting connTimeout to: 15000
   [junit4]   2> 701574 T3291 oashc.HttpShardHandlerFactory.getParameter Setting maxConnectionsPerHost to: 20
   [junit4]   2> 701575 T3291 oashc.HttpShardHandlerFactory.getParameter Setting corePoolSize to: 0
   [junit4]   2> 701575 T3291 oashc.HttpShardHandlerFactory.getParameter Setting maximumPoolSize to: 2147483647
   [junit4]   2> 701576 T3291 oashc.HttpShardHandlerFactory.getParameter Setting maxThreadIdleTime to: 5
   [junit4]   2> 701577 T3291 oashc.HttpShardHandlerFactory.getParameter Setting sizeOfQueue to: -1
   [junit4]   2> 701577 T3291 oashc.HttpShardHandlerFactory.getParameter Setting fairnessPolicy to: false
   [junit4]   2> 701581 T3291 oasl.LogWatcher.createWatcher SLF4J impl is org.slf4j.impl.Log4jLoggerFactory
   [junit4]   2> 701582 T3291 oasl.LogWatcher.newRegisteredLogWatcher Registering Log Listener [Log4j (org.slf4j.impl.Log4jLoggerFactory)]
   [junit4]   2> 701582 T3291 oasc.CoreContainer.load Host Name: 127.0.0.1
   [junit4]   2> 701583 T3291 oasc.ZkContainer.initZooKeeper Zookeeper client=127.0.0.1:55083/solr
   [junit4]   2> 701584 T3291 oasc.ZkController.checkChrootPath zkHost includes chroot
   [junit4]   2> 701585 T3291 oascc.ConnectionManager.waitForConnected Waiting for client to connect to ZooKeeper
   [junit4]   2> 701587 T3345 oascc.ConnectionManager.process Watcher org.apache.solr.common.cloud.ConnectionManager@1c194f4 name:ZooKeeperConnection Watcher:127.0.0.1:55083 got event WatchedEvent state:SyncConnected type:None path:null path:null type:None
   [junit4]   2> 701588 T3291 oascc.ConnectionManager.waitForConnected Client is connected to ZooKeeper
   [junit4]   2> 701591 T3291 oascc.ConnectionManager.waitForConnected Waiting for client to connect to ZooKeeper
   [junit4]   2> 701593 T3347 oascc.ConnectionManager.process Watcher org.apache.solr.common.cloud.ConnectionManager@65743 name:ZooKeeperConnection Watcher:127.0.0.1:55083/solr got event WatchedEvent state:SyncConnected type:None path:null path:null type:None
   [junit4]   2> 701593 T3291 oascc.ConnectionManager.waitForConnected Client is connected to ZooKeeper
   [junit4]   2> 701606 T3291 oascc.ZkStateReader.createClusterStateWatchersAndUpdate Updating cluster state from ZooKeeper... 
   [junit4]   2> 702610 T3291 oasc.ZkController.createEphemeralLiveNode Register node as live in ZooKeeper:/live_nodes/127.0.0.1:60366_dv%2Fcp
   [junit4]   2> 702611 T3291 oascc.SolrZkClient.makePath makePath: /live_nodes/127.0.0.1:60366_dv%2Fcp
   [junit4]   2> 702620 T3291 oasc.CorePropertiesLocator.discover Looking for core definitions underneath /mnt/ssd/jenkins/workspace/Lucene-Solr-trunk-Linux/solr/build/solr-core/test/J1/./solr.cloud.CollectionsAPIDistributedZkTest-38BD49695C88CB2C-001/tempDir-004
   [junit4]   2> 702631 T3291 oasc.CorePropertiesLocator.discoverUnder Found core conf in /mnt/ssd/jenkins/workspace/Lucene-Solr-trunk-Linux/solr/build/solr-core/test/J1/./solr.cloud.CollectionsAPIDistributedZkTest-38BD49695C88CB2C-001/tempDir-004/conf/
   [junit4]   2> 702735 T3291 oasc.CorePropertiesLocator.discover Found 1 core definitions
   [junit4]   2> 702737 T3291 oass.SolrDispatchFilter.init user.dir=/mnt/ssd/jenkins/workspace/Lucene-Solr-trunk-Linux/solr/build/solr-core/test/J1
   [junit4]   2> 702737 T3291 oass.SolrDispatchFilter.init SolrDispatchFilter.init() done
   [junit4]   2> 703014 T3291 oasc.AbstractFullDistribZkTestBase.createJettys create jetty 3
   [junit4]   2> 703015 T3291 oejs.Server.doStart jetty-8.1.10.v20130312
   [junit4]   2> 703018 T3291 oejus.SslContextFactory.doStart Enabled Protocols [SSLv2Hello, SSLv3, TLSv1, TLSv1.1, TLSv1.2] of [SSLv2Hello, SSLv3, TLSv1, TLSv1.1, TLSv1.2]
   [junit4]   2> 703019 T3291 oejs.AbstractConnector.doStart Started SslSelectChannelConnector@127.0.0.1:40981
   [junit4]   2> 703022 T3291 oass.SolrDispatchFilter.init SolrDispatchFilter.init()
   [junit4]   2> 703023 T3291 oasc.SolrResourceLoader.locateSolrHome JNDI not configured for solr (NoInitialContextEx)
   [junit4]   2> 703023 T3291 oasc.SolrResourceLoader.locateSolrHome using system property solr.solr.home: ./solr.cloud.CollectionsAPIDistributedZkTest-38BD49695C88CB2C-001/tempDir-005
   [junit4]   2> 703024 T3291 oasc.SolrResourceLoader.<init> new SolrResourceLoader for directory: './solr.cloud.CollectionsAPIDistributedZkTest-38BD49695C88CB2C-001/tempDir-005/'
   [junit4]   2> 703053 T3291 oasc.ConfigSolr.fromFile Loading container configuration from /mnt/ssd/jenkins/workspace/Lucene-Solr-trunk-Linux/solr/build/solr-core/test/J1/./solr.cloud.CollectionsAPIDistributedZkTest-38BD49695C88CB2C-001/tempDir-005/solr.xml
   [junit4]   2> 703069 T3291 oasc.CorePropertiesLocator.<init> Config-defined core root directory: /mnt/ssd/jenkins/workspace/Lucene-Solr-trunk-Linux/solr/build/solr-core/test/J1/./solr.cloud.CollectionsAPIDistributedZkTest-38BD49695C88CB2C-001/tempDir-005
   [junit4]   2> 703069 T3291 oasc.CoreContainer.<init> New CoreContainer 19226682
   [junit4]   2> 703070 T3291 oasc.CoreContainer.load Loading cores into CoreContainer [instanceDir=./solr.cloud.CollectionsAPIDistributedZkTest-38BD49695C88CB2C-001/tempDir-005/]
   [junit4]   2> 703071 T3291 oashc.HttpShardHandlerFactory.getParameter Setting socketTimeout to: 90000
   [junit4]   2> 703072 T3291 oashc.HttpShardHandlerFactory.getParameter Setting urlScheme to: 
   [junit4]   2> 703072 T3291 oashc.HttpShardHandlerFactory.getParameter Setting connTimeout to: 15000
   [junit4]   2> 703073 T3291 oashc.HttpShardHandlerFactory.getParameter Setting maxConnectionsPerHost to: 20
   [junit4]   2> 703073 T3291 oashc.HttpShardHandlerFactory.getParameter Setting corePoolSize to: 0
   [junit4]   2> 703074 T3291 oashc.HttpShardHandlerFactory.getParameter Setting maximumPoolSize to: 2147483647
   [junit4]   2> 703074 T3291 oashc.HttpShardHandlerFactory.getParameter Setting maxThreadIdleTime to: 5
   [junit4]   2> 703075 T3291 oashc.HttpShardHandlerFactory.getParameter Setting sizeOfQueue to: -1
   [junit4]   2> 703075 T3291 oashc.HttpShardHandlerFactory.getParameter Setting fairnessPolicy to: false
   [junit4]   2> 703077 T3291 oasl.LogWatcher.createWatcher SLF4J impl is org.slf4j.impl.Log4jLoggerFactory
   [junit4]   2> 703077 T3291 oasl.LogWatcher.newRegisteredLogWatcher Registering Log Listener [Log4j (org.slf4j.impl.Log4jLoggerFactory)]
   [junit4]   2> 703077 T3291 oasc.CoreContainer.load Host Name: 127.0.0.1
   [junit4]   2> 703078 T3291 oasc.ZkContainer.initZooKeeper Zookeeper client=127.0.0.1:55083/solr
   [junit4]   2> 703078 T3291 oasc.ZkController.checkChrootPath zkHost includes chroot
   [junit4]   2> 703079 T3291 oascc.ConnectionManager.waitForConnected Waiting for client to connect to ZooKeeper
   [junit4]   2> 703080 T3359 oascc.ConnectionManager.process Watcher org.apache.solr.common.cloud.ConnectionManager@1fd88d0 name:ZooKeeperConnection Watcher:127.0.0.1:55083 got event WatchedEvent state:SyncConnected type:None path:null path:null type:None
   [junit4]   2> 703081 T3291 oascc.ConnectionManager.waitForConnected Client is connected to ZooKeeper
   [junit4]   2> 703083 T3291 oascc.ConnectionManager.waitForConnected Waiting for client to connect to ZooKeeper
   [junit4]   2> 703085 T3361 oascc.ConnectionManager.process Watcher org.apache.solr.common.cloud.ConnectionManager@11e0307 name:ZooKeeperConnection Watcher:127.0.0.1:55083/solr got event WatchedEvent state:SyncConnected type:None path:null path:null type:None
   [junit4]   2> 703086 T3291 oascc.ConnectionManager.waitForConnected Client is connected to ZooKeeper
   [junit4]   2> 703094 T3291 oascc.ZkStateReader.createClusterStateWatchersAndUpdate Updating cluster state from ZooKeeper... 
   [junit4]   2> 704097 T3291 oasc.ZkController.createEphemeralLiveNode Register node as live in ZooKeeper:/live_nodes/127.0.0.1:40981_dv%2Fcp
   [junit4]   2> 704098 T3291 oascc.SolrZkClient.makePath makePath: /live_nodes/127.0.0.1:40981_dv%2Fcp
   [junit4]   2> 704105 T3291 oasc.CorePropertiesLocator.discover Looking for core definitions underneath /mnt/ssd/jenkins/workspace/Lucene-Solr-trunk-Linux/solr/build/solr-core/test/J1/./solr.cloud.CollectionsAPIDistributedZkTest-38BD49695C88CB2C-001/tempDir-005
   [junit4]   2> 704111 T3291 oasc.CorePropertiesLocator.discoverUnder Found core conf in /mnt/ssd/jenkins/workspace/Lucene-Solr-trunk-Linux/solr/build/solr-core/test/J1/./solr.cloud.CollectionsAPIDistributedZkTest-38BD49695C88CB2C-001/tempDir-005/conf/
   [junit4]   2> 704227 T3291 oasc.CorePropertiesLocator.discover Found 1 core definitions
   [junit4]   2> 704228 T3291 oass.SolrDispatchFilter.init user.dir=/mnt/ssd/jenkins/workspace/Lucene-Solr-trunk-Linux/solr/build/solr-core/test/J1
   [junit4]   2> 704229 T3291 oass.SolrDispatchFilter.init SolrDispatchFilter.init() done
   [junit4]   2> 704499 T3291 oasc.AbstractFullDistribZkTestBase.createJettys create jetty 4
   [junit4]   2> 704500 T3291 oejs.Server.doStart jetty-8.1.10.v20130312
   [junit4]   2> 704503 T3291 oejus.SslContextFactory.doStart Enabled Protocols [SSLv2Hello, SSLv3, TLSv1, TLSv1.1, TLSv1.2] of [SSLv2Hello, SSLv3, TLSv1, TLSv1.1, TLSv1.2]
   [junit4]   2> 704505 T3291 oejs.AbstractConnector.doStart Started SslSelectChannelConnector@127.0.0.1:57496
   [junit4]   2> 704507 T3291 oass.SolrDispatchFilter.init SolrDispatchFilter.init()
   [junit4]   2> 704508 T3291 oasc.SolrResourceLoader.locateSolrHome JNDI not configured for solr (NoInitialContextEx)
   [junit4]   2> 704509 T3291 oasc.SolrResourceLoader.locateSolrHome using system property solr.solr.home: ../../../../../../../../../../mnt/ssd/jenkins/workspace/Lucene-Solr-trunk-Linux/solr/build/solr-core/test/J1/./solr.cloud.CollectionsAPIDistributedZkTest-38BD49695C88CB2C-001/tempDir-006
   [junit4]   2> 704509 T3291 oasc.SolrResourceLoader.<init> new SolrResourceLoader for directory: '../../../../../../../../../../mnt/ssd/jenkins/workspace/Lucene-Solr-trunk-Linux/solr/build/solr-core/test/J1/./solr.cloud.CollectionsAPIDistributedZkTest-38BD49695C88CB2C-001/tempDir-006/'
   [junit4]   2> 704541 T3291 oasc.ConfigSolr.fromFile Loading container configuration from /mnt/ssd/jenkins/workspace/Lucene-Solr-trunk-Linux/solr/build/solr-core/test/J1/../../../../../../../../../../mnt/ssd/jenkins/workspace/Lucene-Solr-trunk-Linux/solr/build/solr-core/test/J1/./solr.cloud.CollectionsAPIDistributedZkTest-38BD49695C88CB2C-001/tempDir-006/solr.xml
   [junit4]   2> 704556 T3291 oasc.CorePropertiesLocator.<init> Config-defined core root directory: /mnt/ssd/jenkins/workspace/Lucene-Solr-trunk-Linux/solr/build/solr-core/test/J1/../../../../../../../../../../mnt/ssd/jenkins/workspace/Lucene-Solr-trunk-Linux/solr/build/solr-core/test/J1/./solr.cloud.CollectionsAPIDistributedZkTest-38BD49695C88CB2C-001/tempDir-006
   [junit4]   2> 704557 T3291 oasc.CoreContainer.<init> New CoreContainer 10516776
   [junit4]   2> 704557 T3291 oasc.CoreContainer.load Loading cores into CoreContainer [instanceDir=../../../../../../../../../../mnt/ssd/jenkins/workspace/Lucene-Solr-trunk-Linux/solr/build/solr-core/test/J1/./solr.cloud.CollectionsAPIDistributedZkTest-38BD49695C88CB2C-001/tempDir-006/]
   [junit4]   2> 704557 T3291 oashc.HttpShardHandlerFactory.getParameter Setting socketTimeout to: 90000
   [junit4]   2> 704558 T3291 oashc.HttpShardHandlerFactory.getParameter Setting urlScheme to: 
   [junit4]   2> 704558 T3291 oashc.HttpShardHandlerFactory.getParameter Setting connTimeout to: 15000
   [junit4]   2> 704559 T3291 oashc.HttpShardHandlerFactory.getParameter Setting maxConnectionsPerHost to: 20
   [junit4]   2> 704559 T3291 oashc.HttpShardHandlerFactory.getParameter Setting corePoolSize to: 0
   [junit4]   2> 704559 T3291 oashc.HttpShardHandlerFactory.getParameter Setting maximumPoolSize to: 2147483647
   [junit4]   2> 704560 T3291 oashc.HttpShardHandlerFactory.getParameter Setting maxThreadIdleTime to: 5
   [junit4]   2> 704560 T3291 oashc.HttpShardHandlerFactory.getParameter Setting sizeOfQueue to: -1
   [junit4]   2> 704560 T3291 oashc.HttpShardHandlerFactory.getParameter Setting fairnessPolicy to: false
   [junit4]   2> 704562 T3291 oasl.LogWatcher.createWatcher SLF4J impl is org.slf4j.impl.Log4jLoggerFactory
   [junit4]   2> 704563 T3291 oasl.LogWatcher.newRegisteredLogWatcher Registering Log Listener [Log4j (org.slf4j.impl.Log4jLoggerFactory)]
   [junit4]   2> 704563 T3291 oasc.CoreContainer.load Host Name: 127.0.0.1
   [junit4]   2> 704563 T3291 oasc.ZkContainer.initZooKeeper Zookeeper client=127.0.0.1:55083/solr
   [junit4]   2> 704564 T3291 oasc.ZkController.checkChrootPath zkHost includes chroot
   [junit4]   2> 704564 T3291 oascc.ConnectionManager.waitForConnected Waiting for client to connect to ZooKeeper
   [junit4]   2> 704565 T3373 oascc.ConnectionManager.process Watcher org.apache.solr.common.cloud.ConnectionManager@15ad070 name:ZooKeeperConnection Watcher:127.0.0.1:55083 got event WatchedEvent state:SyncConnected type:None path:null path:null type:None
   [junit4]   2> 704566 T3291 oascc.ConnectionManager.waitForConnected Client is connected to ZooKeeper
   [junit4]   2> 704567 T3291 oascc.ConnectionManager.waitForConnected Waiting for client to connect to ZooKeeper
   [junit4]   2> 704569 T3375 oascc.ConnectionManager.process Watcher org.apache.solr.common.cloud.ConnectionManager@1dfe48d name:ZooKeeperConnection Watcher:127.0.0.1:55083/solr got event WatchedEvent state:SyncConnected type:None path:null path:null type:None
   [junit4]   2> 704569 T3291 oascc.ConnectionManager.waitForConnected Client is connected to ZooKeeper
   [junit4]   2> 704577 T3291 oascc.ZkStateReader.createClusterStateWatchersAndUpdate Updating cluster state from ZooKeeper... 
   [junit4]   2> 705579 T3291 oasc.ZkController.createEphemeralLiveNode Register node as live in ZooKeeper:/live_nodes/127.0.0.1:57496_dv%2Fcp
   [junit4]   2> 705581 T3291 oascc.SolrZkClient.makePath makePath: /live_nodes/127.0.0.1:57496_dv%2Fcp
   [junit4]   2> 705593 T3291 oasc.CorePropertiesLocator.discover Looking for core definitions underneath /mnt/ssd/jenkins/workspace/Lucene-Solr-trunk-Linux/solr/build/solr-core/test/J1/../../../../../../../../../../mnt/ssd/jenkins/workspace/Lucene-Solr-trunk-Linux/solr/build/solr-core/test/J1/./solr.cloud.CollectionsAPIDistributedZkTest-38BD49695C88CB2C-001/tempDir-006
   [junit4]   2> 705607 T3291 oasc.CorePropertiesLocator.discoverUnder Found core conf in /mnt/ssd/jenkins/workspace/Lucene-Solr-trunk-Linux/solr/build/solr-core/test/J1/../../../../../../../../../../mnt/ssd/jenkins/workspace/Lucene-Solr-trunk-Linux/solr/build/solr-core/test/J1/./solr.cloud.CollectionsAPIDistributedZkTest-38BD49695C88CB2C-001/tempDir-006/conf/
   [junit4]   2> 705739 T3291 oasc.CorePropertiesLocator.discover Found 1 core definitions
   [junit4]   2> 705740 T3291 oass.SolrDispatchFilter.init user.dir=/mnt/ssd/jenkins/workspace/Lucene-Solr-trunk-Linux/solr/build/solr-core/test/J1
   [junit4]   2> 705740 T3291 oass.SolrDispatchFilter.init SolrDispatchFilter.init() done
   [junit4]   2> 705827 T3328 oasha.CollectionsHandler.handleCreateAction Creating Collection : replicationFactor=2&collection.configName=conf1&router.field=myOwnField&name=solrj_collection&router.name=compositeId&action=CREATE&numShards=2&wt=javabin&version=2
   [junit4]   2> 705829 T3315 oasc.DistributedQueue$LatchChildWatcher.process LatchChildWatcher fired on path: /overseer/collection-queue-work state: SyncConnected type NodeChildrenChanged
   [junit4]   2> 705830 T3317 oasc.OverseerCollectionProcessor.run Overseer Collection Processor: Get the message id:/overseer/collection-queue-work/qn-0000000000 message:{
   [junit4]   2> 	  "operation":"createcollection",
   [junit4]   2> 	  "fromApi":"true",
   [junit4]   2> 	  "name":"solrj_collection",
   [junit4]   2> 	  "replicationFactor":"2",
   [junit4]   2> 	  "collection.configName":"conf1",
   [junit4]   2> 	  "numShards":"2",
   [junit4]   2> 	  "router.field":"myOwnField",
   [junit4]   2> 	  "router.name":"compositeId"}
   [junit4]   2> 705831 T3317 oasc.OverseerCollectionProcessor.processMessage WARN OverseerCollectionProcessor.processMessage : createcollection , {
   [junit4]   2> 	  "operation":"createcollection",
   [junit4]   2> 	  "fromApi":"true",
   [junit4]   2> 	  "name":"solrj_collection",
   [junit4]   2> 	  "replicationFactor":"2",
   [junit4]   2> 	  "collection.configName":"conf1",
   [junit4]   2> 	  "numShards":"2",
   [junit4]   2> 	  "router.field":"myOwnField",
   [junit4]   2> 	  "router.name":"compositeId"}
   [junit4]   2> 705833 T3317 oasc.OverseerCollectionProcessor.createConfNode creating collections conf node /collections/solrj_collection 
   [junit4]   2> 705833 T3317 oascc.SolrZkClient.makePath makePath: /collections/solrj_collection
   [junit4]   2> 705839 T3315 oasc.DistributedQueue$LatchChildWatcher.process LatchChildWatcher fired on path: /overseer/queue state: SyncConnected type NodeChildrenChanged
   [junit4]   2> 705841 T3316 oascc.ZkStateReader.updateClusterState Updating cloud state from ZooKeeper... 
   [junit4]   2> 705842 T3316 oasc.Overseer$ClusterStateUpdater.buildCollection building a new collection: solrj_collection
   [junit4]   2> 705843 T3316 oasc.Overseer$ClusterStateUpdater.createCollection Create collection solrj_collection with shards [shard1, shard2]
   [junit4]   2> 705846 T3315 oasc.DistributedQueue$LatchChildWatcher.process LatchChildWatcher fired on path: /overseer/queue state: SyncConnected type NodeChildrenChanged
   [junit4]   2> 705848 T3361 oascc.ZkStateReader$2.process A cluster state change: WatchedEvent state:SyncConnected type:NodeDataChanged path:/clusterstate.json, has occurred - updating... (live nodes size: 5)
   [junit4]   2> 705848 T3333 oascc.ZkStateReader$2.process A cluster state change: WatchedEvent state:SyncConnected type:NodeDataChanged path:/clusterstate.json, has occurred - updating... (live nodes size: 5)
   [junit4]   2> 705848 T3347 oascc.ZkStateReader$2.process A cluster state change: WatchedEvent state:SyncConnected type:NodeDataChanged path:/clusterstate.json, has occurred - updating... (live nodes size: 5)
   [junit4]   2> 705848 T3315 oascc.ZkStateReader$2.process A cluster state change: WatchedEvent state:SyncConnected type:NodeDataChanged path:/clusterstate.json, has occurred - updating... (live nodes size: 5)
   [junit4]   2> 705848 T3320 oascc.ZkStateReader$2.process A cluster state change: WatchedEvent state:SyncConnected type:NodeDataChanged path:/clusterstate.json, has occurred - updating... (live nodes size: 5)
   [junit4]   2> 705848 T3375 oascc.ZkStateReader$2.process A cluster state change: WatchedEvent state:SyncConnected type:NodeDataChanged path:/clusterstate.json, has occurred - updating... (live nodes size: 5)
   [junit4]   2> 705939 T3317 oasc.OverseerCollectionProcessor.createCollection Creating SolrCores for new collection, shardNames [shard1, shard2] , replicationFactor : 2
   [junit4]   2> 705940 T3317 oasc.OverseerCollectionProcessor.createCollection Creating shard solrj_collection_shard1_replica1 as part of slice shard1 of collection solrj_collection on 127.0.0.1:53072_dv%2Fcp
   [junit4]   2> 705942 T3317 oasc.OverseerCollectionProcessor.createCollection Creating shard solrj_collection_shard1_replica2 as part of slice shard1 of collection solrj_collection on 127.0.0.1:53883_dv%2Fcp
   [junit4]   2> 705945 T3317 oasc.OverseerCollectionProcessor.createCollection Creating shard solrj_collection_shard2_replica1 as part of slice shard2 of collection solrj_collection on 127.0.0.1:60366_dv%2Fcp
   [junit4]   2> 705948 T3317 oasc.OverseerCollectionProcessor.createCollection Creating shard solrj_collection_shard2_replica2 as part of slice shard2 of collection solrj_collection on 127.0.0.1:57496_dv%2Fcp
   [junit4]   2> 706011 T3311 oasha.CoreAdminHandler.handleCreateAction core create command qt=/admin/cores&collection.configName=conf1&name=solrj_collection_shard1_replica1&action=CREATE&numShards=2&collection=solrj_collection&shard=shard1&wt=javabin&version=2
   [junit4]   2> 706013 T3311 oasc.ZkController.publish publishing core=solrj_collection_shard1_replica1 state=down collection=solrj_collection
   [junit4]   2> 706015 T3311 oasc.ZkController.waitForCoreNodeName look for our core node name
   [junit4]   2> 706015 T3327 oasha.CoreAdminHandler.handleCreateAction core create command qt=/admin/cores&collection.configName=conf1&name=solrj_collection_shard1_replica2&action=CREATE&numShards=2&collection=solrj_collection&shard=shard1&wt=javabin&version=2
   [junit4]   2> 706015 T3315 oasc.DistributedQueue$LatchChildWatcher.process LatchChildWatcher fired on path: /overseer/queue state: SyncConnected type NodeChildrenChanged
   [junit4]   2> 706016 T3316 oascc.ZkStateReader.updateClusterState Updating cloud state from ZooKeeper... 
   [junit4]   2> 706017 T3327 oasc.ZkController.publish publishing core=solrj_collection_shard1_replica2 state=down collection=solrj_collection
   [junit4]   2> 706017 T3316 oasc.Overseer$ClusterStateUpdater.updateState Update state numShards=2 message={
   [junit4]   2> 	  "operation":"state",
   [junit4]   2> 	  "state":"down",
   [junit4]   2> 	  "base_url":"https://127.0.0.1:53072/dv/cp",
   [junit4]   2> 	  "core":"solrj_collection_shard1_replica1",
   [junit4]   2> 	  "roles":null,
   [junit4]   2> 	  "node_name":"127.0.0.1:53072_dv%2Fcp",
   [junit4]   2> 	  "shard":"shard1",
   [junit4]   2> 	  "collection":"solrj_collection",
   [junit4]   2> 	  "numShards":"2",
   [junit4]   2> 	  "core_node_name":null}
   [junit4]   2> 706018 T3315 oasc.DistributedQueue$LatchChildWatcher.process LatchChildWatcher fired on path: /overseer/queue state: SyncConnected type NodeChildrenChanged
   [junit4]   2> 706018 T3327 oasc.ZkController.waitForCoreNodeName look for our core node name
   [junit4]   2> 706018 T3343 oasha.CoreAdminHandler.handleCreateAction core create command qt=/admin/cores&collection.configName=conf1&name=solrj_collection_shard2_replica1&action=CREATE&numShards=2&collection=solrj_collection&shard=shard2&wt=javabin&version=2
   [junit4]   2> 706019 T3370 oasha.CoreAdminHandler.handleCreateAction core create command qt=/admin/cores&collection.configName=conf1&name=solrj_collection_shard2_replica2&action=CREATE&numShards=2&collection=solrj_collection&shard=shard2&wt=javabin&version=2
   [junit4]   2> 706019 T3316 oasc.Overseer$ClusterStateUpdater.updateState Update state numShards=2 message={
   [junit4]   2> 	  "operation":"state",
   [junit4]   2> 	  "state":"down",
   [junit4]   2> 	  "base_url":"https://127.0.0.1:53883/dv/cp",
   [junit4]   2> 	  "core":"solrj_collection_shard1_replica2",
   [junit4]   2> 	  "roles":null,
   [junit4]   2> 	  "node_name":"127.0.0.1:53883_dv%2Fcp",
   [junit4]   2> 	  "shard":"shard1",
   [junit4]   2> 	  "collection":"solrj_collection",
   [junit4]   2> 	  "numShards":"2",
   [junit4]   2> 	  "core_node_name":null}
   [junit4]   2> 706021 T3343 oasc.ZkController.publish publishing core=solrj_collection_shard2_replica1 state=down collection=solrj_collection
   [junit4]   2> 706021 T3370 oasc.ZkController.publish publishing core=solrj_collection_shard2_replica2 state=down collection=solrj_collection
   [junit4]   2> 706021 T3315 oasc.DistributedQueue$LatchChildWatcher.process LatchChildWatcher fired on path: /overseer/queue state: SyncConnected type NodeChildrenChanged
   [junit4]   2> 706021 T3343 oasc.ZkController.waitForCoreNodeName look for our core node name
   [junit4]   2> 706022 T3370 oasc.ZkController.waitForCoreNodeName look for our core node name
   [junit4]   2> 706022 T3316 oasc.Overseer$ClusterStateUpdater.updateState Update state numShards=2 message={
   [junit4]   2> 	  "operation":"state",
   [junit4]   2> 	  "state":"down",
   [junit4]   2> 	  "base_url":"https://127.0.0.1:60366/dv/cp",
   [junit4]   2> 	  "core":"solrj_collection_shard2_replica1",
   [junit4]   2> 	  "roles":null,
   [junit4]   2> 	  "node_name":"127.0.0.1:60366_dv%2Fcp",
   [junit4]   2> 	  "shard":"shard2",
   [junit4]   2> 	  "collection":"solrj_collection",
   [junit4]   2> 	  "numShards":"2",
   [junit4]   2> 	  "core_node_name":null}
   [junit4]   2> 706023 T3315 oasc.DistributedQueue$LatchChildWatcher.process LatchChildWatcher fired on path: /overseer/queue state: SyncConnected type NodeChildrenChanged
   [junit4]   2> 706024 T3316 oasc.Overseer$ClusterStateUpdater.updateState Update state numShards=2 message={
   [junit4]   2> 	  "operation":"state",
   [junit4]   2> 	  "state":"down",
   [junit4]   2> 	  "base_url":"https://127.0.0.1:57496/dv/cp",
   [junit4]   2> 	  "core":"solrj_collection_shard2_replica2",
   [junit4]   2> 	  "roles":null,
   [junit4]   2> 	  "node_name":"127.0.0.1:57496_dv%2Fcp",
   [junit4]   2> 	  "shard":"shard2",
   [junit4]   2> 	  "collection":"solrj_collection",
   [junit4]   2> 	  "numShards":"2",
   [junit4]   2> 	  "core_node_name":null}
   [junit4]   2> 706025 T3315 oasc.DistributedQueue$LatchChildWatcher.process LatchChildWatcher fired on path: /overseer/queue state: SyncConnected type NodeChildrenChanged
   [junit4]   2> 706128 T3361 oascc.ZkStateReader$2.process A cluster state change: WatchedEvent state:SyncConnected type:NodeDataChanged path:/clusterstate.json, has occurred - updating... (live nodes size: 5)
   [junit4]   2> 706128 T3333 oascc.ZkStateReader$2.process A cluster state change: WatchedEvent state:SyncConnected type:NodeDataChanged path:/clusterstate.json, has occurred - updating... (live nodes size: 5)
   [junit4]   2> 706128 T3375 oascc.ZkStateReader$2.process A cluster state change: WatchedEvent state:SyncConnected type:NodeDataChanged path:/clusterstate.json, has occurred - updating... (live nodes size: 5)
   [junit4]   2> 706128 T3315 oascc.ZkStateReader$2.process A cluster state change: WatchedEvent state:SyncConnected type:NodeDataChanged path:/clusterstate.json, has occurred - updating... (live nodes size: 5)
   [junit4]   2> 706128 T3320 oascc.ZkStateReader$2.process A cluster state change: WatchedEvent state:SyncConnected type:NodeDataChanged path:/clusterstate.json, has occurred - updating... (live nodes size: 5)
   [junit4]   2> 706128 T3347 oascc.ZkStateReader$2.process A cluster state change: WatchedEvent state:SyncConnected type:NodeDataChanged path:/clusterstate.json, has occurred - updating... (live nodes size: 5)
   [junit4]   2> 707015 T3311 oasc.ZkController.waitForShardId waiting to find shard id in clusterstate for solrj_collection_shard1_replica1
   [junit4]   2> 707017 T3311 oasc.ZkController.createCollectionZkNode Check for collection zkNode:solrj_collection
   [junit4]   2> 707018 T3311 oasc.ZkController.createCollectionZkNode Collection zkNode exists
   [junit4]   2> 707019 T3311 oascc.ZkStateReader.readConfigName Load collection config from:/collections/solrj_collection
   [junit4]   2> 707018 T3327 oasc.ZkController.waitForShardId waiting to find shard id in clusterstate for solrj_collection_shard1_replica2
   [junit4]   2> 707021 T3311 oascc.ZkStateReader.readConfigName path=/collections/solrj_collection configName=conf1 specified config exists in ZooKeeper
   [junit4]   2> 707021 T3327 oasc.ZkController.createCollectionZkNode Check for collection zkNode:solrj_collection
   [junit4]   2> 707022 T3343 oasc.ZkController.waitForShardId waiting to find shard id in clusterstate for solrj_collection_shard2_replica1
   [junit4]   2> 707021 T3311 oasc.SolrResourceLoader.<init> new SolrResourceLoader for directory: './solr.cloud.CollectionsAPIDistributedZkTest-38BD49695C88CB2C-001/tempDir-002/solrj_collection_shard1_replica1/'
   [junit4]   2> 707023 T3343 oasc.ZkController.createCollectionZkNode Check for collection zkNode:solrj_collection
   [junit4]   2> 707023 T3327 oasc.ZkController.createCollectionZkNode Collection zkNode exists
   [junit4]   2> 707022 T3370 oasc.ZkController.waitForShardId waiting to find shard id in clusterstate for solrj_collection_shard2_replica2
   [junit4]   2> 707024 T3327 oascc.ZkStateReader.readConfigName Load collection config from:/collections/solrj_collection
   [junit4]   2> 707024 T3343 oasc.ZkController.createCollectionZkNode Collection zkNode exists
   [junit4]   2> 707026 T3343 oascc.ZkStateReader.readConfigName Load collection config from:/collections/solrj_collection
   [junit4]   2> 707026 T3370 oasc.ZkController.createCollectionZkNode Check for collection zkNode:solrj_collection
   [junit4]   2> 707027 T3327 oascc.ZkStateReader.readConfigName path=/collections/solrj_collection configName=conf1 specified config exists in ZooKeeper
   [junit4]   2> 707028 T3370 oasc.ZkController.createCollectionZkNode Collection zkNode exists
   [junit4]   2> 707033 T3370 oascc.ZkStateReader.readConfigName Load collection config from:/collections/solrj_collection
   [junit4]   2> 707028 T3343 oascc.ZkStateReader.readConfigName path=/collections/solrj_collection configName=conf1 specified config exists in ZooKeeper
   [junit4]   2> 707032 T3327 oasc.SolrResourceLoader.<init> new SolrResourceLoader for directory: './solr.cloud.CollectionsAPIDistributedZkTest-38BD49695C88CB2C-001/tempDir-003/solrj_collection_shard1_replica2/'
   [junit4]   2> 707035 T3370 oascc.ZkStateReader.readConfigName path=/collections/solrj_collection configName=conf1 specified config exists in ZooKeeper
   [junit4]   2> 707036 T3370 oasc.SolrResourceLoader.<init> new SolrResourceLoader for directory: '../../../../../../../../../../mnt/ssd/jenkins/workspace/Lucene-Solr-trunk-Linux/solr/build/solr-core/test/J1/./solr.cloud.CollectionsAPIDistributedZkTest-38BD49695C88CB2C-001/tempDir-006/solrj_collection_shard2_replica2/'
   [junit4]   2> 707034 T3343 oasc.SolrResourceLoader.<init> new SolrResourceLoader for directory: './solr.cloud.CollectionsAPIDistributedZkTest-38BD49695C88CB2C-001/tempDir-004/solrj_collection_shard2_replica1/'
   [junit4]   2> 707090 T3311 oasc.SolrConfig.<init> Using Lucene MatchVersion: LUCENE_5_0
   [junit4]   2> 707094 T3343 oasc.SolrConfig.<init> Using Lucene MatchVersion: LUCENE_5_0
   [junit4]   2> 707112 T3311 oasc.SolrConfig.<init> Loaded SolrConfig: solrconfig.xml
   [junit4]   2> 707113 T3327 oasc.SolrConfig.<init> Using Lucene MatchVersion: LUCENE_5_0
   [junit4]   2> 707113 T3311 oass.IndexSchema.readSchema Reading Solr Schema from schema.xml
   [junit4]   2> 707116 T3343 oasc.SolrConfig.<init> Loaded SolrConfig: solrconfig.xml
   [junit4]   2> 707118 T3343 oass.IndexSchema.readSchema Reading Solr Schema from schema.xml
   [junit4]   2> 707120 T3311 oass.IndexSchema.readSchema [solrj_collection_shard1_replica1] Schema name=test
   [junit4]   2> 707132 T3370 oasc.SolrConfig.<init> Using Lucene MatchVersion: LUCENE_5_0
   [junit4]   2> 707136 T3343 oass.IndexSchema.readSchema [solrj_collection_shard2_replica1] Schema name=test
   [junit4]   2> 707145 T3327 oasc.SolrConfig.<init> Loaded SolrConfig: solrconfig.xml
   [junit4]   2> 707147 T3327 oass.IndexSchema.readSchema Reading Solr Schema from schema.xml
   [junit4]   2> 707172 T3370 oasc.SolrConfig.<init> Loaded SolrConfig: solrconfig.xml
   [junit4]   2> 707174 T3370 oass.IndexSchema.readSchema Reading Solr Schema from schema.xml
   [junit4]   2> 707176 T3327 oass.IndexSchema.readSchema [solrj_collection_shard1_replica2] Schema name=test
   [junit4]   2> 707200 T3370 oass.IndexSchema.readSchema [solrj_collection_shard2_replica2] Schema name=test
   [junit4]   2> 707424 T3343 oass.OpenExchangeRatesOrgProvider.init Initialized with rates=open-exchange-rates.json, refreshInterval=1440.
   [junit4]   2> 707433 T3343 oass.IndexSchema.readSchema default search field in schema is text
   [junit4]   2> 707434 T3311 oass.OpenExchangeRatesOrgProvider.init Initialized with rates=open-exchange-rates.json, refreshInterval=1440.
   [junit4]   2> 707435 T3343 oass.IndexSchema.readSchema unique key field: id
   [junit4]   2> 707438 T3311 oass.IndexSchema.readSchema default search field in schema is text
   [junit4]   2> 707440 T3311 oass.IndexSchema.readSchema unique key field: id
   [junit4]   2> 707451 T3370 oass.OpenExchangeRatesOrgProvider.init Initialized with rates=open-exchange-rates.json, refreshInterval=1440.
   [junit4]   2> 707451 T3343 oass.FileExchangeRateProvider.reload Reloading exchange rates from file currency.xml
   [junit4]   2> 707455 T3343 oass.FileExchangeRateProvider.reload Reloading exchange rates from file currency.xml
   [junit4]   2> 707455 T3311 oass.FileExchangeRateProvider.reload Reloading exchange rates from file currency.xml
   [junit4]   2> 707455 T3370 oass.IndexSchema.readSchema default search field in schema is text
   [junit4]   2> 707457 T3311 oass.FileExchangeRateProvider.reload Reloading exchange rates from file currency.xml
   [junit4]   2> 707458 T3343 oass.OpenExchangeRatesOrgProvider.reload Reloading exchange rates from open-exchange-rates.json
   [junit4]   2> 707458 T3370 oass.IndexSchema.readSchema unique key field: id
   [junit4]   2> 707459 T3343 oass.OpenExchangeRatesOrgProvider$OpenExchangeRates.<init> WARN Unknown key IMPORTANT NOTE
   [junit4]   2> 707461 T3343 oass.OpenExchangeRatesOrgProvider$OpenExchangeRates.<init> WARN Expected key, got STRING
   [junit4]   2> 707461 T3343 oass.OpenExchangeRatesOrgProvider.reload Reloading exchange rates from open-exchange-rates.json
   [junit4]   2> 707462 T3311 oass.OpenExchangeRatesOrgProvider.reload Reloading exchange rates from open-exchange-rates.json
   [junit4]   2> 707463 T3343 oass.OpenExchangeRatesOrgProvider$OpenExchangeRates.<init> WARN Unknown key IMPORTANT NOTE
   [junit4]   2> 707463 T3343 oass.OpenExchangeRatesOrgProvider$OpenExchangeRates.<init> WARN Expected key, got STRING
   [junit4]   2> 707464 T3343 oasc.CoreContainer.create Creating SolrCore 'solrj_collection_shard2_replica1' using configuration from collection solrj_collection
   [junit4]   2> 707464 T3343 oasc.SolrCore.initDirectoryFactory org.apache.solr.core.MockDirectoryFactory
   [junit4]   2> 707464 T3343 oasc.SolrCore.<init> [solrj_collection_shard2_replica1] Opening new SolrCore at ./solr.cloud.CollectionsAPIDistributedZkTest-38BD49695C88CB2C-001/tempDir-004/solrj_collection_shard2_replica1/, dataDir=./solr.cloud.CollectionsAPIDistributedZkTest-38BD49695C88CB2C-001/tempDir-004/solrj_collection_shard2_replica1/data/
   [junit4]   2> 707465 T3343 oasc.JmxMonitoredMap.<init> JMX monitoring is enabled. Adding Solr mbeans to JMX Server: com.sun.jmx.mbeanserver.JmxMBeanServer@1a97e6d
   [junit4]   2> 707463 T3311 oass.OpenExchangeRatesOrgProvider$OpenExchangeRates.<init> WARN Unknown key IMPORTANT NOTE
   [junit4]   2> 707466 T3343 oasc.CachingDirectoryFactory.get return new directory for ./solr.cloud.CollectionsAPIDistributedZkTest-38BD49695C88CB2C-001/tempDir-004/solrj_collection_shard2_replica1/data
   [junit4]   2> 707468 T3311 oass.OpenExchangeRatesOrgProvider$OpenExchangeRates.<init> WARN Expected key, got STRING
   [junit4]   2> 707469 T3343 oasc.SolrCore.getNewIndexDir New index directory detected: old=null new=./solr.cloud.CollectionsAPIDistributedZkTest-38BD49695C88CB2C-001/tempDir-004/solrj_collection_shard2_replica1/data/index/
   [junit4]   2> 707469 T3311 oass.OpenExchangeRatesOrgProvider.reload Reloading exchange rates from open-exchange-rates.json
   [junit4]   2> 707469 T3343 oasc.SolrCore.initIndex WARN [solrj_collection_shard2_replica1] Solr index directory './solr.cloud.CollectionsAPIDistributedZkTest-38BD49695C88CB2C-001/tempDir-004/solrj_collection_shard2_replica1/data/index' doesn't exist. Creating new index...
   [junit4]   2> 707470 T3327 oass.OpenExchangeRatesOrgProvider.init Initialized with rates=open-exchange-rates.json, refreshInterval=1440.
   [junit4]   2> 707470 T3311 oass.OpenExchangeRatesOrgProvider$OpenExchangeRates.<init> WARN Unknown key IMPORTANT NOTE
   [junit4]   2> 707471 T3311 oass.OpenExchangeRatesOrgProvider$OpenExchangeRates.<init> WARN Expected key, got STRING
   [junit4]   2> 707470 T3343 oasc.CachingDirectoryFactory.get return new directory for ./solr.cloud.CollectionsAPIDistributedZkTest-38BD49695C88CB2C-001/tempDir-004/solrj_collection_shard2_replica1/data/index
   [junit4]   2> 707471 T3311 oasc.CoreContainer.create Creating SolrCore 'solrj_collection_shard1_replica1' using configuration from collection solrj_collection
   [junit4]   2> 707471 T3370 oass.FileExchangeRateProvider.reload Reloading exchange rates from file currency.xml
   [junit4]   2> 707472 T3311 oasc.SolrCore.initDirectoryFactory org.apache.solr.core.MockDirectoryFactory
   [junit4]   2> 707472 T3343 oasu.RandomMergePolicy.<init> RandomMergePolicy wrapping class org.apache.lucene.index.AlcoholicMergePolicy: [AlcoholicMergePolicy: minMergeSize=0, mergeFactor=10, maxMergeSize=1931415883, maxMergeSizeForForcedMerge=9223372036854775807, calibrateSizeByDeletes=true, maxMergeDocs=2147483647, maxCFSSegmentSizeMB=8.796093022207999E12, noCFSRatio=0.1]
   [junit4]   2> 707473 T3311 oasc.SolrCore.<init> [solrj_collection_shard1_replica1] Opening new SolrCore at ./solr.cloud.CollectionsAPIDistributedZkTest-38BD49695C88CB2C-001/tempDir-002/solrj_collection_shard1_replica1/, dataDir=./solr.cloud.CollectionsAPIDistributedZkTest-38BD49695C88CB2C-001/tempDir-002/solrj_collection_shard1_replica1/data/
   [junit4]   2> 707474 T3343 oasc.SolrDeletionPolicy.onCommit SolrDeletionPolicy.onCommit: commits: num=1
   [junit4]   2> 		commit{dir=MockDirectoryWrapper(RAMDirectory@6a8b5c lockFactory=org.apache.lucene.store.SingleInstanceLockFactory@106914e),segFN=segments_1,generation=1}
   [junit4]   2> 707474 T3343 oasc.SolrDeletionPolicy.updateCommits newest commit generation = 1
   [junit4]   2> 707474 T3311 oasc.JmxMonitoredMap.<init> JMX monitoring is enabled. Adding Solr mbeans to JMX Server: com.sun.jmx.mbeanserver.JmxMBeanServer@1a97e6d
   [junit4]   2> 707475 T3327 oass.IndexSchema.readSchema default search field in schema is text
   [junit4]   2> 707475 T3370 oass.FileExchangeRateProvider.reload Reloading exchange rates from file currency.xml
   [junit4]   2> 707476 T3311 oasc.CachingDirectoryFactory.get return new directory for ./solr.cloud.CollectionsAPIDistributedZkTest-38BD49695C88CB2C-001/tempDir-002/solrj_collection_shard1_replica1/data
   [junit4]   2> 707476 T3311 oasc.SolrCore.getNewIndexDir New index directory detected: old=null new=./solr.cloud.CollectionsAPIDistributedZkTest-38BD49695C88CB2C-001/tempDir-002/solrj_collection_shard1_replica1/data/index/
   [junit4]   2> 707477 T3311 oasc.SolrCore.initIndex WARN [solrj_collection_shard1_replica1] Solr index directory './solr.cloud.CollectionsAPIDistributedZkTest-38BD49695C88CB2C-001/tempDir-002/solrj_collection_shard1_replica1/data/index' doesn't exist. Creating new index...
   [junit4]   2> 707477 T3327 oass.IndexSchema.readSchema unique key field: id
   [junit4]   2> 707478 T3370 oass.OpenExchangeRatesOrgProvider.reload Reloading exchange rates from open-exchange-rates.json
   [junit4]   2> 707478 T3311 oasc.CachingDirectoryFactory.get return new directory for ./solr.cloud.CollectionsAPIDistributedZkTest-38BD49695C88CB2C-001/tempDir-002/solrj_collection_shard1_replica1/data/index
   [junit4]   2> 707478 T3343 oasup.UpdateRequestProcessorChain.init creating updateRequestProcessorChain "nodistrib"
   [junit4]   2> 707479 T3311 oasu.RandomMergePolicy.<init> RandomMergePolicy wrapping class org.apache.lucene.index.AlcoholicMergePolicy: [AlcoholicMergePolicy: minMergeSize=0, mergeFactor=10, maxMergeSize=1931415883, maxMergeSizeForForcedMerge=9223372036854775807, calibrateSizeByDeletes=true, maxMergeDocs=2147483647, maxCFSSegmentSizeMB=8.796093022207999E12, noCFSRatio=0.1]
   [junit4]   2> 707480 T3343 oasup.UpdateRequestProcessorChain.init creating updateRequestProcessorChain "dedupe"
   [junit4]   2> 707479 T3370 oass.OpenExchangeRatesOrgProvider$OpenExchangeRates.<init> WARN Unknown key IMPORTANT NOTE
   [junit4]   2> 707481 T3370 oass.OpenExchangeRatesOrgProvider$OpenExchangeRates.<init> WARN Expected key, got STRING
   [junit4]   2> 707480 T3343 oasup.UpdateRequestProcessorChain.init inserting DistributedUpdateProcessorFactory into updateRequestProcessorChain "dedupe"
   [junit4]   2> 707480 T3311 oasc.SolrDeletionPolicy.onCommit SolrDeletionPolicy.onCommit: commits: num=1
   [junit4]   2> 		commit{dir=MockDirectoryWrapper(RAMDirectory@148416b lockFactory=org.apache.lucene.store.SingleInstanceLockFactory@c2c47a),segFN=segments_1,generation=1}
   [junit4]   2> 707482 T3311 oasc.SolrDeletionPolicy.updateCommits newest commit generation = 1
   [junit4]   2> 707481 T3343 oasup.UpdateRequestProcessorChain.init creating updateRequestProcessorChain "stored_sig"
   [junit4]   2> 707481 T3370 oass.OpenExchangeRatesOrgProvider.reload Reloading exchange rates from open-exchange-rates.json
   [junit4]   2> 707482 T3343 oasup.UpdateRequestProcessorChain.init inserting DistributedUpdateProcessorFactory into updateRequestProcessorChain "stored_sig"
   [junit4]   2> 707483 T3343 oasup.UpdateRequestProcessorChain.init creating updateRequestProcessorChain "distrib-dup-test-chain-explicit"
   [junit4]   2> 707483 T3370 oass.OpenExchangeRatesOrgProvider$OpenExchangeRates.<init> WARN Unknown key IMPORTANT NOTE
   [junit4]   2> 707484 T3370 oass.OpenExchangeRatesOrgProvider$OpenExchangeRates.<init> WARN Expected key, got STRING
   [junit4]   2> 707484 T3343 oasup.UpdateRequestProcessorChain.init creating updateRequestProcessorChain "distrib-dup-test-chain-implicit"
   [junit4]   2> 707484 T3370 oasc.CoreContainer.create Creating SolrCore 'solrj_collection_shard2_replica2' using configuration from collection solrj_collection
   [junit4]   2> 707485 T3343 oasup.UpdateRequestProcessorChain.init inserting DistributedUpdateProcessorFactory into updateRequestProcessorChain "distrib-dup-test-chain-implicit"
   [junit4]   2> 707485 T3343 oasc.SolrCore.loadUpdateProcessorChains no updateRequestProcessorChain defined as default, creating implicit default
   [junit4]   2> 707485 T3370 oasc.SolrCore.initDirectoryFactory org.apache.solr.core.MockDirectoryFactory
   [junit4]   2> 707486 T3327 oass.FileExchangeRateProvider.reload Reloading exchange rates from file currency.xml
   [junit4]   2> 707486 T3311 oasup.UpdateRequestProcessorChain.init creating updateRequestProcessorChain "nodistrib"
   [junit4]   2> 707486 T3370 oasc.SolrCore.<init> [solrj_collection_shard2_replica2] Opening new SolrCore at ../../../../../../../../../../mnt/ssd/jenkins/workspace/Lucene-Solr-trunk-Linux/solr/build/solr-core/test/J1/./solr.cloud.CollectionsAPIDistributedZkTest-38BD49695C88CB2C-001/tempDir-006/solrj_collection_shard2_replica2/, dataDir=../../../../../../../../../../mnt/ssd/jenkins/workspace/Lucene-Solr-trunk-Linux/solr/build/solr-core/test/J1/./solr.cloud.CollectionsAPIDistributedZkTest-38BD49695C88CB2C-001/tempDir-006/solrj_collection_shard2_replica2/data/
   [junit4]   2> 707486 T3343 oasc.RequestHandlers.initHandlersFromConfig created standard: solr.StandardRequestHandler
   [junit4]   2> 707487 T3370 oasc.JmxMonitoredMap.<init> JMX monitoring is enabled. Adding Solr mbeans to JMX Server: com.sun.jmx.mbeanserver.JmxMBeanServer@1a97e6d
   [junit4]   2> 707487 T3311 oasup.UpdateRequestProcessorChain.init creating updateRequestProcessorChain "dedupe"
   [junit4]   2> 707488 T3343 oasc.RequestHandlers.initHandlersFromConfig created /get: solr.RealTimeGetHandler
   [junit4]   2> 707488 T3343 oasc.RequestHandlers.initHandlersFromConfig adding lazy requestHandler: solr.ReplicationHandler
   [junit4]   2> 707488 T3370 oasc.CachingDirectoryFactory.get return new directory for ../../../../../../../../../../mnt/ssd/jenkins/workspace/Lucene-Solr-trunk-Linux/solr/build/solr-core/test/J1/./solr.cloud.CollectionsAPIDistributedZkTest-38BD49695C88CB2C-001/tempDir-006/solrj_collection_shard2_replica2/data
   [junit4]   2> 707488 T3311 oasup.UpdateRequestProcessorChain.init inserting DistributedUpdateProcessorFactory into updateRequestProcessorChain "dedupe"
   [junit4]   2> 707488 T3327 oass.FileExchangeRateProvider.reload Reloading exchange rates from file currency.xml
   [junit4]   2> 707489 T3311 oasup.UpdateRequestProcessorChain.init creating updateRequestProcessorChain "stored_sig"
   [junit4]   2> 707489 T3370 oasc.SolrCore.getNewIndexDir New index directory detected: old=null new=../../../../../../../../../../mnt/ssd/jenkins/workspace/Lucene-Solr-trunk-Linux/solr/build/solr-core/test/J1/./solr.cloud.CollectionsAPIDistributedZkTest-38BD49695C88CB2C-001/tempDir-006/solrj_collection_shard2_replica2/data/index/
   [junit4]   2> 707489 T3343 oasc.RequestHandlers.initHandlersFromConfig created /replication: solr.ReplicationHandler
   [junit4]   2> 707491 T3370 oasc.SolrCore.initIndex WARN [solrj_collection_shard2_replica2] Solr index directory '../../../../../../../../../../mnt/ssd/jenkins/workspace/Lucene-Solr-trunk-Linux/solr/build/solr-core/test/J1/./solr.cloud.CollectionsAPIDistributedZkTest-38BD49695C88CB2C-001/tempDir-006/solrj_collection_shard2_replica2/data/index' doesn't exist. Creating new index...
   [junit4]   2> 707492 T3343 oasc.RequestHandlers.initHandlersFromConfig created /update: solr.UpdateRequestHandler
   [junit4]   2> 707492 T3327 oass.OpenExchangeRatesOrgProvider.reload Reloading exchange rates from open-exchange-rates.json
   [junit4]   2> 707491 T3311 oasup.UpdateRequestProcessorChain.init inserting DistributedUpdateProcessorFactory into updateRequestProcessorChain "stored_sig"
   [junit4]   2> 707492 T3343 oasc.RequestHandlers.initHandlersFromConfig created /admin/: org.apache.solr.handler.admin.AdminHandlers
   [junit4]   2> 707492 T3370 oasc.CachingDirectoryFactory.get return new directory for ../../../../../../../../../../mnt/ssd/jenkins/workspace/Lucene-Solr-trunk-Linux/solr/build/solr-core/test/J1/./solr.cloud.CollectionsAPIDistributedZkTest-38BD49695C88CB2C-001/tempDir-006/solrj_collection_shard2_replica2/data/index
   [junit4]   2> 707495 T3343 oasc.RequestHandlers.initHandlersFromConfig created /admin/file: solr.admin.ShowFileRequestHandler
   [junit4]   2> 707494 T3327 oass.OpenExchangeRatesOrgProvider$OpenExchangeRates.<init> WARN Unknown key IMPORTANT NOTE
   [junit4]   2> 707496 T3343 oasc.RequestHandlers.initHandlersFromConfig created /admin/fileedit: solr.admin.EditFileRequestHandler
   [junit4]   2> 707493 T3311 oasup.UpdateRequestProcessorChain.init creating updateRequestProcessorChain "distrib-dup-test-chain-explicit"
   [junit4]   2> 707496 T3327 oass.OpenExchangeRatesOrgProvider$OpenExchangeRates.<init> WARN Expected key, got STRING
   [junit4]   2> 707495 T3370 oasu.RandomMergePolicy.<init> RandomMergePolicy wrapping class org.apache.lucene.index.AlcoholicMergePolicy: [AlcoholicMergePolicy: minMergeSize=0, mergeFactor=10, maxMergeSize=1931415883, maxMergeSizeForForcedMerge=9223372036854775807, calibrateSizeByDeletes=true, maxMergeDocs=2147483647, maxCFSSegmentSizeMB=8.796093022207999E12, noCFSRatio=0.1]
   [junit4]   2> 707498 T3327 oass.OpenExchangeRatesOrgProvider.reload Reloading exchange rates from open-exchange-rates.json
   [junit4]   2> 707497 T3311 oasup.UpdateRequestProcessorChain.init creating updateRequestProcessorChain "distrib-dup-test-chain-implicit"
   [junit4]   2> 707499 T3370 oasc.SolrDeletionPolicy.onCommit SolrDeletionPolicy.onCommit: commits: num=1
   [junit4]   2> 		commit{dir=MockDirectoryWrapper(RAMDirectory@1ff0a69 lockFactory=org.apache.lucene.store.SingleInstanceLockFactory@1f8860f),segFN=segments_1,generation=1}
   [junit4]   2> 707499 T3370 oasc.SolrDeletionPolicy.updateCommits newest commit generation = 1
   [junit4]   2> 707499 T3343 oashl.XMLLoader.init xsltCacheLifetimeSeconds=60
   [junit4]   2> 707500 T3327 oass.OpenExchangeRatesOrgProvider$OpenExchangeRates.<init> WARN Unknown key IMPORTANT NOTE
   [junit4]   2> 707501 T3327 oass.OpenExchangeRatesOrgProvider$OpenExchangeRates.<init> WARN Expected key, got STRING
   [junit4]   2> 707499 T3311 oasup.UpdateRequestProcessorChain.init inserting DistributedUpdateProcessorFactory into updateRequestProcessorChain "distrib-dup-test-chain-implicit"
   [junit4]   2> 707501 T3311 oasc.SolrCore.loadUpdateProcessorChains no updateRequestProcessorChain defined as default, creating implicit default
   [junit4]   2> 707501 T3327 oasc.CoreContainer.create Creating SolrCore 'solrj_collection_shard1_replica2' using configuration from collection solrj_collection
   [junit4]   2> 707502 T3343 oasu.CommitTracker.<init> Hard AutoCommit: disabled
   [junit4]   2> 707502 T3311 oasc.RequestHandlers.initHandlersFromConfig created standard: solr.StandardRequestHandler
   [junit4]   2> 707502 T3327 oasc.SolrCore.initDirectoryFactory org.apache.solr.core.MockDirectoryFactory
   [junit4]   2> 707502 T3343 oasu.CommitTracker.<init> Soft AutoCommit: disabled
   [junit4]   2> 707503 T3327 oasc.SolrCore.<init> [solrj_collection_shard1_replica2] Opening new SolrCore at ./solr.cloud.CollectionsAPIDistributedZkTest-38BD49695C88CB2C-001/tempDir-003/solrj_collection_shard1_replica2/, dataDir=./solr.cloud.CollectionsAPIDistributedZkTest-38BD49695C88CB2C-001/tempDir-003/solrj_collection_shard1_replica2/data/
   [junit4]   2> 707503 T3311 oasc.RequestHandlers.initHandlersFromConfig created /get: solr.RealTimeGetHandler
   [junit4]   2> 707504 T3311 oasc.RequestHandlers.initHandlersFromConfig adding lazy requestHandler: solr.ReplicationHandler
   [junit4]   2> 707504 T3343 oasu.RandomMergePolicy.<init> RandomMergePolicy wrapping class org.apache.lucene.index.TieredMergePolicy: [TieredMergePolicy: maxMergeAtOnce=49, maxMergeAtOnceExplicit=46, maxMergedSegmentMB=80.14453125, floorSegmentMB=1.4560546875, forceMergeDeletesPctAllowed=25.11362934510544, segmentsPerTier=38.0, maxCFSSegmentSizeMB=8.796093022207999E12, noCFSRatio=1.0
   [junit4]   2> 707504 T3327 oasc.JmxMonitoredMap.<init> JMX monitoring is enabled. Adding Solr mbeans to JMX Server: com.sun.jmx.mbeanserver.JmxMBeanServer@1a97e6d
   [junit4]   2> 707505 T3343 oasc.SolrDeletionPolicy.onInit SolrDeletionPolicy.onInit: commits: num=1
   [junit4]   2> 		commit{dir=MockDirectoryWrapper(RAMDirectory@6a8b5c lockFactory=org.apache.lucene.store.SingleInstanceLockFactory@106914e),segFN=segments_1,generation=1}
   [junit4]   2> 707505 T3343 oasc.SolrDeletionPolicy.updateCommits newest commit generation = 1
   [junit4]   2> 707504 T3370 oasup.UpdateRequestProcessorChain.init creating updateRequestProcessorChain "nodistrib"
   [junit4]   2> 707504 T3311 oasc.RequestHandlers.initHandlersFromConfig created /replication: solr.ReplicationHandler
   [junit4]   2> 707506 T3370 oasup.UpdateRequestProcessorChain.init creating updateRequestProcessorChain "dedupe"
   [junit4]   2> 707506 T3343 oass.SolrIndexSearcher.<init> Opening Searcher@61bc6d[solrj_collection_shard2_replica1] main
   [junit4]   2> 707505 T3327 oasc.CachingDirectoryFactory.get return new directory for ./solr.cloud.CollectionsAPIDistributedZkTest-38BD49695C88CB2C-001/tempDir-003/solrj_collection_shard1_replica2/data
   [junit4]   2> 707507 T3343 oascc.ZkStateReader.readConfigName Load collection config from:/collections/solrj_collection
   [junit4]   2> 707507 T3370 oasup.UpdateRequestProcessorChain.init inserting DistributedUpdateProcessorFactory into updateRequestProcessorChain "dedupe"
   [junit4]   2> 707507 T3311 oasc.RequestHandlers.initHandlersFromConfig created /update: solr.UpdateRequestHandler
   [junit4]   2> 707509 T3370 oasup.UpdateRequestProcessorChain.init creating updateRequestProcessorChain "stored_sig"
   [junit4]   2> 707508 T3327 oasc.SolrCore.getNewIndexDir New index directory detected: old=null new=./solr.cloud.CollectionsAPIDistributedZkTest-38BD49695C88CB2C-001/tempDir-003/solrj_collection_shard1_replica2/data/index/
   [junit4]   2> 707509 T3370 oasup.UpdateRequestProcessorChain.init inserting DistributedUpdateProcessorFactory into updateRequestProcessorChain "stored_sig"
   [junit4]   2> 707509 T3343 oascc.ZkStateReader.readConfigName path=/collections/solrj_collection configName=conf1 specified config exists in ZooKeeper
   [junit4]   2> 707511 T3343 oasr.ManagedResourceStorage.newStorageIO Setting up ZooKeeper-based storage for the RestManager with znodeBase: /configs/conf1
   [junit4]   2> 707509 T3311 oasc.RequestHandlers.initHandlersFromConfig created /admin/: org.apache.solr.handler.admin.AdminHandlers
   [junit4]   2> 707512 T3343 oasr.ManagedResourceStorage$ZooKeeperStorageIO.configure Configured ZooKeeperStorageIO with znodeBase: /configs/conf1
   [junit4]   2> 707512 T3343 oasr.RestManager.init Initializing RestManager with initArgs: {}
   [junit4]   2> 707510 T3370 oasup.UpdateRequestProcessorChain.init creating updateRequestProcessorChain "distrib-dup-test-chain-explicit"
   [junit4]   2> 707510 T3327 oasc.SolrCore.initIndex WARN [solrj_collection_shard1_replica2] Solr index directory './solr.cloud.CollectionsAPIDistributedZkTest-38BD49695C88CB2C-001/tempDir-003/solrj_collection_shard1_replica2/data/index' doesn't exist. Creating new index...
   [junit4]   2> 707513 T3370 oasup.UpdateRequestProcessorChain.init creating updateRequestProcessorChain "distrib-dup-test-chain-implicit"
   [junit4]   2> 707513 T3343 oasr.ManagedResourceStorage.load Reading _rest_managed.json using ZooKeeperStorageIO:path=/configs/conf1
   [junit4]   2> 707512 T3311 oasc.RequestHandlers.initHandlersFromConfig created /admin/file: solr.admin.ShowFileRequestHandler
   [junit4]   2> 707514 T3343 oasr.ManagedResourceStorage$ZooKeeperStorageIO.openInputStream No data found for znode /configs/conf1/_rest_managed.json
   [junit4]   2> 707515 T3311 oasc.RequestHandlers.initHandlersFromConfig created /admin/fileedit: solr.admin.EditFileRequestHandler
   [junit4]   2> 707514 T3370 oasup.UpdateRequestProcessorChain.init inserting DistributedUpdateProcessorFactory into updateRequestProcessorChain "distrib-dup-test-chain-implicit"
   [junit4]   2> 707515 T3370 oasc.SolrCore.loadUpdateProcessorChains no updateRequestProcessorChain defined as default, creating implicit default
   [junit4]   2> 707513 T3327 oasc.CachingDirectoryFactory.get return new directory for ./solr.cloud.CollectionsAPIDistributedZkTest-38BD49695C88CB2C-001/tempDir-003/solrj_collection_shard1_replica2/data/index
   [junit4]   2> 707516 T3311 oashl.XMLLoader.init xsltCacheLifetimeSeconds=60
   [junit4]   2> 707515 T3343 oasr.ManagedResourceStorage.load Loaded null at path _rest_managed.json using ZooKeeperStorageIO:path=/configs/conf1
   [junit4]   2> 707516 T3327 oasu.RandomMergePolicy.<init> RandomMergePolicy wrapping class org.apache.lucene.index.AlcoholicMergePolicy: [AlcoholicMergePolicy: minMergeSize=0, mergeFactor=10, maxMergeSize=1931415883, maxMergeSizeForForcedMerge=9223372036854775807, calibrateSizeByDeletes=true, maxMergeDocs=2147483647, maxCFSSegmentSizeMB=8.796093022207999E12, noCFSRatio=0.1]
   [junit4]   2> 707516 T3370 oasc.RequestHandlers.initHandlersFromConfig created standard: solr.StandardRequestHandler
   [junit4]   2> 707517 T3327 oasc.SolrDeletionPolicy.onCommit SolrDeletionPolicy.onCommit: commits: num=1
   [junit4]   2> 		commit{dir=MockDirectoryWrapper(RAMDirectory@1d9a53c lockFactory=org.apache.lucene.store.SingleInstanceLockFactory@52a1e2),segFN=segments_1,generation=1}
   [junit4]   2> 707518 T3370 oasc.RequestHandlers.initHandlersFromConfig created /get: solr.RealTimeGetHandler
   [junit4]   2> 707518 T3370 oasc.RequestHandlers.initHandlersFromConfig adding lazy requestHandler: solr.ReplicationHandler
   [junit4]   2> 707518 T3327 oasc.SolrDeletionPolicy.updateCommits newest commit generation = 1
   [junit4]   2> 707518 T3311 oasu.CommitTracker.<init> Hard AutoCommit: disabled
   [junit4]   2> 707517 T3343 oasr.ManagedResource.notifyObserversDuringInit WARN No registered observers for /rest/managed
   [junit4]   2> 707520 T3311 oasu.CommitTracker.<init> Soft AutoCommit: disabled
   [junit4]   2> 707519 T3370 oasc.RequestHandlers.initHandlersFromConfig created /replication: solr.ReplicationHandler
   [junit4]   2> 707520 T3343 oasr.RestManager.init Initializing 0 registered ManagedResources
   [junit4]   2> 707521 T3311 oasu.RandomMergePolicy.<init> RandomMergePolicy wrapping class org.apache.lucene.index.TieredMergePolicy: [TieredMergePolicy: maxMergeAtOnce=49, maxMergeAtOnceExplicit=46, maxMergedSegmentMB=80.14453125, floorSegmentMB=1.4560546875, forceMergeDeletesPctAllowed=25.11362934510544, segmentsPerTier=38.0, maxCFSSegmentSizeMB=8.796093022207999E12, noCFSRatio=1.0
   [junit4]   2> 707521 T3370 oasc.RequestHandlers.initHandlersFromConfig created /update: solr.UpdateRequestHandler
   [junit4]   2> 707522 T3311 oasc.SolrDeletionPolicy.onInit SolrDeletionPolicy.onInit: commits: num=1
   [junit4]   2> 		commit{dir=MockDirectoryWrapper(RAMDirectory@148416b lockFactory=org.apache.lucene.store.SingleInstanceLockFactory@c2c47a),segFN=segments_1,generation=1}
   [junit4]   2> 707522 T3311 oasc.SolrDeletionPolicy.updateCommits newest commit generation = 1
   [junit4]   2> 707522 T3370 oasc.RequestHandlers.initHandlersFromConfig created /admin/: org.apache.solr.handler.admin.AdminHandlers
   [junit4]   2> 707523 T3327 oasup.UpdateRequestProcessorChain.init creating updateRequestProcessorChain "nodistrib"
   [junit4]   2> 707523 T3311 oass.SolrIndexSearcher.<init> Opening Searcher@1c62bdc[solrj_collection_shard1_replica1] main
   [junit4]   2> 707524 T3327 oasup.UpdateRequestProcessorChain.init creating updat

[...truncated too long message...]

ClientCnxn$SendThread.run(ClientCnxn.java:994)
   [junit4]   2> 
   [junit4]   2> 813268 T3438 oazc.StaticHostProvider.next WARN Unexpected exception java.lang.InterruptedException: sleep interrupted
   [junit4]   2> 	at java.lang.Thread.sleep(Native Method)
   [junit4]   2> 	at org.apache.zookeeper.client.StaticHostProvider.next(StaticHostProvider.java:101)
   [junit4]   2> 	at org.apache.zookeeper.ClientCnxn$SendThread.startConnect(ClientCnxn.java:940)
   [junit4]   2> 	at org.apache.zookeeper.ClientCnxn$SendThread.run(ClientCnxn.java:1003)
   [junit4]   2> 
   [junit4]   2> 813269 T3438 oaz.ClientCnxn$SendThread.run WARN Session 0x145f0e90787000f for server null, unexpected error, closing socket connection and attempting reconnect java.net.ConnectException: Connection refused
   [junit4]   2> 	at sun.nio.ch.SocketChannelImpl.checkConnect(Native Method)
   [junit4]   2> 	at sun.nio.ch.SocketChannelImpl.finishConnect(SocketChannelImpl.java:712)
   [junit4]   2> 	at org.apache.zookeeper.ClientCnxnSocketNIO.doTransport(ClientCnxnSocketNIO.java:361)
   [junit4]   2> 	at org.apache.zookeeper.ClientCnxn$SendThread.run(ClientCnxn.java:1081)
   [junit4]   2> 
   [junit4]   2> 813768 T3438 oazc.StaticHostProvider.next WARN Unexpected exception java.lang.InterruptedException: sleep interrupted
   [junit4]   2> 	at java.lang.Thread.sleep(Native Method)
   [junit4]   2> 	at org.apache.zookeeper.client.StaticHostProvider.next(StaticHostProvider.java:101)
   [junit4]   2> 	at org.apache.zookeeper.ClientCnxn$SendThread.startConnect(ClientCnxn.java:940)
   [junit4]   2> 	at org.apache.zookeeper.ClientCnxn$SendThread.run(ClientCnxn.java:1003)
   [junit4]   2> 
   [junit4]   2> 813770 T3438 oaz.ClientCnxn$SendThread.run WARN Session 0x145f0e90787000f for server null, unexpected error, closing socket connection and attempting reconnect java.net.ConnectException: Connection refused
   [junit4]   2> 	at sun.nio.ch.SocketChannelImpl.checkConnect(Native Method)
   [junit4]   2> 	at sun.nio.ch.SocketChannelImpl.finishConnect(SocketChannelImpl.java:712)
   [junit4]   2> 	at org.apache.zookeeper.ClientCnxnSocketNIO.doTransport(ClientCnxnSocketNIO.java:361)
   [junit4]   2> 	at org.apache.zookeeper.ClientCnxn$SendThread.run(ClientCnxn.java:1081)
   [junit4]   2> 
   [junit4]   2> 115417 T3290 ccr.ThreadLeakControl.tryToInterruptAll SEVERE There are still zombie threads that couldn't be terminated:
   [junit4]   2> 	   1) Thread[id=3438, name=TEST-CollectionsAPIDistributedZkTest.testDistribSearch-seed#[38BD49695C88CB2C]-SendThread(127.0.0.1:55083), state=TIMED_WAITING, group=TGRP-CollectionsAPIDistributedZkTest]
   [junit4]   2> 	        at java.lang.Thread.sleep(Native Method)
   [junit4]   2> 	        at org.apache.zookeeper.ClientCnxn$SendThread.run(ClientCnxn.java:994)
   [junit4]   2> NOTE: test params are: codec=DummyCompressingStoredFields(storedFieldsFormat=CompressingStoredFieldsFormat(compressionMode=DUMMY, chunkSize=488), termVectorsFormat=CompressingTermVectorsFormat(compressionMode=DUMMY, chunkSize=488)), sim=RandomSimilarityProvider(queryNorm=false,coord=no): {}, locale=es_PA, timezone=Indian/Kerguelen
   [junit4]   2> NOTE: Linux 3.8.0-39-generic i386/Oracle Corporation 1.8.0_05 (32-bit)/cpus=8,threads=2,free=53216192,total=200916992
   [junit4]   2> NOTE: All tests run in this JVM: [SolrCoreCheckLockOnStartupTest, BJQParserTest, XsltUpdateRequestHandlerTest, HdfsRecoveryZkTest, LegacyHTMLStripCharFilterTest, TestCSVResponseWriter, TestComplexPhraseQParserPlugin, HdfsBasicDistributedZk2Test, FileUtilsTest, OpenExchangeRatesOrgProviderTest, TestRTGBase, TestRandomFaceting, TestRangeQuery, HighlighterTest, NumericFieldsTest, TestStressRecovery, TestWordDelimiterFilterFactory, DistribDocExpirationUpdateProcessorTest, UniqFieldsUpdateProcessorFactoryTest, HdfsUnloadDistributedZkTest, SolrTestCaseJ4Test, TestManagedResourceStorage, TestShortCircuitedRequests, AddBlockUpdateTest, SolrXmlInZkTest, TestNonDefinedSimilarityFactory, TestDistributedSearch, DirectUpdateHandlerTest, AbstractAnalyticsFacetTest, IndexSchemaRuntimeFieldTest, TestDynamicFieldResource, TestOverriddenPrefixQueryForCustomFieldType, TestSolrXMLSerializer, DateMathParserTest, DistributedQueryComponentCustomSortTest, TestSolrDeletionPolicy2, TestCodecSupport, IndexBasedSpellCheckerTest, TestSolrCoreProperties, TestRecoveryHdfs, DistanceFunctionTest, TestSolr4Spatial, TestFastWriter, NotRequiredUniqueKeyTest, TestAnalyzedSuggestions, TestFieldCollectionResource, SystemInfoHandlerTest, HardAutoCommitTest, SuggesterTSTTest, DocValuesMultiTest, SuggesterWFSTTest, TestBinaryResponseWriter, TestDefaultSearchFieldResource, SolrIndexConfigTest, TestCloudManagedSchema, AtomicUpdatesTest, HighlighterConfigTest, TestCustomSort, ExpressionTest, HdfsBasicDistributedZkTest, ChaosMonkeySafeLeaderTest, RangeFacetTest, SpellCheckCollatorTest, TestZkChroot, TestCoreDiscovery, DOMUtilTest, DocumentAnalysisRequestHandlerTest, PingRequestHandlerTest, DeleteInactiveReplicaTest, AssignTest, HdfsLockFactoryTest, TestStressLucene, DistributedSuggestComponentTest, DistributedDebugComponentTest, EnumFieldTest, DeleteShardTest, StressHdfsTest, ZkSolrClientTest, CoreContainerCoreInitFailuresTest, BasicZkTest, ResourceLoaderTest, SignatureUpdateProcessorFactoryTest, FullSolrCloudDistribCmdsTest, PrimUtilsTest, NoCacheHeaderTest, TestDistributedGrouping, TestOmitPositions, TestManagedResource, TestPartialUpdateDeduplication, DistributedQueryComponentOptimizationTest, LeaderElectionIntegrationTest, SolrPluginUtilsTest, TestSchemaVersionResource, AsyncMigrateRouteKeyTest, DistributedExpandComponentTest, TestUniqueKeyFieldResource, CollectionsAPIDistributedZkTest]
   [junit4]   2> NOTE: reproduce with: ant test  -Dtestcase=CollectionsAPIDistributedZkTest -Dtests.seed=38BD49695C88CB2C -Dtests.multiplier=3 -Dtests.slow=true -Dtests.locale=es_PA -Dtests.timezone=Indian/Kerguelen -Dtests.file.encoding=ISO-8859-1
   [junit4] ERROR   0.00s J1 | CollectionsAPIDistributedZkTest (suite) <<<
   [junit4]    > Throwable #1: java.lang.AssertionError: ERROR: SolrZkClient opens=19 closes=18
   [junit4]    > 	at __randomizedtesting.SeedInfo.seed([38BD49695C88CB2C]:0)
   [junit4]    > 	at org.apache.solr.SolrTestCaseJ4.endTrackingZkClients(SolrTestCaseJ4.java:451)
   [junit4]    > 	at org.apache.solr.SolrTestCaseJ4.afterClass(SolrTestCaseJ4.java:185)
   [junit4]    > 	at java.lang.Thread.run(Thread.java:745)Throwable #2: com.carrotsearch.randomizedtesting.ThreadLeakError: 2 threads leaked from SUITE scope at org.apache.solr.cloud.CollectionsAPIDistributedZkTest: 
   [junit4]    >    1) Thread[id=3439, name=TEST-CollectionsAPIDistributedZkTest.testDistribSearch-seed#[38BD49695C88CB2C]-EventThread, state=WAITING, group=TGRP-CollectionsAPIDistributedZkTest]
   [junit4]    >         at sun.misc.Unsafe.park(Native Method)
   [junit4]    >         at java.util.concurrent.locks.LockSupport.park(LockSupport.java:175)
   [junit4]    >         at java.util.concurrent.locks.AbstractQueuedSynchronizer$ConditionObject.await(AbstractQueuedSynchronizer.java:2039)
   [junit4]    >         at java.util.concurrent.LinkedBlockingQueue.take(LinkedBlockingQueue.java:442)
   [junit4]    >         at org.apache.zookeeper.ClientCnxn$EventThread.run(ClientCnxn.java:494)
   [junit4]    >    2) Thread[id=3438, name=TEST-CollectionsAPIDistributedZkTest.testDistribSearch-seed#[38BD49695C88CB2C]-SendThread(127.0.0.1:55083), state=TIMED_WAITING, group=TGRP-CollectionsAPIDistributedZkTest]
   [junit4]    >         at java.lang.Thread.sleep(Native Method)
   [junit4]    >         at org.apache.zookeeper.ClientCnxnSocketNIO.cleanup(ClientCnxnSocketNIO.java:230)
   [junit4]    >         at org.apache.zookeeper.ClientCnxn$SendThread.cleanup(ClientCnxn.java:1185)
   [junit4]    >         at org.apache.zookeeper.ClientCnxn$SendThread.run(ClientCnxn.java:1110)
   [junit4]    > 	at __randomizedtesting.SeedInfo.seed([38BD49695C88CB2C]:0)Throwable #3: com.carrotsearch.randomizedtesting.ThreadLeakError: There are still zombie threads that couldn't be terminated:
   [junit4]    >    1) Thread[id=3438, name=TEST-CollectionsAPIDistributedZkTest.testDistribSearch-seed#[38BD49695C88CB2C]-SendThread(127.0.0.1:55083), state=TIMED_WAITING, group=TGRP-CollectionsAPIDistributedZkTest]
   [junit4]    >         at java.lang.Thread.sleep(Native Method)
   [junit4]    >         at org.apache.zookeeper.ClientCnxn$SendThread.run(ClientCnxn.java:994)
   [junit4]    > 	at __randomizedtesting.SeedInfo.seed([38BD49695C88CB2C]:0)
   [junit4] Completed on J1 in 115.51s, 1 test, 2 failures, 2 errors <<< FAILURES!

[...truncated 685 lines...]
BUILD FAILED
/mnt/ssd/jenkins/workspace/Lucene-Solr-trunk-Linux/build.xml:467: The following error occurred while executing this line:
/mnt/ssd/jenkins/workspace/Lucene-Solr-trunk-Linux/build.xml:447: The following error occurred while executing this line:
/mnt/ssd/jenkins/workspace/Lucene-Solr-trunk-Linux/build.xml:45: The following error occurred while executing this line:
/mnt/ssd/jenkins/workspace/Lucene-Solr-trunk-Linux/extra-targets.xml:37: The following error occurred while executing this line:
/mnt/ssd/jenkins/workspace/Lucene-Solr-trunk-Linux/solr/build.xml:189: The following error occurred while executing this line:
/mnt/ssd/jenkins/workspace/Lucene-Solr-trunk-Linux/solr/common-build.xml:496: The following error occurred while executing this line:
/mnt/ssd/jenkins/workspace/Lucene-Solr-trunk-Linux/lucene/common-build.xml:1296: The following error occurred while executing this line:
/mnt/ssd/jenkins/workspace/Lucene-Solr-trunk-Linux/lucene/common-build.xml:920: There were test failures: 400 suites, 1679 tests, 3 suite-level errors, 1 failure, 884 ignored (12 assumptions)

Total time: 56 minutes 25 seconds
Build step 'Invoke Ant' marked build as failure
Description set: Java: 32bit/jdk1.8.0_05 -client -XX:+UseSerialGC
Archiving artifacts
Recording test results
Email was triggered for: Failure
Sending email for trigger: Failure



Mime
View raw message