lucene-dev mailing list archives

Site index · List index
Message view « Date » · « Thread »
Top « Date » · « Thread »
From Policeman Jenkins Server <jenk...@thetaphi.de>
Subject [JENKINS] Lucene-Solr-4.x-Linux (32bit/jdk1.7.0_55) - Build # 10253 - Still Failing!
Date Sat, 24 May 2014 14:30:25 GMT
Build: http://jenkins.thetaphi.de/job/Lucene-Solr-4.x-Linux/10253/
Java: 32bit/jdk1.7.0_55 -server -XX:+UseConcMarkSweepGC

2 tests failed.
REGRESSION:  org.apache.solr.cloud.CollectionsAPIDistributedZkTest.testDistribSearch

Error Message:
collection already exists: addReplicaColl

Stack Trace:
org.apache.solr.client.solrj.impl.HttpSolrServer$RemoteSolrException: collection already exists: addReplicaColl
	at __randomizedtesting.SeedInfo.seed([A3935C9679054906:2275D28E0E5A293A]:0)
	at org.apache.solr.client.solrj.impl.HttpSolrServer.executeMethod(HttpSolrServer.java:554)
	at org.apache.solr.client.solrj.impl.HttpSolrServer.request(HttpSolrServer.java:210)
	at org.apache.solr.client.solrj.impl.HttpSolrServer.request(HttpSolrServer.java:206)
	at org.apache.solr.client.solrj.impl.LBHttpSolrServer.doRequest(LBHttpSolrServer.java:340)
	at org.apache.solr.client.solrj.impl.LBHttpSolrServer.request(LBHttpSolrServer.java:301)
	at org.apache.solr.client.solrj.impl.CloudSolrServer.request(CloudSolrServer.java:650)
	at org.apache.solr.cloud.AbstractFullDistribZkTestBase.createCollection(AbstractFullDistribZkTestBase.java:1513)
	at org.apache.solr.cloud.CollectionsAPIDistributedZkTest.createCollection(CollectionsAPIDistributedZkTest.java:1313)
	at org.apache.solr.cloud.CollectionsAPIDistributedZkTest.addReplicaTest(CollectionsAPIDistributedZkTest.java:1241)
	at org.apache.solr.cloud.CollectionsAPIDistributedZkTest.doTest(CollectionsAPIDistributedZkTest.java:212)
	at org.apache.solr.BaseDistributedSearchTestCase.testDistribSearch(BaseDistributedSearchTestCase.java:865)
	at sun.reflect.NativeMethodAccessorImpl.invoke0(Native Method)
	at sun.reflect.NativeMethodAccessorImpl.invoke(NativeMethodAccessorImpl.java:57)
	at sun.reflect.DelegatingMethodAccessorImpl.invoke(DelegatingMethodAccessorImpl.java:43)
	at java.lang.reflect.Method.invoke(Method.java:606)
	at com.carrotsearch.randomizedtesting.RandomizedRunner.invoke(RandomizedRunner.java:1618)
	at com.carrotsearch.randomizedtesting.RandomizedRunner$6.evaluate(RandomizedRunner.java:827)
	at com.carrotsearch.randomizedtesting.RandomizedRunner$7.evaluate(RandomizedRunner.java:863)
	at com.carrotsearch.randomizedtesting.RandomizedRunner$8.evaluate(RandomizedRunner.java:877)
	at com.carrotsearch.randomizedtesting.rules.SystemPropertiesRestoreRule$1.evaluate(SystemPropertiesRestoreRule.java:53)
	at org.apache.lucene.util.TestRuleSetupTeardownChained$1.evaluate(TestRuleSetupTeardownChained.java:50)
	at org.apache.lucene.util.TestRuleFieldCacheSanity$1.evaluate(TestRuleFieldCacheSanity.java:51)
	at org.apache.lucene.util.AbstractBeforeAfterRule$1.evaluate(AbstractBeforeAfterRule.java:46)
	at com.carrotsearch.randomizedtesting.rules.SystemPropertiesInvariantRule$1.evaluate(SystemPropertiesInvariantRule.java:55)
	at org.apache.lucene.util.TestRuleThreadAndTestName$1.evaluate(TestRuleThreadAndTestName.java:49)
	at org.apache.lucene.util.TestRuleIgnoreAfterMaxFailures$1.evaluate(TestRuleIgnoreAfterMaxFailures.java:65)
	at org.apache.lucene.util.TestRuleMarkFailure$1.evaluate(TestRuleMarkFailure.java:48)
	at com.carrotsearch.randomizedtesting.rules.StatementAdapter.evaluate(StatementAdapter.java:36)
	at com.carrotsearch.randomizedtesting.ThreadLeakControl$StatementRunner.run(ThreadLeakControl.java:360)
	at com.carrotsearch.randomizedtesting.ThreadLeakControl.forkTimeoutingTask(ThreadLeakControl.java:793)
	at com.carrotsearch.randomizedtesting.ThreadLeakControl$3.evaluate(ThreadLeakControl.java:453)
	at com.carrotsearch.randomizedtesting.RandomizedRunner.runSingleTest(RandomizedRunner.java:836)
	at com.carrotsearch.randomizedtesting.RandomizedRunner$3.evaluate(RandomizedRunner.java:738)
	at com.carrotsearch.randomizedtesting.RandomizedRunner$4.evaluate(RandomizedRunner.java:772)
	at com.carrotsearch.randomizedtesting.RandomizedRunner$5.evaluate(RandomizedRunner.java:783)
	at com.carrotsearch.randomizedtesting.rules.StatementAdapter.evaluate(StatementAdapter.java:36)
	at com.carrotsearch.randomizedtesting.rules.SystemPropertiesRestoreRule$1.evaluate(SystemPropertiesRestoreRule.java:53)
	at org.apache.lucene.util.AbstractBeforeAfterRule$1.evaluate(AbstractBeforeAfterRule.java:46)
	at org.apache.lucene.util.TestRuleStoreClassName$1.evaluate(TestRuleStoreClassName.java:42)
	at com.carrotsearch.randomizedtesting.rules.SystemPropertiesInvariantRule$1.evaluate(SystemPropertiesInvariantRule.java:55)
	at com.carrotsearch.randomizedtesting.rules.NoShadowingOrOverridesOnMethodsRule$1.evaluate(NoShadowingOrOverridesOnMethodsRule.java:39)
	at com.carrotsearch.randomizedtesting.rules.NoShadowingOrOverridesOnMethodsRule$1.evaluate(NoShadowingOrOverridesOnMethodsRule.java:39)
	at com.carrotsearch.randomizedtesting.rules.StatementAdapter.evaluate(StatementAdapter.java:36)
	at com.carrotsearch.randomizedtesting.rules.StatementAdapter.evaluate(StatementAdapter.java:36)
	at com.carrotsearch.randomizedtesting.rules.StatementAdapter.evaluate(StatementAdapter.java:36)
	at org.apache.lucene.util.TestRuleAssertionsRequired$1.evaluate(TestRuleAssertionsRequired.java:43)
	at org.apache.lucene.util.TestRuleMarkFailure$1.evaluate(TestRuleMarkFailure.java:48)
	at org.apache.lucene.util.TestRuleIgnoreAfterMaxFailures$1.evaluate(TestRuleIgnoreAfterMaxFailures.java:65)
	at org.apache.lucene.util.TestRuleIgnoreTestSuites$1.evaluate(TestRuleIgnoreTestSuites.java:55)
	at com.carrotsearch.randomizedtesting.rules.StatementAdapter.evaluate(StatementAdapter.java:36)
	at com.carrotsearch.randomizedtesting.ThreadLeakControl$StatementRunner.run(ThreadLeakControl.java:360)
	at java.lang.Thread.run(Thread.java:745)


REGRESSION:  org.apache.solr.cloud.HttpPartitionTest.testDistribSearch

Error Message:
createcollection the collection error [Watcher fired on path: null state: SyncConnected type None]

Stack Trace:
org.apache.solr.client.solrj.impl.HttpSolrServer$RemoteSolrException: createcollection the collection error [Watcher fired on path: null state: SyncConnected type None]
	at __randomizedtesting.SeedInfo.seed([A3935C9679054906:2275D28E0E5A293A]:0)
	at org.apache.solr.client.solrj.impl.HttpSolrServer.executeMethod(HttpSolrServer.java:554)
	at org.apache.solr.client.solrj.impl.HttpSolrServer.request(HttpSolrServer.java:210)
	at org.apache.solr.client.solrj.impl.HttpSolrServer.request(HttpSolrServer.java:206)
	at org.apache.solr.cloud.AbstractFullDistribZkTestBase.createCollection(AbstractFullDistribZkTestBase.java:1508)
	at org.apache.solr.cloud.AbstractFullDistribZkTestBase.createCollection(AbstractFullDistribZkTestBase.java:1468)
	at org.apache.solr.cloud.AbstractFullDistribZkTestBase.createCollection(AbstractFullDistribZkTestBase.java:1527)
	at org.apache.solr.cloud.AbstractFullDistribZkTestBase.createCollection(AbstractFullDistribZkTestBase.java:1464)
	at org.apache.solr.cloud.HttpPartitionTest.testRf3(HttpPartitionTest.java:223)
	at org.apache.solr.cloud.HttpPartitionTest.doTest(HttpPartitionTest.java:145)
	at org.apache.solr.BaseDistributedSearchTestCase.testDistribSearch(BaseDistributedSearchTestCase.java:865)
	at sun.reflect.GeneratedMethodAccessor47.invoke(Unknown Source)
	at sun.reflect.DelegatingMethodAccessorImpl.invoke(DelegatingMethodAccessorImpl.java:43)
	at java.lang.reflect.Method.invoke(Method.java:606)
	at com.carrotsearch.randomizedtesting.RandomizedRunner.invoke(RandomizedRunner.java:1618)
	at com.carrotsearch.randomizedtesting.RandomizedRunner$6.evaluate(RandomizedRunner.java:827)
	at com.carrotsearch.randomizedtesting.RandomizedRunner$7.evaluate(RandomizedRunner.java:863)
	at com.carrotsearch.randomizedtesting.RandomizedRunner$8.evaluate(RandomizedRunner.java:877)
	at com.carrotsearch.randomizedtesting.rules.SystemPropertiesRestoreRule$1.evaluate(SystemPropertiesRestoreRule.java:53)
	at org.apache.lucene.util.TestRuleSetupTeardownChained$1.evaluate(TestRuleSetupTeardownChained.java:50)
	at org.apache.lucene.util.TestRuleFieldCacheSanity$1.evaluate(TestRuleFieldCacheSanity.java:51)
	at org.apache.lucene.util.AbstractBeforeAfterRule$1.evaluate(AbstractBeforeAfterRule.java:46)
	at com.carrotsearch.randomizedtesting.rules.SystemPropertiesInvariantRule$1.evaluate(SystemPropertiesInvariantRule.java:55)
	at org.apache.lucene.util.TestRuleThreadAndTestName$1.evaluate(TestRuleThreadAndTestName.java:49)
	at org.apache.lucene.util.TestRuleIgnoreAfterMaxFailures$1.evaluate(TestRuleIgnoreAfterMaxFailures.java:65)
	at org.apache.lucene.util.TestRuleMarkFailure$1.evaluate(TestRuleMarkFailure.java:48)
	at com.carrotsearch.randomizedtesting.rules.StatementAdapter.evaluate(StatementAdapter.java:36)
	at com.carrotsearch.randomizedtesting.ThreadLeakControl$StatementRunner.run(ThreadLeakControl.java:360)
	at com.carrotsearch.randomizedtesting.ThreadLeakControl.forkTimeoutingTask(ThreadLeakControl.java:793)
	at com.carrotsearch.randomizedtesting.ThreadLeakControl$3.evaluate(ThreadLeakControl.java:453)
	at com.carrotsearch.randomizedtesting.RandomizedRunner.runSingleTest(RandomizedRunner.java:836)
	at com.carrotsearch.randomizedtesting.RandomizedRunner$3.evaluate(RandomizedRunner.java:738)
	at com.carrotsearch.randomizedtesting.RandomizedRunner$4.evaluate(RandomizedRunner.java:772)
	at com.carrotsearch.randomizedtesting.RandomizedRunner$5.evaluate(RandomizedRunner.java:783)
	at com.carrotsearch.randomizedtesting.rules.StatementAdapter.evaluate(StatementAdapter.java:36)
	at com.carrotsearch.randomizedtesting.rules.SystemPropertiesRestoreRule$1.evaluate(SystemPropertiesRestoreRule.java:53)
	at org.apache.lucene.util.AbstractBeforeAfterRule$1.evaluate(AbstractBeforeAfterRule.java:46)
	at org.apache.lucene.util.TestRuleStoreClassName$1.evaluate(TestRuleStoreClassName.java:42)
	at com.carrotsearch.randomizedtesting.rules.SystemPropertiesInvariantRule$1.evaluate(SystemPropertiesInvariantRule.java:55)
	at com.carrotsearch.randomizedtesting.rules.NoShadowingOrOverridesOnMethodsRule$1.evaluate(NoShadowingOrOverridesOnMethodsRule.java:39)
	at com.carrotsearch.randomizedtesting.rules.NoShadowingOrOverridesOnMethodsRule$1.evaluate(NoShadowingOrOverridesOnMethodsRule.java:39)
	at com.carrotsearch.randomizedtesting.rules.StatementAdapter.evaluate(StatementAdapter.java:36)
	at com.carrotsearch.randomizedtesting.rules.StatementAdapter.evaluate(StatementAdapter.java:36)
	at com.carrotsearch.randomizedtesting.rules.StatementAdapter.evaluate(StatementAdapter.java:36)
	at org.apache.lucene.util.TestRuleAssertionsRequired$1.evaluate(TestRuleAssertionsRequired.java:43)
	at org.apache.lucene.util.TestRuleMarkFailure$1.evaluate(TestRuleMarkFailure.java:48)
	at org.apache.lucene.util.TestRuleIgnoreAfterMaxFailures$1.evaluate(TestRuleIgnoreAfterMaxFailures.java:65)
	at org.apache.lucene.util.TestRuleIgnoreTestSuites$1.evaluate(TestRuleIgnoreTestSuites.java:55)
	at com.carrotsearch.randomizedtesting.rules.StatementAdapter.evaluate(StatementAdapter.java:36)
	at com.carrotsearch.randomizedtesting.ThreadLeakControl$StatementRunner.run(ThreadLeakControl.java:360)
	at java.lang.Thread.run(Thread.java:745)




Build Log:
[...truncated 11228 lines...]
   [junit4] Suite: org.apache.solr.cloud.CollectionsAPIDistributedZkTest
   [junit4]   2> Creating dataDir: /mnt/ssd/jenkins/workspace/Lucene-Solr-4.x-Linux/solr/build/solr-core/test/J1/./solr.cloud.CollectionsAPIDistributedZkTest-A3935C9679054906-001/init-core-data-001
   [junit4]   2> 828562 T3056 oas.SolrTestCaseJ4.buildSSLConfig Randomized ssl (true) and clientAuth (true)
   [junit4]   2> 828562 T3056 oas.BaseDistributedSearchTestCase.initHostContext Setting hostContext system property: /
   [junit4]   2> 828567 T3056 oas.SolrTestCaseJ4.setUp ###Starting testDistribSearch
   [junit4]   2> 828568 T3056 oasc.ZkTestServer.run STARTING ZK TEST SERVER
   [junit4]   1> client port:0.0.0.0/0.0.0.0:0
   [junit4]   2> 828568 T3057 oasc.ZkTestServer$ZKServerMain.runFromConfig Starting server
   [junit4]   2> 828668 T3056 oasc.ZkTestServer.run start zk server on port:60988
   [junit4]   2> 828669 T3056 oascc.ConnectionManager.waitForConnected Waiting for client to connect to ZooKeeper
   [junit4]   2> 828751 T3063 oascc.ConnectionManager.process Watcher org.apache.solr.common.cloud.ConnectionManager@1f9bb8d name:ZooKeeperConnection Watcher:127.0.0.1:60988 got event WatchedEvent state:SyncConnected type:None path:null path:null type:None
   [junit4]   2> 828751 T3056 oascc.ConnectionManager.waitForConnected Client is connected to ZooKeeper
   [junit4]   2> 828751 T3056 oascc.SolrZkClient.makePath makePath: /solr
   [junit4]   2> 828758 T3056 oascc.ConnectionManager.waitForConnected Waiting for client to connect to ZooKeeper
   [junit4]   2> 828761 T3065 oascc.ConnectionManager.process Watcher org.apache.solr.common.cloud.ConnectionManager@1672e9b name:ZooKeeperConnection Watcher:127.0.0.1:60988/solr got event WatchedEvent state:SyncConnected type:None path:null path:null type:None
   [junit4]   2> 828762 T3056 oascc.ConnectionManager.waitForConnected Client is connected to ZooKeeper
   [junit4]   2> 828762 T3056 oascc.SolrZkClient.makePath makePath: /collections/collection1
   [junit4]   2> 828764 T3056 oascc.SolrZkClient.makePath makePath: /collections/collection1/shards
   [junit4]   2> 828766 T3056 oascc.SolrZkClient.makePath makePath: /collections/control_collection
   [junit4]   2> 828767 T3056 oascc.SolrZkClient.makePath makePath: /collections/control_collection/shards
   [junit4]   2> 828769 T3056 oasc.AbstractZkTestCase.putConfig put /mnt/ssd/jenkins/workspace/Lucene-Solr-4.x-Linux/solr/core/src/test-files/solr/collection1/conf/solrconfig-tlog.xml to /configs/conf1/solrconfig.xml
   [junit4]   2> 828769 T3056 oascc.SolrZkClient.makePath makePath: /configs/conf1/solrconfig.xml
   [junit4]   2> 828800 T3056 oasc.AbstractZkTestCase.putConfig put /mnt/ssd/jenkins/workspace/Lucene-Solr-4.x-Linux/solr/core/src/test-files/solr/collection1/conf/schema.xml to /configs/conf1/schema.xml
   [junit4]   2> 828800 T3056 oascc.SolrZkClient.makePath makePath: /configs/conf1/schema.xml
   [junit4]   2> 828804 T3056 oasc.AbstractZkTestCase.putConfig put /mnt/ssd/jenkins/workspace/Lucene-Solr-4.x-Linux/solr/core/src/test-files/solr/collection1/conf/solrconfig.snippet.randomindexconfig.xml to /configs/conf1/solrconfig.snippet.randomindexconfig.xml
   [junit4]   2> 828805 T3056 oascc.SolrZkClient.makePath makePath: /configs/conf1/solrconfig.snippet.randomindexconfig.xml
   [junit4]   2> 828807 T3056 oasc.AbstractZkTestCase.putConfig put /mnt/ssd/jenkins/workspace/Lucene-Solr-4.x-Linux/solr/core/src/test-files/solr/collection1/conf/stopwords.txt to /configs/conf1/stopwords.txt
   [junit4]   2> 828807 T3056 oascc.SolrZkClient.makePath makePath: /configs/conf1/stopwords.txt
   [junit4]   2> 828809 T3056 oasc.AbstractZkTestCase.putConfig put /mnt/ssd/jenkins/workspace/Lucene-Solr-4.x-Linux/solr/core/src/test-files/solr/collection1/conf/protwords.txt to /configs/conf1/protwords.txt
   [junit4]   2> 828809 T3056 oascc.SolrZkClient.makePath makePath: /configs/conf1/protwords.txt
   [junit4]   2> 828811 T3056 oasc.AbstractZkTestCase.putConfig put /mnt/ssd/jenkins/workspace/Lucene-Solr-4.x-Linux/solr/core/src/test-files/solr/collection1/conf/currency.xml to /configs/conf1/currency.xml
   [junit4]   2> 828811 T3056 oascc.SolrZkClient.makePath makePath: /configs/conf1/currency.xml
   [junit4]   2> 828813 T3056 oasc.AbstractZkTestCase.putConfig put /mnt/ssd/jenkins/workspace/Lucene-Solr-4.x-Linux/solr/core/src/test-files/solr/collection1/conf/enumsConfig.xml to /configs/conf1/enumsConfig.xml
   [junit4]   2> 828814 T3056 oascc.SolrZkClient.makePath makePath: /configs/conf1/enumsConfig.xml
   [junit4]   2> 828816 T3056 oasc.AbstractZkTestCase.putConfig put /mnt/ssd/jenkins/workspace/Lucene-Solr-4.x-Linux/solr/core/src/test-files/solr/collection1/conf/open-exchange-rates.json to /configs/conf1/open-exchange-rates.json
   [junit4]   2> 828816 T3056 oascc.SolrZkClient.makePath makePath: /configs/conf1/open-exchange-rates.json
   [junit4]   2> 828818 T3056 oasc.AbstractZkTestCase.putConfig put /mnt/ssd/jenkins/workspace/Lucene-Solr-4.x-Linux/solr/core/src/test-files/solr/collection1/conf/mapping-ISOLatin1Accent.txt to /configs/conf1/mapping-ISOLatin1Accent.txt
   [junit4]   2> 828818 T3056 oascc.SolrZkClient.makePath makePath: /configs/conf1/mapping-ISOLatin1Accent.txt
   [junit4]   2> 828820 T3056 oasc.AbstractZkTestCase.putConfig put /mnt/ssd/jenkins/workspace/Lucene-Solr-4.x-Linux/solr/core/src/test-files/solr/collection1/conf/old_synonyms.txt to /configs/conf1/old_synonyms.txt
   [junit4]   2> 828820 T3056 oascc.SolrZkClient.makePath makePath: /configs/conf1/old_synonyms.txt
   [junit4]   2> 828822 T3056 oasc.AbstractZkTestCase.putConfig put /mnt/ssd/jenkins/workspace/Lucene-Solr-4.x-Linux/solr/core/src/test-files/solr/collection1/conf/synonyms.txt to /configs/conf1/synonyms.txt
   [junit4]   2> 828822 T3056 oascc.SolrZkClient.makePath makePath: /configs/conf1/synonyms.txt
   [junit4]   2> 828826 T3056 oascc.ConnectionManager.waitForConnected Waiting for client to connect to ZooKeeper
   [junit4]   2> 828827 T3067 oascc.ConnectionManager.process Watcher org.apache.solr.common.cloud.ConnectionManager@74a96d name:ZooKeeperConnection Watcher:127.0.0.1:60988/solr got event WatchedEvent state:SyncConnected type:None path:null path:null type:None
   [junit4]   2> 828827 T3056 oascc.ConnectionManager.waitForConnected Client is connected to ZooKeeper
   [junit4]   2> Using new style solr.xml
   [junit4]   2> 829052 T3056 oejs.Server.doStart jetty-8.1.10.v20130312
   [junit4]   2> 829056 T3056 oejus.SslContextFactory.doStart Enabled Protocols [SSLv2Hello, SSLv3, TLSv1, TLSv1.1, TLSv1.2] of [SSLv2Hello, SSLv3, TLSv1, TLSv1.1, TLSv1.2]
   [junit4]   2> 829059 T3056 oejs.AbstractConnector.doStart Started SslSelectChannelConnector@127.0.0.1:55097
   [junit4]   2> 829061 T3056 oass.SolrDispatchFilter.init SolrDispatchFilter.init()
   [junit4]   2> 829061 T3056 oasc.SolrResourceLoader.locateSolrHome JNDI not configured for solr (NoInitialContextEx)
   [junit4]   2> 829062 T3056 oasc.SolrResourceLoader.locateSolrHome using system property solr.solr.home: ./solr.cloud.CollectionsAPIDistributedZkTest-A3935C9679054906-001/tempDir-002
   [junit4]   2> 829062 T3056 oasc.SolrResourceLoader.<init> new SolrResourceLoader for directory: './solr.cloud.CollectionsAPIDistributedZkTest-A3935C9679054906-001/tempDir-002/'
   [junit4]   2> 829076 T3056 oasc.ConfigSolr.fromFile Loading container configuration from /mnt/ssd/jenkins/workspace/Lucene-Solr-4.x-Linux/solr/build/solr-core/test/J1/./solr.cloud.CollectionsAPIDistributedZkTest-A3935C9679054906-001/tempDir-002/solr.xml
   [junit4]   2> 829123 T3056 oasc.CorePropertiesLocator.<init> Config-defined core root directory: /mnt/ssd/jenkins/workspace/Lucene-Solr-4.x-Linux/solr/build/solr-core/test/J1/./solr.cloud.CollectionsAPIDistributedZkTest-A3935C9679054906-001/tempDir-002
   [junit4]   2> 829124 T3056 oasc.CoreContainer.<init> New CoreContainer 32640741
   [junit4]   2> 829124 T3056 oasc.CoreContainer.load Loading cores into CoreContainer [instanceDir=./solr.cloud.CollectionsAPIDistributedZkTest-A3935C9679054906-001/tempDir-002/]
   [junit4]   2> 829125 T3056 oashc.HttpShardHandlerFactory.getParameter Setting socketTimeout to: 90000
   [junit4]   2> 829126 T3056 oashc.HttpShardHandlerFactory.getParameter Setting urlScheme to: 
   [junit4]   2> 829126 T3056 oashc.HttpShardHandlerFactory.getParameter Setting connTimeout to: 15000
   [junit4]   2> 829126 T3056 oashc.HttpShardHandlerFactory.getParameter Setting maxConnectionsPerHost to: 20
   [junit4]   2> 829126 T3056 oashc.HttpShardHandlerFactory.getParameter Setting corePoolSize to: 0
   [junit4]   2> 829127 T3056 oashc.HttpShardHandlerFactory.getParameter Setting maximumPoolSize to: 2147483647
   [junit4]   2> 829127 T3056 oashc.HttpShardHandlerFactory.getParameter Setting maxThreadIdleTime to: 5
   [junit4]   2> 829127 T3056 oashc.HttpShardHandlerFactory.getParameter Setting sizeOfQueue to: -1
   [junit4]   2> 829128 T3056 oashc.HttpShardHandlerFactory.getParameter Setting fairnessPolicy to: false
   [junit4]   2> 829130 T3056 oasl.LogWatcher.createWatcher SLF4J impl is org.slf4j.impl.Log4jLoggerFactory
   [junit4]   2> 829130 T3056 oasl.LogWatcher.newRegisteredLogWatcher Registering Log Listener [Log4j (org.slf4j.impl.Log4jLoggerFactory)]
   [junit4]   2> 829130 T3056 oasc.CoreContainer.load Host Name: 127.0.0.1
   [junit4]   2> 829130 T3056 oasc.ZkContainer.initZooKeeper Zookeeper client=127.0.0.1:60988/solr
   [junit4]   2> 829131 T3056 oasc.ZkController.checkChrootPath zkHost includes chroot
   [junit4]   2> 829131 T3056 oascc.ConnectionManager.waitForConnected Waiting for client to connect to ZooKeeper
   [junit4]   2> 829134 T3078 oascc.ConnectionManager.process Watcher org.apache.solr.common.cloud.ConnectionManager@1fde87a name:ZooKeeperConnection Watcher:127.0.0.1:60988 got event WatchedEvent state:SyncConnected type:None path:null path:null type:None
   [junit4]   2> 829134 T3056 oascc.ConnectionManager.waitForConnected Client is connected to ZooKeeper
   [junit4]   2> 829136 T3056 oascc.ConnectionManager.waitForConnected Waiting for client to connect to ZooKeeper
   [junit4]   2> 829137 T3080 oascc.ConnectionManager.process Watcher org.apache.solr.common.cloud.ConnectionManager@1ce9b33 name:ZooKeeperConnection Watcher:127.0.0.1:60988/solr got event WatchedEvent state:SyncConnected type:None path:null path:null type:None
   [junit4]   2> 829138 T3056 oascc.ConnectionManager.waitForConnected Client is connected to ZooKeeper
   [junit4]   2> 829139 T3056 oascc.SolrZkClient.makePath makePath: /overseer/queue
   [junit4]   2> 829141 T3056 oascc.SolrZkClient.makePath makePath: /overseer/collection-queue-work
   [junit4]   2> 829143 T3056 oascc.SolrZkClient.makePath makePath: /overseer/collection-map-running
   [junit4]   2> 829145 T3056 oascc.SolrZkClient.makePath makePath: /overseer/collection-map-completed
   [junit4]   2> 829212 T3056 oascc.SolrZkClient.makePath makePath: /overseer/collection-map-failure
   [junit4]   2> 829214 T3056 oascc.SolrZkClient.makePath makePath: /live_nodes
   [junit4]   2> 829216 T3056 oasc.ZkController.createEphemeralLiveNode Register node as live in ZooKeeper:/live_nodes/127.0.0.1:55097_
   [junit4]   2> 829216 T3056 oascc.SolrZkClient.makePath makePath: /live_nodes/127.0.0.1:55097_
   [junit4]   2> 829218 T3056 oascc.SolrZkClient.makePath makePath: /overseer_elect
   [junit4]   2> 829220 T3056 oascc.SolrZkClient.makePath makePath: /overseer_elect/election
   [junit4]   2> 829222 T3056 oasc.OverseerElectionContext.runLeaderProcess I am going to be the leader 127.0.0.1:55097_
   [junit4]   2> 829222 T3056 oascc.SolrZkClient.makePath makePath: /overseer_elect/leader
   [junit4]   2> 829224 T3056 oasc.Overseer.start Overseer (id=91812059632435204-127.0.0.1:55097_-n_0000000000) starting
   [junit4]   2> 829226 T3056 oascc.SolrZkClient.makePath makePath: /overseer/queue-work
   [junit4]   2> 829236 T3082 oasc.OverseerCollectionProcessor.run Process current queue of collection creations
   [junit4]   2> 829236 T3056 oascc.SolrZkClient.makePath makePath: /clusterstate.json
   [junit4]   2> 829238 T3056 oascc.SolrZkClient.makePath makePath: /aliases.json
   [junit4]   2> 829240 T3056 oascc.ZkStateReader.createClusterStateWatchersAndUpdate Updating cluster state from ZooKeeper... 
   [junit4]   2> 829241 T3081 oasc.Overseer$ClusterStateUpdater.run Starting to work on the main queue
   [junit4]   2> 829243 T3056 oasc.CorePropertiesLocator.discover Looking for core definitions underneath /mnt/ssd/jenkins/workspace/Lucene-Solr-4.x-Linux/solr/build/solr-core/test/J1/./solr.cloud.CollectionsAPIDistributedZkTest-A3935C9679054906-001/tempDir-002
   [junit4]   2> 829247 T3056 oasc.CorePropertiesLocator.discoverUnder Found core conf in /mnt/ssd/jenkins/workspace/Lucene-Solr-4.x-Linux/solr/build/solr-core/test/J1/./solr.cloud.CollectionsAPIDistributedZkTest-A3935C9679054906-001/tempDir-002/conf/
   [junit4]   2> 829350 T3056 oasc.CorePropertiesLocator.discover Found 1 core definitions
   [junit4]   2> 829351 T3056 oass.SolrDispatchFilter.init user.dir=/mnt/ssd/jenkins/workspace/Lucene-Solr-4.x-Linux/solr/build/solr-core/test/J1
   [junit4]   2> 829352 T3056 oass.SolrDispatchFilter.init SolrDispatchFilter.init() done
   [junit4]   2> 829354 T3056 oascc.ConnectionManager.waitForConnected Waiting for client to connect to ZooKeeper
   [junit4]   2> 829356 T3085 oascc.ConnectionManager.process Watcher org.apache.solr.common.cloud.ConnectionManager@7cea54 name:ZooKeeperConnection Watcher:127.0.0.1:60988/solr got event WatchedEvent state:SyncConnected type:None path:null path:null type:None
   [junit4]   2> 829356 T3056 oascc.ConnectionManager.waitForConnected Client is connected to ZooKeeper
   [junit4]   2> 829357 T3056 oascc.ZkStateReader.createClusterStateWatchersAndUpdate Updating cluster state from ZooKeeper... 
   [junit4]   2> 829359 T3056 oasc.ChaosMonkey.monkeyLog monkey: init - expire sessions:false cause connection loss:false
   [junit4]   2> 829621 T3056 oasc.AbstractFullDistribZkTestBase.createJettys create jetty 1
   [junit4]   2> 829622 T3056 oejs.Server.doStart jetty-8.1.10.v20130312
   [junit4]   2> 829624 T3056 oejus.SslContextFactory.doStart Enabled Protocols [SSLv2Hello, SSLv3, TLSv1, TLSv1.1, TLSv1.2] of [SSLv2Hello, SSLv3, TLSv1, TLSv1.1, TLSv1.2]
   [junit4]   2> 829626 T3056 oejs.AbstractConnector.doStart Started SslSelectChannelConnector@127.0.0.1:40832
   [junit4]   2> 829627 T3056 oass.SolrDispatchFilter.init SolrDispatchFilter.init()
   [junit4]   2> 829628 T3056 oasc.SolrResourceLoader.locateSolrHome JNDI not configured for solr (NoInitialContextEx)
   [junit4]   2> 829628 T3056 oasc.SolrResourceLoader.locateSolrHome using system property solr.solr.home: ../../../../../../../../../../mnt/ssd/jenkins/workspace/Lucene-Solr-4.x-Linux/solr/build/solr-core/test/J1/./solr.cloud.CollectionsAPIDistributedZkTest-A3935C9679054906-001/tempDir-003
   [junit4]   2> 829628 T3056 oasc.SolrResourceLoader.<init> new SolrResourceLoader for directory: '../../../../../../../../../../mnt/ssd/jenkins/workspace/Lucene-Solr-4.x-Linux/solr/build/solr-core/test/J1/./solr.cloud.CollectionsAPIDistributedZkTest-A3935C9679054906-001/tempDir-003/'
   [junit4]   2> 829641 T3056 oasc.ConfigSolr.fromFile Loading container configuration from /mnt/ssd/jenkins/workspace/Lucene-Solr-4.x-Linux/solr/build/solr-core/test/J1/../../../../../../../../../../mnt/ssd/jenkins/workspace/Lucene-Solr-4.x-Linux/solr/build/solr-core/test/J1/./solr.cloud.CollectionsAPIDistributedZkTest-A3935C9679054906-001/tempDir-003/solr.xml
   [junit4]   2> 829676 T3056 oasc.CorePropertiesLocator.<init> Config-defined core root directory: /mnt/ssd/jenkins/workspace/Lucene-Solr-4.x-Linux/solr/build/solr-core/test/J1/../../../../../../../../../../mnt/ssd/jenkins/workspace/Lucene-Solr-4.x-Linux/solr/build/solr-core/test/J1/./solr.cloud.CollectionsAPIDistributedZkTest-A3935C9679054906-001/tempDir-003
   [junit4]   2> 829677 T3056 oasc.CoreContainer.<init> New CoreContainer 8105149
   [junit4]   2> 829677 T3056 oasc.CoreContainer.load Loading cores into CoreContainer [instanceDir=../../../../../../../../../../mnt/ssd/jenkins/workspace/Lucene-Solr-4.x-Linux/solr/build/solr-core/test/J1/./solr.cloud.CollectionsAPIDistributedZkTest-A3935C9679054906-001/tempDir-003/]
   [junit4]   2> 829678 T3056 oashc.HttpShardHandlerFactory.getParameter Setting socketTimeout to: 90000
   [junit4]   2> 829678 T3056 oashc.HttpShardHandlerFactory.getParameter Setting urlScheme to: 
   [junit4]   2> 829679 T3056 oashc.HttpShardHandlerFactory.getParameter Setting connTimeout to: 15000
   [junit4]   2> 829679 T3056 oashc.HttpShardHandlerFactory.getParameter Setting maxConnectionsPerHost to: 20
   [junit4]   2> 829679 T3056 oashc.HttpShardHandlerFactory.getParameter Setting corePoolSize to: 0
   [junit4]   2> 829679 T3056 oashc.HttpShardHandlerFactory.getParameter Setting maximumPoolSize to: 2147483647
   [junit4]   2> 829680 T3056 oashc.HttpShardHandlerFactory.getParameter Setting maxThreadIdleTime to: 5
   [junit4]   2> 829680 T3056 oashc.HttpShardHandlerFactory.getParameter Setting sizeOfQueue to: -1
   [junit4]   2> 829680 T3056 oashc.HttpShardHandlerFactory.getParameter Setting fairnessPolicy to: false
   [junit4]   2> 829682 T3056 oasl.LogWatcher.createWatcher SLF4J impl is org.slf4j.impl.Log4jLoggerFactory
   [junit4]   2> 829683 T3056 oasl.LogWatcher.newRegisteredLogWatcher Registering Log Listener [Log4j (org.slf4j.impl.Log4jLoggerFactory)]
   [junit4]   2> 829683 T3056 oasc.CoreContainer.load Host Name: 127.0.0.1
   [junit4]   2> 829683 T3056 oasc.ZkContainer.initZooKeeper Zookeeper client=127.0.0.1:60988/solr
   [junit4]   2> 829683 T3056 oasc.ZkController.checkChrootPath zkHost includes chroot
   [junit4]   2> 829684 T3056 oascc.ConnectionManager.waitForConnected Waiting for client to connect to ZooKeeper
   [junit4]   2> 829685 T3096 oascc.ConnectionManager.process Watcher org.apache.solr.common.cloud.ConnectionManager@13ae01 name:ZooKeeperConnection Watcher:127.0.0.1:60988 got event WatchedEvent state:SyncConnected type:None path:null path:null type:None
   [junit4]   2> 829686 T3056 oascc.ConnectionManager.waitForConnected Client is connected to ZooKeeper
   [junit4]   2> 829688 T3056 oascc.ConnectionManager.waitForConnected Waiting for client to connect to ZooKeeper
   [junit4]   2> 829689 T3098 oascc.ConnectionManager.process Watcher org.apache.solr.common.cloud.ConnectionManager@21506e name:ZooKeeperConnection Watcher:127.0.0.1:60988/solr got event WatchedEvent state:SyncConnected type:None path:null path:null type:None
   [junit4]   2> 829689 T3056 oascc.ConnectionManager.waitForConnected Client is connected to ZooKeeper
   [junit4]   2> 829694 T3056 oascc.ZkStateReader.createClusterStateWatchersAndUpdate Updating cluster state from ZooKeeper... 
   [junit4]   2> 830696 T3056 oasc.ZkController.createEphemeralLiveNode Register node as live in ZooKeeper:/live_nodes/127.0.0.1:40832_
   [junit4]   2> 830697 T3056 oascc.SolrZkClient.makePath makePath: /live_nodes/127.0.0.1:40832_
   [junit4]   2> 830700 T3080 oascc.ZkStateReader$3.process Updating live nodes... (2)
   [junit4]   2> 830700 T3098 oascc.ZkStateReader$3.process Updating live nodes... (2)
   [junit4]   2> 830700 T3085 oascc.ZkStateReader$3.process Updating live nodes... (2)
   [junit4]   2> 830703 T3056 oasc.CorePropertiesLocator.discover Looking for core definitions underneath /mnt/ssd/jenkins/workspace/Lucene-Solr-4.x-Linux/solr/build/solr-core/test/J1/../../../../../../../../../../mnt/ssd/jenkins/workspace/Lucene-Solr-4.x-Linux/solr/build/solr-core/test/J1/./solr.cloud.CollectionsAPIDistributedZkTest-A3935C9679054906-001/tempDir-003
   [junit4]   2> 830709 T3056 oasc.CorePropertiesLocator.discoverUnder Found core conf in /mnt/ssd/jenkins/workspace/Lucene-Solr-4.x-Linux/solr/build/solr-core/test/J1/../../../../../../../../../../mnt/ssd/jenkins/workspace/Lucene-Solr-4.x-Linux/solr/build/solr-core/test/J1/./solr.cloud.CollectionsAPIDistributedZkTest-A3935C9679054906-001/tempDir-003/conf/
   [junit4]   2> 830841 T3056 oasc.CorePropertiesLocator.discover Found 1 core definitions
   [junit4]   2> 830843 T3056 oass.SolrDispatchFilter.init user.dir=/mnt/ssd/jenkins/workspace/Lucene-Solr-4.x-Linux/solr/build/solr-core/test/J1
   [junit4]   2> 830843 T3056 oass.SolrDispatchFilter.init SolrDispatchFilter.init() done
   [junit4]   2> 831069 T3056 oasc.AbstractFullDistribZkTestBase.createJettys create jetty 2
   [junit4]   2> 831070 T3056 oejs.Server.doStart jetty-8.1.10.v20130312
   [junit4]   2> 831072 T3056 oejus.SslContextFactory.doStart Enabled Protocols [SSLv2Hello, SSLv3, TLSv1, TLSv1.1, TLSv1.2] of [SSLv2Hello, SSLv3, TLSv1, TLSv1.1, TLSv1.2]
   [junit4]   2> 831073 T3056 oejs.AbstractConnector.doStart Started SslSelectChannelConnector@127.0.0.1:36981
   [junit4]   2> 831075 T3056 oass.SolrDispatchFilter.init SolrDispatchFilter.init()
   [junit4]   2> 831075 T3056 oasc.SolrResourceLoader.locateSolrHome JNDI not configured for solr (NoInitialContextEx)
   [junit4]   2> 831076 T3056 oasc.SolrResourceLoader.locateSolrHome using system property solr.solr.home: ./solr.cloud.CollectionsAPIDistributedZkTest-A3935C9679054906-001/tempDir-004
   [junit4]   2> 831076 T3056 oasc.SolrResourceLoader.<init> new SolrResourceLoader for directory: './solr.cloud.CollectionsAPIDistributedZkTest-A3935C9679054906-001/tempDir-004/'
   [junit4]   2> 831089 T3056 oasc.ConfigSolr.fromFile Loading container configuration from /mnt/ssd/jenkins/workspace/Lucene-Solr-4.x-Linux/solr/build/solr-core/test/J1/./solr.cloud.CollectionsAPIDistributedZkTest-A3935C9679054906-001/tempDir-004/solr.xml
   [junit4]   2> 831124 T3056 oasc.CorePropertiesLocator.<init> Config-defined core root directory: /mnt/ssd/jenkins/workspace/Lucene-Solr-4.x-Linux/solr/build/solr-core/test/J1/./solr.cloud.CollectionsAPIDistributedZkTest-A3935C9679054906-001/tempDir-004
   [junit4]   2> 831124 T3056 oasc.CoreContainer.<init> New CoreContainer 24440702
   [junit4]   2> 831125 T3056 oasc.CoreContainer.load Loading cores into CoreContainer [instanceDir=./solr.cloud.CollectionsAPIDistributedZkTest-A3935C9679054906-001/tempDir-004/]
   [junit4]   2> 831126 T3056 oashc.HttpShardHandlerFactory.getParameter Setting socketTimeout to: 90000
   [junit4]   2> 831126 T3056 oashc.HttpShardHandlerFactory.getParameter Setting urlScheme to: 
   [junit4]   2> 831126 T3056 oashc.HttpShardHandlerFactory.getParameter Setting connTimeout to: 15000
   [junit4]   2> 831127 T3056 oashc.HttpShardHandlerFactory.getParameter Setting maxConnectionsPerHost to: 20
   [junit4]   2> 831127 T3056 oashc.HttpShardHandlerFactory.getParameter Setting corePoolSize to: 0
   [junit4]   2> 831127 T3056 oashc.HttpShardHandlerFactory.getParameter Setting maximumPoolSize to: 2147483647
   [junit4]   2> 831127 T3056 oashc.HttpShardHandlerFactory.getParameter Setting maxThreadIdleTime to: 5
   [junit4]   2> 831128 T3056 oashc.HttpShardHandlerFactory.getParameter Setting sizeOfQueue to: -1
   [junit4]   2> 831128 T3056 oashc.HttpShardHandlerFactory.getParameter Setting fairnessPolicy to: false
   [junit4]   2> 831130 T3056 oasl.LogWatcher.createWatcher SLF4J impl is org.slf4j.impl.Log4jLoggerFactory
   [junit4]   2> 831130 T3056 oasl.LogWatcher.newRegisteredLogWatcher Registering Log Listener [Log4j (org.slf4j.impl.Log4jLoggerFactory)]
   [junit4]   2> 831131 T3056 oasc.CoreContainer.load Host Name: 127.0.0.1
   [junit4]   2> 831131 T3056 oasc.ZkContainer.initZooKeeper Zookeeper client=127.0.0.1:60988/solr
   [junit4]   2> 831131 T3056 oasc.ZkController.checkChrootPath zkHost includes chroot
   [junit4]   2> 831132 T3056 oascc.ConnectionManager.waitForConnected Waiting for client to connect to ZooKeeper
   [junit4]   2> 831133 T3110 oascc.ConnectionManager.process Watcher org.apache.solr.common.cloud.ConnectionManager@19a50b5 name:ZooKeeperConnection Watcher:127.0.0.1:60988 got event WatchedEvent state:SyncConnected type:None path:null path:null type:None
   [junit4]   2> 831133 T3056 oascc.ConnectionManager.waitForConnected Client is connected to ZooKeeper
   [junit4]   2> 831135 T3056 oascc.ConnectionManager.waitForConnected Waiting for client to connect to ZooKeeper
   [junit4]   2> 831136 T3112 oascc.ConnectionManager.process Watcher org.apache.solr.common.cloud.ConnectionManager@ba328a name:ZooKeeperConnection Watcher:127.0.0.1:60988/solr got event WatchedEvent state:SyncConnected type:None path:null path:null type:None
   [junit4]   2> 831136 T3056 oascc.ConnectionManager.waitForConnected Client is connected to ZooKeeper
   [junit4]   2> 831152 T3056 oascc.ZkStateReader.createClusterStateWatchersAndUpdate Updating cluster state from ZooKeeper... 
   [junit4]   2> 832154 T3056 oasc.ZkController.createEphemeralLiveNode Register node as live in ZooKeeper:/live_nodes/127.0.0.1:36981_
   [junit4]   2> 832156 T3056 oascc.SolrZkClient.makePath makePath: /live_nodes/127.0.0.1:36981_
   [junit4]   2> 832159 T3080 oascc.ZkStateReader$3.process Updating live nodes... (3)
   [junit4]   2> 832159 T3098 oascc.ZkStateReader$3.process Updating live nodes... (3)
   [junit4]   2> 832159 T3112 oascc.ZkStateReader$3.process Updating live nodes... (3)
   [junit4]   2> 832159 T3085 oascc.ZkStateReader$3.process Updating live nodes... (3)
   [junit4]   2> 832163 T3056 oasc.CorePropertiesLocator.discover Looking for core definitions underneath /mnt/ssd/jenkins/workspace/Lucene-Solr-4.x-Linux/solr/build/solr-core/test/J1/./solr.cloud.CollectionsAPIDistributedZkTest-A3935C9679054906-001/tempDir-004
   [junit4]   2> 832168 T3056 oasc.CorePropertiesLocator.discoverUnder Found core conf in /mnt/ssd/jenkins/workspace/Lucene-Solr-4.x-Linux/solr/build/solr-core/test/J1/./solr.cloud.CollectionsAPIDistributedZkTest-A3935C9679054906-001/tempDir-004/conf/
   [junit4]   2> 832259 T3056 oasc.CorePropertiesLocator.discover Found 1 core definitions
   [junit4]   2> 832260 T3056 oass.SolrDispatchFilter.init user.dir=/mnt/ssd/jenkins/workspace/Lucene-Solr-4.x-Linux/solr/build/solr-core/test/J1
   [junit4]   2> 832261 T3056 oass.SolrDispatchFilter.init SolrDispatchFilter.init() done
   [junit4]   2> 832493 T3056 oasc.AbstractFullDistribZkTestBase.createJettys create jetty 3
   [junit4]   2> 832494 T3056 oejs.Server.doStart jetty-8.1.10.v20130312
   [junit4]   2> 832497 T3056 oejus.SslContextFactory.doStart Enabled Protocols [SSLv2Hello, SSLv3, TLSv1, TLSv1.1, TLSv1.2] of [SSLv2Hello, SSLv3, TLSv1, TLSv1.1, TLSv1.2]
   [junit4]   2> 832498 T3056 oejs.AbstractConnector.doStart Started SslSelectChannelConnector@127.0.0.1:51535
   [junit4]   2> 832500 T3056 oass.SolrDispatchFilter.init SolrDispatchFilter.init()
   [junit4]   2> 832500 T3056 oasc.SolrResourceLoader.locateSolrHome JNDI not configured for solr (NoInitialContextEx)
   [junit4]   2> 832501 T3056 oasc.SolrResourceLoader.locateSolrHome using system property solr.solr.home: ./solr.cloud.CollectionsAPIDistributedZkTest-A3935C9679054906-001/tempDir-005
   [junit4]   2> 832501 T3056 oasc.SolrResourceLoader.<init> new SolrResourceLoader for directory: './solr.cloud.CollectionsAPIDistributedZkTest-A3935C9679054906-001/tempDir-005/'
   [junit4]   2> 832516 T3056 oasc.ConfigSolr.fromFile Loading container configuration from /mnt/ssd/jenkins/workspace/Lucene-Solr-4.x-Linux/solr/build/solr-core/test/J1/./solr.cloud.CollectionsAPIDistributedZkTest-A3935C9679054906-001/tempDir-005/solr.xml
   [junit4]   2> 832556 T3056 oasc.CorePropertiesLocator.<init> Config-defined core root directory: /mnt/ssd/jenkins/workspace/Lucene-Solr-4.x-Linux/solr/build/solr-core/test/J1/./solr.cloud.CollectionsAPIDistributedZkTest-A3935C9679054906-001/tempDir-005
   [junit4]   2> 832557 T3056 oasc.CoreContainer.<init> New CoreContainer 17698989
   [junit4]   2> 832557 T3056 oasc.CoreContainer.load Loading cores into CoreContainer [instanceDir=./solr.cloud.CollectionsAPIDistributedZkTest-A3935C9679054906-001/tempDir-005/]
   [junit4]   2> 832558 T3056 oashc.HttpShardHandlerFactory.getParameter Setting socketTimeout to: 90000
   [junit4]   2> 832559 T3056 oashc.HttpShardHandlerFactory.getParameter Setting urlScheme to: 
   [junit4]   2> 832559 T3056 oashc.HttpShardHandlerFactory.getParameter Setting connTimeout to: 15000
   [junit4]   2> 832559 T3056 oashc.HttpShardHandlerFactory.getParameter Setting maxConnectionsPerHost to: 20
   [junit4]   2> 832560 T3056 oashc.HttpShardHandlerFactory.getParameter Setting corePoolSize to: 0
   [junit4]   2> 832560 T3056 oashc.HttpShardHandlerFactory.getParameter Setting maximumPoolSize to: 2147483647
   [junit4]   2> 832560 T3056 oashc.HttpShardHandlerFactory.getParameter Setting maxThreadIdleTime to: 5
   [junit4]   2> 832561 T3056 oashc.HttpShardHandlerFactory.getParameter Setting sizeOfQueue to: -1
   [junit4]   2> 832561 T3056 oashc.HttpShardHandlerFactory.getParameter Setting fairnessPolicy to: false
   [junit4]   2> 832563 T3056 oasl.LogWatcher.createWatcher SLF4J impl is org.slf4j.impl.Log4jLoggerFactory
   [junit4]   2> 832563 T3056 oasl.LogWatcher.newRegisteredLogWatcher Registering Log Listener [Log4j (org.slf4j.impl.Log4jLoggerFactory)]
   [junit4]   2> 832564 T3056 oasc.CoreContainer.load Host Name: 127.0.0.1
   [junit4]   2> 832564 T3056 oasc.ZkContainer.initZooKeeper Zookeeper client=127.0.0.1:60988/solr
   [junit4]   2> 832564 T3056 oasc.ZkController.checkChrootPath zkHost includes chroot
   [junit4]   2> 832565 T3056 oascc.ConnectionManager.waitForConnected Waiting for client to connect to ZooKeeper
   [junit4]   2> 832567 T3124 oascc.ConnectionManager.process Watcher org.apache.solr.common.cloud.ConnectionManager@1002013 name:ZooKeeperConnection Watcher:127.0.0.1:60988 got event WatchedEvent state:SyncConnected type:None path:null path:null type:None
   [junit4]   2> 832567 T3056 oascc.ConnectionManager.waitForConnected Client is connected to ZooKeeper
   [junit4]   2> 832569 T3056 oascc.ConnectionManager.waitForConnected Waiting for client to connect to ZooKeeper
   [junit4]   2> 832570 T3126 oascc.ConnectionManager.process Watcher org.apache.solr.common.cloud.ConnectionManager@1fadbab name:ZooKeeperConnection Watcher:127.0.0.1:60988/solr got event WatchedEvent state:SyncConnected type:None path:null path:null type:None
   [junit4]   2> 832570 T3056 oascc.ConnectionManager.waitForConnected Client is connected to ZooKeeper
   [junit4]   2> 832575 T3056 oascc.ZkStateReader.createClusterStateWatchersAndUpdate Updating cluster state from ZooKeeper... 
   [junit4]   2> 833577 T3056 oasc.ZkController.createEphemeralLiveNode Register node as live in ZooKeeper:/live_nodes/127.0.0.1:51535_
   [junit4]   2> 833580 T3056 oascc.SolrZkClient.makePath makePath: /live_nodes/127.0.0.1:51535_
   [junit4]   2> 833584 T3085 oascc.ZkStateReader$3.process Updating live nodes... (4)
   [junit4]   2> 833584 T3080 oascc.ZkStateReader$3.process Updating live nodes... (4)
   [junit4]   2> 833584 T3098 oascc.ZkStateReader$3.process Updating live nodes... (4)
   [junit4]   2> 833584 T3112 oascc.ZkStateReader$3.process Updating live nodes... (4)
   [junit4]   2> 833584 T3126 oascc.ZkStateReader$3.process Updating live nodes... (4)
   [junit4]   2> 833596 T3056 oasc.CorePropertiesLocator.discover Looking for core definitions underneath /mnt/ssd/jenkins/workspace/Lucene-Solr-4.x-Linux/solr/build/solr-core/test/J1/./solr.cloud.CollectionsAPIDistributedZkTest-A3935C9679054906-001/tempDir-005
   [junit4]   2> 833601 T3056 oasc.CorePropertiesLocator.discoverUnder Found core conf in /mnt/ssd/jenkins/workspace/Lucene-Solr-4.x-Linux/solr/build/solr-core/test/J1/./solr.cloud.CollectionsAPIDistributedZkTest-A3935C9679054906-001/tempDir-005/conf/
   [junit4]   2> 833695 T3056 oasc.CorePropertiesLocator.discover Found 1 core definitions
   [junit4]   2> 833696 T3056 oass.SolrDispatchFilter.init user.dir=/mnt/ssd/jenkins/workspace/Lucene-Solr-4.x-Linux/solr/build/solr-core/test/J1
   [junit4]   2> 833696 T3056 oass.SolrDispatchFilter.init SolrDispatchFilter.init() done
   [junit4]   2> 833951 T3056 oasc.AbstractFullDistribZkTestBase.createJettys create jetty 4
   [junit4]   2> 833952 T3056 oejs.Server.doStart jetty-8.1.10.v20130312
   [junit4]   2> 833955 T3056 oejus.SslContextFactory.doStart Enabled Protocols [SSLv2Hello, SSLv3, TLSv1, TLSv1.1, TLSv1.2] of [SSLv2Hello, SSLv3, TLSv1, TLSv1.1, TLSv1.2]
   [junit4]   2> 833956 T3056 oejs.AbstractConnector.doStart Started SslSelectChannelConnector@127.0.0.1:37295
   [junit4]   2> 833958 T3056 oass.SolrDispatchFilter.init SolrDispatchFilter.init()
   [junit4]   2> 833958 T3056 oasc.SolrResourceLoader.locateSolrHome JNDI not configured for solr (NoInitialContextEx)
   [junit4]   2> 833958 T3056 oasc.SolrResourceLoader.locateSolrHome using system property solr.solr.home: ../../../../../../../../../../mnt/ssd/jenkins/workspace/Lucene-Solr-4.x-Linux/solr/build/solr-core/test/J1/./solr.cloud.CollectionsAPIDistributedZkTest-A3935C9679054906-001/tempDir-006
   [junit4]   2> 833959 T3056 oasc.SolrResourceLoader.<init> new SolrResourceLoader for directory: '../../../../../../../../../../mnt/ssd/jenkins/workspace/Lucene-Solr-4.x-Linux/solr/build/solr-core/test/J1/./solr.cloud.CollectionsAPIDistributedZkTest-A3935C9679054906-001/tempDir-006/'
   [junit4]   2> 833972 T3056 oasc.ConfigSolr.fromFile Loading container configuration from /mnt/ssd/jenkins/workspace/Lucene-Solr-4.x-Linux/solr/build/solr-core/test/J1/../../../../../../../../../../mnt/ssd/jenkins/workspace/Lucene-Solr-4.x-Linux/solr/build/solr-core/test/J1/./solr.cloud.CollectionsAPIDistributedZkTest-A3935C9679054906-001/tempDir-006/solr.xml
   [junit4]   2> 834022 T3056 oasc.CorePropertiesLocator.<init> Config-defined core root directory: /mnt/ssd/jenkins/workspace/Lucene-Solr-4.x-Linux/solr/build/solr-core/test/J1/../../../../../../../../../../mnt/ssd/jenkins/workspace/Lucene-Solr-4.x-Linux/solr/build/solr-core/test/J1/./solr.cloud.CollectionsAPIDistributedZkTest-A3935C9679054906-001/tempDir-006
   [junit4]   2> 834022 T3056 oasc.CoreContainer.<init> New CoreContainer 7738919
   [junit4]   2> 834023 T3056 oasc.CoreContainer.load Loading cores into CoreContainer [instanceDir=../../../../../../../../../../mnt/ssd/jenkins/workspace/Lucene-Solr-4.x-Linux/solr/build/solr-core/test/J1/./solr.cloud.CollectionsAPIDistributedZkTest-A3935C9679054906-001/tempDir-006/]
   [junit4]   2> 834024 T3056 oashc.HttpShardHandlerFactory.getParameter Setting socketTimeout to: 90000
   [junit4]   2> 834024 T3056 oashc.HttpShardHandlerFactory.getParameter Setting urlScheme to: 
   [junit4]   2> 834024 T3056 oashc.HttpShardHandlerFactory.getParameter Setting connTimeout to: 15000
   [junit4]   2> 834024 T3056 oashc.HttpShardHandlerFactory.getParameter Setting maxConnectionsPerHost to: 20
   [junit4]   2> 834025 T3056 oashc.HttpShardHandlerFactory.getParameter Setting corePoolSize to: 0
   [junit4]   2> 834025 T3056 oashc.HttpShardHandlerFactory.getParameter Setting maximumPoolSize to: 2147483647
   [junit4]   2> 834025 T3056 oashc.HttpShardHandlerFactory.getParameter Setting maxThreadIdleTime to: 5
   [junit4]   2> 834026 T3056 oashc.HttpShardHandlerFactory.getParameter Setting sizeOfQueue to: -1
   [junit4]   2> 834026 T3056 oashc.HttpShardHandlerFactory.getParameter Setting fairnessPolicy to: false
   [junit4]   2> 834028 T3056 oasl.LogWatcher.createWatcher SLF4J impl is org.slf4j.impl.Log4jLoggerFactory
   [junit4]   2> 834028 T3056 oasl.LogWatcher.newRegisteredLogWatcher Registering Log Listener [Log4j (org.slf4j.impl.Log4jLoggerFactory)]
   [junit4]   2> 834028 T3056 oasc.CoreContainer.load Host Name: 127.0.0.1
   [junit4]   2> 834029 T3056 oasc.ZkContainer.initZooKeeper Zookeeper client=127.0.0.1:60988/solr
   [junit4]   2> 834029 T3056 oasc.ZkController.checkChrootPath zkHost includes chroot
   [junit4]   2> 834030 T3056 oascc.ConnectionManager.waitForConnected Waiting for client to connect to ZooKeeper
   [junit4]   2> 834031 T3138 oascc.ConnectionManager.process Watcher org.apache.solr.common.cloud.ConnectionManager@43aade name:ZooKeeperConnection Watcher:127.0.0.1:60988 got event WatchedEvent state:SyncConnected type:None path:null path:null type:None
   [junit4]   2> 834031 T3056 oascc.ConnectionManager.waitForConnected Client is connected to ZooKeeper
   [junit4]   2> 834033 T3056 oascc.ConnectionManager.waitForConnected Waiting for client to connect to ZooKeeper
   [junit4]   2> 834034 T3140 oascc.ConnectionManager.process Watcher org.apache.solr.common.cloud.ConnectionManager@9270d9 name:ZooKeeperConnection Watcher:127.0.0.1:60988/solr got event WatchedEvent state:SyncConnected type:None path:null path:null type:None
   [junit4]   2> 834034 T3056 oascc.ConnectionManager.waitForConnected Client is connected to ZooKeeper
   [junit4]   2> 834043 T3056 oascc.ZkStateReader.createClusterStateWatchersAndUpdate Updating cluster state from ZooKeeper... 
   [junit4]   2> 835046 T3056 oasc.ZkController.createEphemeralLiveNode Register node as live in ZooKeeper:/live_nodes/127.0.0.1:37295_
   [junit4]   2> 835049 T3056 oascc.SolrZkClient.makePath makePath: /live_nodes/127.0.0.1:37295_
   [junit4]   2> 835054 T3126 oascc.ZkStateReader$3.process Updating live nodes... (5)
   [junit4]   2> 835055 T3098 oascc.ZkStateReader$3.process Updating live nodes... (5)
   [junit4]   2> 835055 T3080 oascc.ZkStateReader$3.process Updating live nodes... (5)
   [junit4]   2> 835055 T3140 oascc.ZkStateReader$3.process Updating live nodes... (5)
   [junit4]   2> 835054 T3085 oascc.ZkStateReader$3.process Updating live nodes... (5)
   [junit4]   2> 835054 T3112 oascc.ZkStateReader$3.process Updating live nodes... (5)
   [junit4]   2> 835061 T3056 oasc.CorePropertiesLocator.discover Looking for core definitions underneath /mnt/ssd/jenkins/workspace/Lucene-Solr-4.x-Linux/solr/build/solr-core/test/J1/../../../../../../../../../../mnt/ssd/jenkins/workspace/Lucene-Solr-4.x-Linux/solr/build/solr-core/test/J1/./solr.cloud.CollectionsAPIDistributedZkTest-A3935C9679054906-001/tempDir-006
   [junit4]   2> 835074 T3056 oasc.CorePropertiesLocator.discoverUnder Found core conf in /mnt/ssd/jenkins/workspace/Lucene-Solr-4.x-Linux/solr/build/solr-core/test/J1/../../../../../../../../../../mnt/ssd/jenkins/workspace/Lucene-Solr-4.x-Linux/solr/build/solr-core/test/J1/./solr.cloud.CollectionsAPIDistributedZkTest-A3935C9679054906-001/tempDir-006/conf/
   [junit4]   2> 835199 T3056 oasc.CorePropertiesLocator.discover Found 1 core definitions
   [junit4]   2> 835200 T3056 oass.SolrDispatchFilter.init user.dir=/mnt/ssd/jenkins/workspace/Lucene-Solr-4.x-Linux/solr/build/solr-core/test/J1
   [junit4]   2> 835201 T3056 oass.SolrDispatchFilter.init SolrDispatchFilter.init() done
   [junit4]   2> 835306 T3091 oasha.CollectionsHandler.handleCreateAction Creating Collection : name=solrj_collection&replicationFactor=2&collection.configName=conf1&action=CREATE&router.name=compositeId&version=2&wt=javabin&router.field=myOwnField&numShards=2
   [junit4]   2> 835308 T3080 oasc.DistributedQueue$LatchChildWatcher.process LatchChildWatcher fired on path: /overseer/collection-queue-work state: SyncConnected type NodeChildrenChanged
   [junit4]   2> 835308 T3080 oasc.DistributedQueue$LatchChildWatcher.process LatchChildWatcher fired on path: /overseer/collection-queue-work state: SyncConnected type NodeChildrenChanged
   [junit4]   2> 835308 T3080 oasc.DistributedQueue$LatchChildWatcher.process LatchChildWatcher fired on path: /overseer/collection-queue-work state: SyncConnected type NodeChildrenChanged
   [junit4]   2> 835308 T3080 oasc.DistributedQueue$LatchChildWatcher.process LatchChildWatcher fired on path: /overseer/collection-queue-work state: SyncConnected type NodeChildrenChanged
   [junit4]   2> 835309 T3080 oasc.DistributedQueue$LatchChildWatcher.process LatchChildWatcher fired on path: /overseer/collection-queue-work state: SyncConnected type NodeChildrenChanged
   [junit4]   2> 835309 T3080 oasc.DistributedQueue$LatchChildWatcher.process LatchChildWatcher fired on path: /overseer/collection-queue-work state: SyncConnected type NodeChildrenChanged
   [junit4]   2> 835309 T3080 oasc.DistributedQueue$LatchChildWatcher.process LatchChildWatcher fired on path: /overseer/collection-queue-work state: SyncConnected type NodeChildrenChanged
   [junit4]   2> 835309 T3082 oasc.OverseerCollectionProcessor.run Overseer Collection Processor: Get the message id:/overseer/collection-queue-work/qn-0000000000 message:{
   [junit4]   2> 	  "operation":"createcollection",
   [junit4]   2> 	  "fromApi":"true",
   [junit4]   2> 	  "name":"solrj_collection",
   [junit4]   2> 	  "replicationFactor":"2",
   [junit4]   2> 	  "collection.configName":"conf1",
   [junit4]   2> 	  "numShards":"2",
   [junit4]   2> 	  "router.name":"compositeId",
   [junit4]   2> 	  "router.field":"myOwnField"}
   [junit4]   2> 835310 T3142 oasc.OverseerCollectionProcessor.processMessage WARN OverseerCollectionProcessor.processMessage : createcollection , {
   [junit4]   2> 	  "operation":"createcollection",
   [junit4]   2> 	  "fromApi":"true",
   [junit4]   2> 	  "name":"solrj_collection",
   [junit4]   2> 	  "replicationFactor":"2",
   [junit4]   2> 	  "collection.configName":"conf1",
   [junit4]   2> 	  "numShards":"2",
   [junit4]   2> 	  "router.name":"compositeId",
   [junit4]   2> 	  "router.field":"myOwnField"}
   [junit4]   2> 835312 T3142 oasc.OverseerCollectionProcessor.createConfNode creating collections conf node /collections/solrj_collection 
   [junit4]   2> 835312 T3142 oascc.SolrZkClient.makePath makePath: /collections/solrj_collection
   [junit4]   2> 835318 T3080 oasc.DistributedQueue$LatchChildWatcher.process LatchChildWatcher fired on path: /overseer/queue state: SyncConnected type NodeChildrenChanged
   [junit4]   2> 835319 T3081 oascc.ZkStateReader.updateClusterState Updating cloud state from ZooKeeper... 
   [junit4]   2> 835320 T3081 oasc.Overseer$ClusterStateUpdater.buildCollection building a new collection: solrj_collection
   [junit4]   2> 835320 T3081 oasc.Overseer$ClusterStateUpdater.createCollection Create collection solrj_collection with shards [shard1, shard2]
   [junit4]   2> 835323 T3080 oasc.DistributedQueue$LatchChildWatcher.process LatchChildWatcher fired on path: /overseer/queue state: SyncConnected type NodeChildrenChanged
   [junit4]   2> 835324 T3080 oascc.ZkStateReader$2.process A cluster state change: WatchedEvent state:SyncConnected type:NodeDataChanged path:/clusterstate.json, has occurred - updating... (live nodes size: 5)
   [junit4]   2> 835324 T3085 oascc.ZkStateReader$2.process A cluster state change: WatchedEvent state:SyncConnected type:NodeDataChanged path:/clusterstate.json, has occurred - updating... (live nodes size: 5)
   [junit4]   2> 835325 T3098 oascc.ZkStateReader$2.process A cluster state change: WatchedEvent state:SyncConnected type:NodeDataChanged path:/clusterstate.json, has occurred - updating... (live nodes size: 5)
   [junit4]   2> 835325 T3140 oascc.ZkStateReader$2.process A cluster state change: WatchedEvent state:SyncConnected type:NodeDataChanged path:/clusterstate.json, has occurred - updating... (live nodes size: 5)
   [junit4]   2> 835324 T3112 oascc.ZkStateReader$2.process A cluster state change: WatchedEvent state:SyncConnected type:NodeDataChanged path:/clusterstate.json, has occurred - updating... (live nodes size: 5)
   [junit4]   2> 835324 T3126 oascc.ZkStateReader$2.process A cluster state change: WatchedEvent state:SyncConnected type:NodeDataChanged path:/clusterstate.json, has occurred - updating... (live nodes size: 5)
   [junit4]   2> 835418 T3142 oasc.OverseerCollectionProcessor.createCollection Creating SolrCores for new collection solrj_collection, shardNames [shard1, shard2] , replicationFactor : 2
   [junit4]   2> 835418 T3142 oasc.OverseerCollectionProcessor.createCollection Creating shard solrj_collection_shard1_replica1 as part of slice shard1 of collection solrj_collection on 127.0.0.1:40832_
   [junit4]   2> 835421 T3142 oasc.OverseerCollectionProcessor.createCollection Creating shard solrj_collection_shard1_replica2 as part of slice shard1 of collection solrj_collection on 127.0.0.1:51535_
   [junit4]   2> 835423 T3142 oasc.OverseerCollectionProcessor.createCollection Creating shard solrj_collection_shard2_replica1 as part of slice shard2 of collection solrj_collection on 127.0.0.1:36981_
   [junit4]   2> 835426 T3142 oasc.OverseerCollectionProcessor.createCollection Creating shard solrj_collection_shard2_replica2 as part of slice shard2 of collection solrj_collection on 127.0.0.1:55097_
   [junit4]   2> 835515 T3093 oasha.CoreAdminHandler.handleCreateAction core create command name=solrj_collection_shard1_replica1&collection.configName=conf1&action=CREATE&shard=shard1&collection=solrj_collection&version=2&wt=javabin&qt=/admin/cores&numShards=2
   [junit4]   2> 835516 T3075 oasha.CoreAdminHandler.handleCreateAction core create command name=solrj_collection_shard2_replica2&collection.configName=conf1&action=CREATE&shard=shard2&collection=solrj_collection&version=2&wt=javabin&qt=/admin/cores&numShards=2
   [junit4]   2> 835517 T3093 oasc.ZkController.publish publishing core=solrj_collection_shard1_replica1 state=down collection=solrj_collection
   [junit4]   2> 835518 T3080 oasc.DistributedQueue$LatchChildWatcher.process LatchChildWatcher fired on path: /overseer/queue state: SyncConnected type NodeChildrenChanged
   [junit4]   2> 835518 T3075 oasc.ZkController.publish publishing core=solrj_collection_shard2_replica2 state=down collection=solrj_collection
   [junit4]   2> 835518 T3093 oasc.ZkController.waitForCoreNodeName look for our core node name
   [junit4]   2> 835520 T3080 oasc.DistributedQueue$LatchChildWatcher.process LatchChildWatcher fired on path: /overseer/queue state: SyncConnected type NodeChildrenChanged
   [junit4]   2> 835520 T3081 oascc.ZkStateReader.updateClusterState Updating cloud state from ZooKeeper... 
   [junit4]   2> 835520 T3075 oasc.ZkController.waitForCoreNodeName look for our core node name
   [junit4]   2> 835521 T3081 oasc.Overseer$ClusterStateUpdater.updateState Update state numShards=2 message={
   [junit4]   2> 	  "operation":"state",
   [junit4]   2> 	  "state":"down",
   [junit4]   2> 	  "base_url":"https://127.0.0.1:40832",
   [junit4]   2> 	  "core":"solrj_collection_shard1_replica1",
   [junit4]   2> 	  "roles":null,
   [junit4]   2> 	  "node_name":"127.0.0.1:40832_",
   [junit4]   2> 	  "shard":"shard1",
   [junit4]   2> 	  "collection":"solrj_collection",
   [junit4]   2> 	  "numShards":"2",
   [junit4]   2> 	  "core_node_name":null}
   [junit4]   2> 835524 T3081 oasc.Overseer$ClusterStateUpdater.updateState Update state numShards=2 message={
   [junit4]   2> 	  "operation":"state",
   [junit4]   2> 	  "state":"down",
   [junit4]   2> 	  "base_url":"https://127.0.0.1:55097",
   [junit4]   2> 	  "core":"solrj_collection_shard2_replica2",
   [junit4]   2> 	  "roles":null,
   [junit4]   2> 	  "node_name":"127.0.0.1:55097_",
   [junit4]   2> 	  "shard":"shard2",
   [junit4]   2> 	  "collection":"solrj_collection",
   [junit4]   2> 	  "numShards":"2",
   [junit4]   2> 	  "core_node_name":null}
   [junit4]   2> 835525 T3080 oasc.DistributedQueue$LatchChildWatcher.process LatchChildWatcher fired on path: /overseer/queue state: SyncConnected type NodeChildrenChanged
   [junit4]   2> 835536 T3120 oasha.CoreAdminHandler.handleCreateAction core create command name=solrj_collection_shard1_replica2&collection.configName=conf1&action=CREATE&shard=shard1&collection=solrj_collection&version=2&wt=javabin&qt=/admin/cores&numShards=2
   [junit4]   2> 835536 T3105 oasha.CoreAdminHandler.handleCreateAction core create command name=solrj_collection_shard2_replica1&collection.configName=conf1&action=CREATE&shard=shard2&collection=solrj_collection&version=2&wt=javabin&qt=/admin/cores&numShards=2
   [junit4]   2> 835538 T3120 oasc.ZkController.publish publishing core=solrj_collection_shard1_replica2 state=down collection=solrj_collection
   [junit4]   2> 835538 T3105 oasc.ZkController.publish publishing core=solrj_collection_shard2_replica1 state=down collection=solrj_collection
   [junit4]   2> 835539 T3120 oasc.ZkController.waitForCoreNodeName look for our core node name
   [junit4]   2> 835539 T3080 oasc.DistributedQueue$LatchChildWatcher.process LatchChildWatcher fired on path: /overseer/queue state: SyncConnected type NodeChildrenChanged
   [junit4]   2> 835539 T3105 oasc.ZkController.waitForCoreNodeName look for our core node name
   [junit4]   2> 835540 T3081 oasc.Overseer$ClusterStateUpdater.updateState Update state numShards=2 message={
   [junit4]   2> 	  "operation":"state",
   [junit4]   2> 	  "state":"down",
   [junit4]   2> 	  "base_url":"https://127.0.0.1:51535",
   [junit4]   2> 	  "core":"solrj_collection_shard1_replica2",
   [junit4]   2> 	  "roles":null,
   [junit4]   2> 	  "node_name":"127.0.0.1:51535_",
   [junit4]   2> 	  "shard":"shard1",
   [junit4]   2> 	  "collection":"solrj_collection",
   [junit4]   2> 	  "numShards":"2",
   [junit4]   2> 	  "core_node_name":null}
   [junit4]   2> 835541 T3080 oasc.DistributedQueue$LatchChildWatcher.process LatchChildWatcher fired on path: /overseer/queue state: SyncConnected type NodeChildrenChanged
   [junit4]   2> 835542 T3081 oasc.Overseer$ClusterStateUpdater.updateState Update state numShards=2 message={
   [junit4]   2> 	  "operation":"state",
   [junit4]   2> 	  "state":"down",
   [junit4]   2> 	  "base_url":"https://127.0.0.1:36981",
   [junit4]   2> 	  "core":"solrj_collection_shard2_replica1",
   [junit4]   2> 	  "roles":null,
   [junit4]   2> 	  "node_name":"127.0.0.1:36981_",
   [junit4]   2> 	  "shard":"shard2",
   [junit4]   2> 	  "collection":"solrj_collection",
   [junit4]   2> 	  "numShards":"2",
   [junit4]   2> 	  "core_node_name":null}
   [junit4]   2> 835544 T3080 oasc.DistributedQueue$LatchChildWatcher.process LatchChildWatcher fired on path: /overseer/queue state: SyncConnected type NodeChildrenChanged
   [junit4]   2> 835646 T3080 oascc.ZkStateReader$2.process A cluster state change: WatchedEvent state:SyncConnected type:NodeDataChanged path:/clusterstate.json, has occurred - updating... (live nodes size: 5)
   [junit4]   2> 835646 T3126 oascc.ZkStateReader$2.process A cluster state change: WatchedEvent state:SyncConnected type:NodeDataChanged path:/clusterstate.json, has occurred - updating... (live nodes size: 5)
   [junit4]   2> 835646 T3140 oascc.ZkStateReader$2.process A cluster state change: WatchedEvent state:SyncConnected type:NodeDataChanged path:/clusterstate.json, has occurred - updating... (live nodes size: 5)
   [junit4]   2> 835646 T3112 oascc.ZkStateReader$2.process A cluster state change: WatchedEvent state:SyncConnected type:NodeDataChanged path:/clusterstate.json, has occurred - updating... (live nodes size: 5)
   [junit4]   2> 835646 T3098 oascc.ZkStateReader$2.process A cluster state change: WatchedEvent state:SyncConnected type:NodeDataChanged path:/clusterstate.json, has occurred - updating... (live nodes size: 5)
   [junit4]   2> 835646 T3085 oascc.ZkStateReader$2.process A cluster state change: WatchedEvent state:SyncConnected type:NodeDataChanged path:/clusterstate.json, has occurred - updating... (live nodes size: 5)
   [junit4]   2> 836519 T3093 oasc.ZkController.waitForShardId waiting to find shard id in clusterstate for solrj_collection_shard1_replica1
   [junit4]   2> 836521 T3075 oasc.ZkController.waitForShardId waiting to find shard id in clusterstate for solrj_collection_shard2_replica2
   [junit4]   2> 836521 T3093 oasc.ZkController.createCollectionZkNode Check for collection zkNode:solrj_collection
   [junit4]   2> 836522 T3075 oasc.ZkController.createCollectionZkNode Check for collection zkNode:solrj_collection
   [junit4]   2> 836523 T3093 oasc.ZkController.createCollectionZkNode Collection zkNode exists
   [junit4]   2> 836523 T3093 oascc.ZkStateReader.readConfigName Load collection config from:/collections/solrj_collection
   [junit4]   2> 836523 T3075 oasc.ZkController.createCollectionZkNode Collection zkNode exists
   [junit4]   2> 836524 T3075 oascc.ZkStateReader.readConfigName Load collection config from:/collections/solrj_collection
   [junit4]   2> 836524 T3093 oascc.ZkStateReader.readConfigName path=/collections/solrj_collection configName=conf1 specified config exists in ZooKeeper
   [junit4]   2> 836524 T3093 oasc.SolrResourceLoader.<init> new SolrResourceLoader for directory: '../../../../../../../../../../mnt/ssd/jenkins/workspace/Lucene-Solr-4.x-Linux/solr/build/solr-core/test/J1/./solr.cloud.CollectionsAPIDistributedZkTest-A3935C9679054906-001/tempDir-003/solrj_collection_shard1_replica1/'
   [junit4]   2> 836525 T3075 oascc.ZkStateReader.readConfigName path=/collections/solrj_collection configName=conf1 specified config exists in ZooKeeper
   [junit4]   2> 836525 T3075 oasc.SolrResourceLoader.<init> new SolrResourceLoader for directory: './solr.cloud.CollectionsAPIDistributedZkTest-A3935C9679054906-001/tempDir-002/solrj_collection_shard2_replica2/'
   [junit4]   2> 836539 T3120 oasc.ZkController.waitForShardId waiting to find shard id in clusterstate for solrj_collection_shard1_replica2
   [junit4]   2> 836540 T3105 oasc.ZkController.waitForShardId waiting to find shard id in clusterstate for solrj_collection_shard2_replica1
   [junit4]   2> 836540 T3120 oasc.ZkController.createCollectionZkNode Check for collection zkNode:solrj_collection
   [junit4]   2> 836540 T3105 oasc.ZkController.createCollectionZkNode Check for collection zkNode:solrj_collection
   [junit4]   2> 836541 T3120 oasc.ZkController.createCollectionZkNode Collection zkNode exists
   [junit4]   2> 836541 T3105 oasc.ZkController.createCollectionZkNode Collection zkNode exists
   [junit4]   2> 836541 T3120 oascc.ZkStateReader.readConfigName Load collection config from:/collections/solrj_collection
   [junit4]   2> 836541 T3105 oascc.ZkStateReader.readConfigName Load collection config from:/collections/solrj_collection
   [junit4]   2> 836542 T3120 oascc.ZkStateReader.readConfigName path=/collections/solrj_collection configName=conf1 specified config exists in ZooKeeper
   [junit4]   2> 836542 T3120 oasc.SolrResourceLoader.<init> new SolrResourceLoader for directory: './solr.cloud.CollectionsAPIDistributedZkTest-A3935C9679054906-001/tempDir-005/solrj_collection_shard1_replica2/'
   [junit4]   2> 836542 T3105 oascc.ZkStateReader.readConfigName path=/collections/solrj_collection configName=conf1 specified config exists in ZooKeeper
   [junit4]   2> 836543 T3105 oasc.SolrResourceLoader.<init> new SolrResourceLoader for directory: './solr.cloud.CollectionsAPIDistributedZkTest-A3935C9679054906-001/tempDir-004/solrj_collection_shard2_replica1/'
   [junit4]   2> 836592 T3075 oasc.SolrConfig.<init> Using Lucene MatchVersion: LUCENE_4_9
   [junit4]   2> 836594 T3093 oasc.SolrConfig.<init> Using Lucene MatchVersion: LUCENE_4_9
   [junit4]   2> 836597 T3105 oasc.SolrConfig.<init> Using Lucene MatchVersion: LUCENE_4_9
   [junit4]   2> 836602 T3120 oasc.SolrConfig.<init> Using Lucene MatchVersion: LUCENE_4_9
   [junit4]   2> 836653 T3105 oasc.SolrConfig.<init> Loaded SolrConfig: solrconfig.xml
   [junit4]   2> 836655 T3105 oass.IndexSchema.readSchema Reading Solr Schema from schema.xml
   [junit4]   2> 836670 T3105 oass.IndexSchema.readSchema [solrj_collection_shard2_replica1] Schema name=test
   [junit4]   2> 836677 T3075 oasc.SolrConfig.<init> Loaded SolrConfig: solrconfig.xml
   [junit4]   2> 836678 T3093 oasc.SolrConfig.<init> Loaded SolrConfig: solrconfig.xml
   [junit4]   2> 836679 T3075 oass.IndexSchema.readSchema Reading Solr Schema from schema.xml
   [junit4]   2> 836679 T3093 oass.IndexSchema.readSchema Reading Solr Schema from schema.xml
   [junit4]   2> 836686 T3075 oass.IndexSchema.readSchema [solrj_collection_shard2_replica2] Schema name=test
   [junit4]   2> 836686 T3120 oasc.SolrConfig.<init> Loaded SolrConfig: solrconfig.xml
   [junit4]   2> 836688 T3120 oass.IndexSchema.readSchema Reading Solr Schema from schema.xml
   [junit4]   2> 836688 T3093 oass.IndexSchema.readSchema [solrj_collection_shard1_replica1] Schema name=test
   [junit4]   2> 836701 T3120 oass.IndexSchema.readSchema [solrj_collection_shard1_replica2] Schema name=test
   [junit4]   2> 837230 T3105 oass.ByteField.init WARN ByteField is deprecated and will be removed in 5.0. You should use TrieIntField instead.
   [junit4]   2> 837231 T3105 oass.ShortField.init WARN ShortField is deprecated and will be removed in 5.0. You should use TrieIntField instead.
   [junit4]   2> 837232 T3105 oass.OpenExchangeRatesOrgProvider.init Initialized with rates=open-exchange-rates.json, refreshInterval=1440.
   [junit4]   2> 837248 T3105 oass.IndexSchema.readSchema default search field in schema is text
   [junit4]   2> 837252 T3105 oass.IndexSchema.readSchema unique key field: id
   [junit4]   2> 837258 T3075 oass.ByteField.init WARN ByteField is deprecated and will be removed in 5.0. You should use TrieIntField instead.
   [junit4]   2> 837258 T3075 oass.ShortField.init WARN ShortField is deprecated and will be removed in 5.0. You should use TrieIntField instead.
   [junit4]   2> 837259 T3075 oass.OpenExchangeRatesOrgProvider.init Initialized with rates=open-exchange-rates.json, refreshInterval=1440.
   [junit4]   2> 837264 T3105 oass.FileExchangeRateProvider.reload Reloading exchange rates from file currency.xml
   [junit4]   2> 837267 T3075 oass.IndexSchema.readSchema default search field in schema is text
   [junit4]   2> 837268 T3105 oass.FileExchangeRateProvider.reload Reloading exchange rates from file currency.xml
   [junit4]   2> 837271 T3075 oass.IndexSchema.readSchema unique key field: id
   [junit4]   2> 837277 T3105 oass.OpenExchangeRatesOrgProvider.reload Reloading exchange rates from open-exchange-rates.json
   [junit4]   2> 837279 T3105 oass.OpenExchangeRatesOrgProvider$OpenExchangeRates.<init> WARN Unknown key IMPORTANT NOTE
   [junit4]   2> 837279 T3105 oass.OpenExchangeRatesOrgProvider$OpenExchangeRates.<init> WARN Expected key, got STRING
   [junit4]   2> 837279 T3105 oass.OpenExchangeRatesOrgProvider.reload Reloading exchange rates from open-exchange-rates.json
   [junit4]   2> 837281 T3105 oass.OpenExchangeRatesOrgProvider$OpenExchangeRates.<init> WARN Unknown key IMPORTANT NOTE
   [junit4]   2> 837281 T3105 oass.OpenExchangeRatesOrgProvider$OpenExchangeRates.<init> WARN Expected key, got STRING
   [junit4]   2> 837282 T3105 oasc.CoreContainer.create Creating SolrCore 'solrj_collection_shard2_replica1' using configuration from collection solrj_collection
   [junit4]   2> 837282 T3105 oasc.SolrCore.initDirectoryFactory org.apache.solr.core.MockDirectoryFactory
   [junit4]   2> 837283 T3105 oasc.SolrCore.<init> [solrj_collection_shard2_replica1] Opening new SolrCore at ./solr.cloud.CollectionsAPIDistributedZkTest-A3935C9679054906-001/tempDir-004/solrj_collection_shard2_replica1/, dataDir=./solr.cloud.CollectionsAPIDistributedZkTest-A3935C9679054906-001/tempDir-004/solrj_collection_shard2_replica1/data/
   [junit4]   2> 837283 T3105 oasc.JmxMonitoredMap.<init> JMX monitoring is enabled. Adding Solr mbeans to JMX Server: com.sun.jmx.mbeanserver.JmxMBeanServer@17c516
   [junit4]   2> 837285 T3105 oasc.CachingDirectoryFactory.get return new directory for ./solr.cloud.CollectionsAPIDistributedZkTest-A3935C9679054906-001/tempDir-004/solrj_collection_shard2_replica1/data
   [junit4]   2> 837286 T3105 oasc.SolrCore.getNewIndexDir New index directory detected: old=null new=./solr.cloud.CollectionsAPIDistributedZkTest-A3935C9679054906-001/tempDir-004/solrj_collection_shard2_replica1/data/index/
   [junit4]   2> 837287 T3105 oasc.SolrCore.initIndex WARN [solrj_collection_shard2_replica1] Solr index directory './solr.cloud.CollectionsAPIDistributedZkTest-A3935C9679054906-001/tempDir-004/solrj_collection_shard2_replica1/data/index' doesn't exist. Creating new index...
   [junit4]   2> 837289 T3105 oasc.CachingDirectoryFactory.get return new directory for ./solr.cloud.CollectionsAPIDistributedZkTest-A3935C9679054906-001/tempDir-004/solrj_collection_shard2_replica1/data/index
   [junit4]   2> 837291 T3105 oasu.RandomMergePolicy.<init> RandomMergePolicy wrapping class org.apache.lucene.index.AlcoholicMergePolicy: [AlcoholicMergePolicy: minMergeSize=0, mergeFactor=10, maxMergeSize=1065432282, maxMergeSizeForForcedMerge=9223372036854775807, calibrateSizeByDeletes=true, maxMergeDocs=2147483647, maxCFSSegmentSizeMB=8.796093022207999E12, noCFSRatio=0.1]
   [junit4]   2> 837292 T3075 oass.FileExchangeRateProvider.reload Reloading exchange rates from file currency.xml
   [junit4]   2> 837306 T3075 oass.FileExchangeRateProvider.reload Reloading exchange rates from file currency.xml
   [junit4]   2> 837308 T3105 oasc.SolrDeletionPolicy.onCommit SolrDeletionPolicy.onCommit: commits: num=1
   [junit4]   2> 		commit{dir=MockDirectoryWrapper(RAMDirectory@2ca86e lockFactory=org.apache.lucene.store.SingleInstanceLockFactory@737828),segFN=segments_1,generation=1}
   [junit4]   2> 837308 T3105 oasc.SolrDeletionPolicy.updateCommits newest commit generation = 1
   [junit4]   2> 837317 T3105 oasup.UpdateRequestProcessorChain.init creating updateRequestProcessorChain "nodistrib"
   [junit4]   2> 837318 T3105 oasup.UpdateRequestProcessorChain.init creating updateRequestProcessorChain "dedupe"
   [junit4]   2> 837318 T3075 oass.OpenExchangeRatesOrgProvider.reload Reloading exchange rates from open-exchange-rates.json
   [junit4]   2> 837319 T3105 oasup.UpdateRequestProcessorChain.init inserting DistributedUpdateProcessorFactory into updateRequestProcessorChain "dedupe"
   [junit4]   2> 837319 T3105 oasup.UpdateRequestProcessorChain.init creating updateRequestProcessorChain "stored_sig"
   [junit4]   2> 837320 T3105 oasup.UpdateRequestProcessorChain.init inserting DistributedUpdateProcessorFactory into updateRequestProcessorChain "stored_sig"
   [junit4]   2> 837320 T3105 oasup.UpdateRequestProcessorChain.init creating updateRequestProcessorChain "distrib-dup-test-chain-explicit"
   [junit4]   2> 837320 T3075 oass.OpenExchangeRatesOrgProvider$OpenExchangeRates.<init> WARN Unknown key IMPORTANT NOTE
   [junit4]   2> 837321 T3105 oasup.UpdateRequestProcessorChain.init creating updateRequestProcessorChain "distrib-dup-test-chain-implicit"
   [junit4]   2> 837321 T3075 oass.OpenExchangeRatesOrgProvider$OpenExchangeRates.<init> WARN Expected key, got STRING
   [junit4]   2> 837322 T3105 oasup.UpdateRequestProcessorChain.init inserting DistributedUpdateProcessorFactory into updateRequestProcessorChain "distrib-dup-test-chain-implicit"
   [junit4]   2> 837322 T3075 oass.OpenExchangeRatesOrgProvider.reload Reloading exchange rates from open-exchange-rates.json
   [junit4]   2> 837322 T3105 oasc.SolrCore.loadUpdateProcessorChains no updateRequestProcessorChain defined as default, creating implicit default
   [junit4]   2> 837323 T3105 oasc.RequestHandlers.initHandlersFromConfig created standard: solr.StandardRequestHandler
   [junit4]   2> 837324 T3075 oass.OpenExchangeRatesOrgProvider$OpenExchangeRates.<init> WARN Unknown key IMPORTANT NOTE
   [junit4]   2> 837324 T3075 oass.OpenExchangeRatesOrgProvider$OpenExchangeRates.<init> WARN Expected key, got STRING
   [junit4]   2> 837324 T3105 oasc.RequestHandlers.initHandlersFromConfig created /get: solr.RealTimeGetHandler
   [junit4]   2> 837325 T3105 oasc.RequestHandlers.initHandlersFromConfig adding lazy requestHandler: solr.ReplicationHandler
   [junit4]   2> 837325 T3075 oasc.CoreContainer.create Creating SolrCore 'solrj_collection_shard2_replica2' using configuration from collection solrj_collection
   [junit4]   2> 837325 T3105 oasc.RequestHandlers.initHandlersFromConfig created /replication: solr.ReplicationHandler
   [junit4]   2> 837326 T3075 oasc.SolrCore.initDirectoryFactory org.apache.solr.core.MockDirectoryFactory
   [junit4]   2> 837326 T3105 oasc.RequestHandlers.initHandlersFromConfig created /update: solr.UpdateRequestHandler
   [junit4]   2> 837327 T3075 oasc.SolrCore.<init> [solrj_collection_shard2_replica2] Opening new SolrCore at ./solr.cloud.CollectionsAPIDistributedZkTest-A3935C9679054906-001/tempDir-002/solrj_collection_shard2_replica2/, dataDir=./solr.cloud.CollectionsAPIDistributedZkTest-A3935C9679054906-001/tempDir-002/solrj_collection_shard2_replica2/data/
   [junit4]   2> 837327 T3105 oasc.RequestHandlers.initHandlersFromConfig created /admin/: org.apache.solr.handler.admin.AdminHandlers
   [junit4]   2> 837327 T3075 oasc.JmxMonitoredMap.<init> JMX monitoring is enabled. Adding Solr mbeans to JMX Server: com.sun.jmx.mbeanserver.JmxMBeanServer@17c516
   [junit4]   2> 837328 T3105 oasc.RequestHandlers.initHandlersFromConfig created /admin/file: solr.admin.ShowFileRequestHandler
   [junit4]   2> 837329 T3075 oasc.CachingDirectoryFactory.get return new directory for ./solr.cloud.CollectionsAPIDistributedZkTest-A3935C9679054906-001/tempDir-002/solrj_collection_shard2_replica2/data
   [junit4]   2> 837329 T3075 oasc.SolrCore.getNewIndexDir New index directory detected: old=null new=./solr.cloud.CollectionsAPIDistributedZkTest-A3935C9679054906-001/tempDir-002/solrj_collection_shard2_replica2/data/index/
   [junit4]   2> 837329 T3075 oasc.SolrCore.initIndex WARN [solrj_collection_shard2_replica2] Solr index directory './solr.cloud.CollectionsAPIDistributedZkTest-A3935C9679054906-001/tempDir-002/solrj_collection_shard2_replica2/data/index' doesn't exist. Creating new index...
   [junit4]   2> 837330 T3075 oasc.CachingDirectoryFactory.get return new directory for ./solr.cloud.CollectionsAPIDistributedZkTest-A3935C9679054906-001/tempDir-002/solrj_collection_shard2_replica2/data/index
   [junit4]   2> 837332 T3105 oashl.XMLLoader.init xsltCacheLifetimeSeconds=60
   [junit4]   2> 837336 T3105 oasu.CommitTracker.<init> Hard AutoCommit: disabled
   [junit4]   2> 837336 T3105 oasu.CommitTracker.<init> Soft AutoCommit: disabled
   [junit4]   2> 837338 T3105 oasu.RandomMergePolicy.<init> RandomMergePolicy wrapping class org.apache.lucene.index.AlcoholicMergePolicy: [AlcoholicMergePolicy: minMergeSize=0, mergeFactor=10, maxMergeSize=165566975, maxMergeSizeForForcedMerge=9223372036854775807, calibrateSizeByDeletes=true, maxMergeDocs=2147483647, maxCFSSegmentSizeMB=8.796093022207999E12, noCFSRatio=0.1]
   [junit4]   2> 837338 T3075 oasu.RandomMergePolicy.<init> RandomMergePolicy wrapping class org.apache.lucene.index.AlcoholicMergePolicy: [AlcoholicMergePolicy: minMergeSize=0, mergeFactor=10, maxMergeSize=1065432282, maxMergeSizeForForcedMerge=9223372036854775807, calibrateSizeByDeletes=true, maxMergeDocs=2147483647, maxCFSSegmentSizeMB=8.796093022207999E12, noCFSRatio=0.1]
   [junit4]   2> 837338 T3105 oasc.SolrDeletionPolicy.onInit SolrDeletionPolicy.onInit: commits: num=1
   [junit4]   2> 		commit{dir=MockDirectoryWrapper(RAMDirectory@2ca86e lockFactory=org.apache.lucene.store.SingleInstanceLockFactory@737828),segFN=segments_1,generation=1}
   [junit4]   2> 837339 T3105 oasc.SolrDeletionPolicy.updateCommits newest commit generation = 1
   [junit4]   2> 837339 T3075 oasc.SolrDeletionPolicy.onCommit SolrDeletionPolicy.onCommit: commits: num=1
   [junit4]   2> 		commit{dir=MockDirectoryWrapper(RAMDirectory@b651e1 lockFactory=org.apache.lucene.store.SingleInstanceLockFactory@1c90194),segFN=segments_1,generation=1}
   [junit4]   2> 837340 T3075 oasc.SolrDeletionPolicy.updateCommits newest commit generation = 1
   [junit4]   2> 837339 T3105 oass.SolrIndexSearcher.<init> Opening Searcher@13202b9[solrj_collection_shard2_replica1] main
   [junit4]   2> 837341 T3105 oascc.ZkStateReader.readConfigName Load collection config from:/collections/solrj_collection
   [junit4]   2> 837342 T3105 oascc.ZkStateReader.readConfigName path=/collections/solrj_collection configName=conf1 specified config exists in ZooKeeper
   [junit4]   2> 837342 T3105 oasr.ManagedResourceStorage.newStorageIO Setting up ZooKeeper-based storage for the RestManager with znodeBase: /configs/conf1
   [junit4]   2> 837343 T3105 oasr.ManagedResourceStorage$ZooKeeperStorageIO.configure Configured ZooKeeperStorageIO with znodeBase: /configs/conf1
   [junit4]   2> 837343 T3105 oasr.RestManager.init Initializing RestManager with initArgs: {}
   [junit4]   2> 837344 T3105 oasr.ManagedResourceStorage.load Reading _rest_managed.json using ZooKeeperStorageIO:path=/configs/conf1
   [junit4]   2> 837344 T3105 oasr.ManagedResourceStorage$ZooKeeperStorageIO.openInputStream No data found for znode /configs/conf1/_rest_managed.json
   [junit4]   2> 837345 T3075 oasup.UpdateRequestProcessorChain.init creating updateRequestProcessorChain "nodistrib"
   [junit4]   2> 837345 T3105 oasr.ManagedResourceStorage.load Loaded null at path _rest_managed.json using ZooKeeperStorageIO:path=/configs/conf1
   [junit4]   2> 837345 T3075 oasup.UpdateRequestProcessorChain.init creating updateRequestProcessorChain "dedupe"
   [junit4]   2> 837346 T3105 oasr.ManagedResource.notifyObserversDuringInit WARN No registered observers for /rest/managed
   [junit4]   2> 837346 T3075 oasup.UpdateRequestProcessorChain.init inserting DistributedUpdateProcessorFactory into updateRequestProcessorChain "dedupe"
   [junit4]   2> 837346 T3105 oasr.RestManager.init Initializing 0 registered ManagedResources
   [junit4]   2> 837347 T3075 oasup.UpdateRequestProcessorChain.init creating updateRequestProcessorChain "stored_sig"
   [junit4]   2> 837348 T3075 oasup.UpdateRequestProcessorChain.init inserting DistributedUpdateProcessorFactory into updateRequestProcessorChain "stored_sig"
   [junit4]   2> 837348 T3075 oasup.UpdateRequestProcessorChain.init creating updateRequestProcessorChain "distrib-dup-test-chain-explicit"
   [junit4]   2> 837349 T3075 oasup.UpdateRequestProcessorChain.init creating updateRequestProcessorChain "distrib-dup-test-chain-implicit"
   [junit4]   2> 837349 T3093 oass.ByteField.init WARN ByteField is deprecated and will be removed in 5.0. You should use TrieIntField instead.
   [junit4]   2> 837349 T3075 oasup.UpdateRequestProcessorChain.init inserting DistributedUpdateProcessorFactory into updateRequestProcessorChain "distrib-dup-test-chain-implicit"
   [junit4]   2> 837350 T3075 oasc.SolrCore.loadUpdateProcessorChains no updateRequestProcessorChain defined as default, creating implicit default
   [junit4]   2> 837351 T3075 oasc.RequestHandlers.initHandlersFromConfig created standard: solr.StandardRequestHandler
   [junit4]   2> 837351 T3075 oasc.RequestHandlers.initHandlersFromConfig created /get: solr.RealTimeGetHandler
   [junit4]   2> 837352 T3075 oasc.RequestHandlers.initHandlersFromConfig adding lazy requestHandler: solr.ReplicationHandler
   [junit4]   2> 837352 T3075 oasc.RequestHandlers.initHandlersFromConfig created /replication: solr.ReplicationHandler
   [junit4]   2> 837353 T3075 oasc.RequestHandlers.initHandlersFromConfig created /update: solr.UpdateRequestHandler
   [junit4]   2> 837353 T3075 oasc.RequestHandlers.initHandlersFromConfig created /admin/: org.apache.solr.handler.admin.AdminHandlers
   [junit4]   2> 837354 T3075 oasc.RequestHandlers.initHandlersFromConfig created /admin/file: solr.admin.ShowFileRequestHandler
   [junit4]   2> 837356 T3075 oashl.XMLLoader.init xsltCacheLifetimeSeconds=60
   [junit4]   2> 837350 T3147 oasc.SolrCore.registerSearcher [solrj_collection_shard2_replica1] Registered new searcher Searcher@13202b9[solrj_collection_shard2_replica1] main{StandardDirectoryReader(segments_1:1:nrt)}
   [junit4]   2> 837350 T3093 oass.ShortField.init WARN ShortField is deprecated and will be removed in 5.0. You should use TrieIntField instead.
   [junit4]   2> 837359 T3093 oass.OpenExchangeRatesOrgProvider.init Initialized with rates=open-exchange-rates.json, refreshInterval=1440.
   [junit4]   2> 837359 T3075 oasu.CommitTracker.<init> Hard AutoCommit: disabled
   [junit4]   2> 837360 T3075 oasu.CommitTracker.<init> Soft AutoCommit: disabled
   [junit4]   2> 837360 T3105 oasc.CoreContainer.registerCore registering core: solrj_collection_shard2_replica1
   [junit4]   2> 837361 T3105 oasc.ZkController.register Register replica - core:solrj_collection_shard2_replica1 address:https://127.0.0.1:36981 collection:solrj_collection shard:shard2
   [junit4]   2> 837361 T3075 oasu.RandomMergePolicy.<init> RandomMergePolicy wrapping class org.apache.lucene.index.AlcoholicMergePolicy: [AlcoholicMergePolicy: minMergeSize=0, mergeFactor=10, maxMergeSize=165566975, maxMergeSizeForForcedMerge=9223372036854775807, calibrateSizeByDeletes=true, maxMergeDocs=2147483647, maxCFSSegmentSizeMB=8.796093022207999E12, noCFSRatio=0.1]
   [junit4]   2> 837362 T3105 oascc.SolrZkClient.makePath makePath: /collections/solrj_collection/leader_elect/shard2/election
   [junit4]   2> 837362 T3075 oasc.SolrDeletionPolicy.onInit SolrDeletionPolicy.onInit: commits: num=1
   [junit4]   2> 		commit{dir=MockDirectoryWrapper(RAMDirectory@b651e1 lockFactory=org.apache.lucene.store.SingleInstanceLockFactory@1c90194),segFN=segments_1,generation=1}
   [junit4]   2> 837363 T3075 oasc.SolrDeletionPolicy.updateCommits newest commit generation = 1
   [junit4]   2> 837363 T3075 oass.SolrIndexSearcher.<init> Opening Searcher@448317[solrj_collection_shard2_replica2] main
   [junit4]   2> 837364 T3075 oascc.ZkStateReader.readConfigName Load collection config from:/collections/solrj_collection
   [junit4]   2> 837365 T3075 oascc.ZkStateReader.readConfigName path=/collections/solrj_collection configName=conf1 specified config exists in ZooKeeper
   [junit4]   2> 837366 T3075 oasr.ManagedResourceStorage.newStorageIO Setting up ZooKeeper-based storage for the RestManager with znodeBase: /configs/conf1
   [junit4]   2> 837367 T3093 oass.IndexSchema.readSchema default search field in schema is text
   [junit4]   2> 837368 T3075 oasr.ManagedResourceStorage$ZooKeeperStorageIO.configure Configured ZooKeeperStorageIO with znodeBase: /configs/conf1
   [junit4]   2> 837369 T3075 oasr.RestManager.init Initializing RestManager with initArgs: {}
   [junit4]   2> 837369 T3075 oasr.ManagedResourceStorage.load Reading _rest_managed.json using ZooKeeperStorageIO:path=/configs/conf1
   [junit4]   2> 837371 T3075 oasr.ManagedResourceStorage$ZooKeeperStorageIO.openInputStream No data found for znode /configs/conf1/_rest_managed.json
   [junit4]   2> 837371 T3093 oass.IndexSchema.readSchema unique key field: id
   [junit4]   2> 837372 T3075 oasr.ManagedResourceStorage.load Loaded null at path _rest_managed.json using ZooKeeperStorageIO:path=/configs/conf1
   [junit4]   2> 837372 T3105 oasc.ShardLeaderElectionContext.runLeaderProcess Running the leader process for shard shard2
   [junit4]   2> 837372 T3075 oasr.ManagedResource.notifyObserversDuringInit WARN No registered observers for /rest/managed
   [junit4]   2> 837373 T3075 oasr.RestManager.init Initializing 0 registered ManagedResources
   [junit4]   2> 837374 T3080 oasc.DistributedQueue$LatchChildWatcher.process LatchChildWatcher fired on path: /overseer/queue state: SyncConnected type NodeChildrenChanged
   [junit4]   2> 837374 T3080 oasc.DistributedQueue$LatchChildWatcher.process LatchChildWatcher fired on path: /overseer/queue state: SyncConnected type NodeChildrenChanged
   [junit4]   2> 837375 T3080 oasc.DistributedQueue$LatchChildWatcher.process LatchChildWatcher fired on path: /overseer/queue state: SyncConnected type NodeChildrenChanged
   [junit4]   2> 837375 T3105 oasc.ShardLeaderElectionContext.waitForReplicasToComeUp Waiting until we see more replicas up for shard shard2: total=2 found=1 timeoutin=8.7958058E14ms
   [junit4]   2> 837376 T3148 oasc.SolrCore.registerSearcher [solrj_collection_shard2_replica2] Registered new searcher Searcher@448317[solrj_collection_shard2_replica2] main{StandardDirectoryReader(segments_1:1:nrt)}
   [junit4]   2> 837376 T3120 oass.ByteField.init WARN ByteField is deprecated and will be removed in 5.0. You should use TrieIntField instead.
   [junit4]   2> 837376 T3081 oascc.ZkStateReader.updateClusterState Updating cloud state from ZooKeeper... 
   [junit4]   2> 837377 T3120 oass.ShortField.init WARN ShortField is deprecated and will be removed in 5.0. You should use TrieIntField instead.
   [junit4]   2> 837378 T3075 oasc.CoreContainer.registerCore registering core: solrj_collection_shard2_replica2
   [junit4]   2> 837378 T3120 oass.OpenExchangeRatesOrgProvider.init Initialized with rates=open-exchange-rates.json, refreshInterval=1440.
   [junit4]   2> 837378 T3075 oasc.ZkController.register Register replica - core:solrj_collection_shard2_replica2 address:https://127.0.0.1:55097 collection:solrj_collection shard:shard2
   [junit4]   2> 837382 T3080 oasc.DistributedQueue$LatchChildWatcher.process LatchChildWatcher fired on path: /overseer/queue state: SyncConnected type NodeChildrenChanged
   [junit4]   2> 837393 T3098 oascc.ZkStateReader$2.process A cluster state change: WatchedEvent state:SyncConnected type:NodeDataChanged path:/clusterstate.json, has occurred - updating... (live nodes size: 5)
   [junit4]   2> 837394 T3085 oascc.ZkStateReader$2.process A cluster state change: WatchedEvent state:SyncConnected type:NodeDataChanged path:/clusterstate.json, has occurred - updating... (live nodes size: 5)
   [junit4]   2> 837394 T3080 oascc.ZkStateReader$2.process A cluster state change: WatchedEvent state:SyncConnected type:NodeDataChanged path:/clusterstate.json, has occurred - updating... (live nodes size: 5)
   [junit4]   2> 837394 T3112 oascc.ZkStateReader$2.process A cluster state change: WatchedEvent state:SyncConnected type:NodeDataChanged path:/clusterstate.json, has occurred - updating... (live nodes size: 5)
   [junit4]   2> 837393 T3140 oascc.ZkStateReader$2.process A cluster state change: WatchedEvent state:SyncConnected type:NodeDataChanged path:/clusterstate.json, has occurred - updating... (live nodes size: 5)
   [junit4]   2> 837393 T3126 oascc.ZkStateReader$2.process A cluster state change: WatchedEvent state:SyncConnected type:NodeDataChanged path:/clusterstate.json, has occurred - updating... (live nodes size: 5)
   [junit4]   2> 837395 T3120 oass.IndexSchema.readSchema default search field in schema is text
   [junit4]   2> 837397 T3120 oass.IndexSchema.readSchema unique key field: id
   [junit4]   2> 837405 T3093 oass.FileExchangeRateProvider.reload Reloading exchange rates from file currency.xml
   [junit4]   2> 837408 T3093 oass.FileExchangeRateProvider.reload Reloading exchange rates from file currency.xml
   [junit4]   2> 837411 T3093 oass.OpenExchangeRatesOrgProvider.reload Reloading exchange rates from open-exchange-rates.json
   [junit4]   2> 837412 T3093 oass.OpenExchangeRatesOrgProvider$OpenExchangeRates.<init> WARN Unknown key IMPORTANT NOTE
   [junit4]   2> 837414 T3093 oass.OpenExchangeRatesOrgProvider$OpenExchangeRates.<init> WARN Expected key, got STRING
   [junit4]   2> 837413 T3120 oass.FileExchangeRateProvider.reload Reloading exchange rates from file currency.xml
   [junit4]   2> 837414 T3093 oass.OpenExchangeRatesOrgProvider.reload Reloading exchange rates from open-exchange-rates.json
   [junit4]   2> 837415 T3093 oa

[...truncated too long message...]

	at org.apache.solr.cloud.HttpPartitionTest.testRf3(HttpPartitionTest.java:223)
   [junit4]    > 	at org.apache.solr.cloud.HttpPartitionTest.doTest(HttpPartitionTest.java:145)
   [junit4]    > 	at org.apache.solr.BaseDistributedSearchTestCase.testDistribSearch(BaseDistributedSearchTestCase.java:865)
   [junit4]    > 	at java.lang.Thread.run(Thread.java:745)
   [junit4]   2> 1577482 T6500 oas.SolrTestCaseJ4.deleteCore ###deleteCore
   [junit4]   2> NOTE: leaving temporary files on disk at: /mnt/ssd/jenkins/workspace/Lucene-Solr-4.x-Linux/solr/build/solr-core/test/J1/./solr.cloud.HttpPartitionTest-A3935C9679054906-001
   [junit4]   2> 71090 T6499 ccr.ThreadLeakControl.checkThreadLeaks WARNING Will linger awaiting termination of 6 leaked thread(s).
   [junit4]   2> 1577998 T6663 oasc.Overseer$ClusterStateUpdater.checkIfIamStillLeader ERROR could not read the data org.apache.zookeeper.KeeperException$SessionExpiredException: KeeperErrorCode = Session expired for /overseer_elect/leader
   [junit4]   2> 	at org.apache.zookeeper.KeeperException.create(KeeperException.java:127)
   [junit4]   2> 	at org.apache.zookeeper.KeeperException.create(KeeperException.java:51)
   [junit4]   2> 	at org.apache.zookeeper.ZooKeeper.getData(ZooKeeper.java:1155)
   [junit4]   2> 	at org.apache.solr.common.cloud.SolrZkClient$7.execute(SolrZkClient.java:277)
   [junit4]   2> 	at org.apache.solr.common.cloud.SolrZkClient$7.execute(SolrZkClient.java:274)
   [junit4]   2> 	at org.apache.solr.common.cloud.ZkCmdExecutor.retryOperation(ZkCmdExecutor.java:73)
   [junit4]   2> 	at org.apache.solr.common.cloud.SolrZkClient.getData(SolrZkClient.java:274)
   [junit4]   2> 	at org.apache.solr.cloud.Overseer$ClusterStateUpdater.checkIfIamStillLeader(Overseer.java:302)
   [junit4]   2> 	at org.apache.solr.cloud.Overseer$ClusterStateUpdater.access$300(Overseer.java:85)
   [junit4]   2> 	at org.apache.solr.cloud.Overseer$ClusterStateUpdater$1.run(Overseer.java:291)
   [junit4]   2> 
   [junit4]   2> 1577998 T6522 oascc.ZkStateReader$3.process WARN ZooKeeper watch triggered, but Solr cannot talk to ZK
   [junit4]   2> 1578120 T6667 oasc.Overseer$ClusterStateUpdater.checkIfIamStillLeader ERROR could not read the data org.apache.zookeeper.KeeperException$SessionExpiredException: KeeperErrorCode = Session expired for /overseer_elect/leader
   [junit4]   2> 	at org.apache.zookeeper.KeeperException.create(KeeperException.java:127)
   [junit4]   2> 	at org.apache.zookeeper.KeeperException.create(KeeperException.java:51)
   [junit4]   2> 	at org.apache.zookeeper.ZooKeeper.getData(ZooKeeper.java:1155)
   [junit4]   2> 	at org.apache.solr.common.cloud.SolrZkClient$7.execute(SolrZkClient.java:277)
   [junit4]   2> 	at org.apache.solr.common.cloud.SolrZkClient$7.execute(SolrZkClient.java:274)
   [junit4]   2> 	at org.apache.solr.common.cloud.ZkCmdExecutor.retryOperation(ZkCmdExecutor.java:73)
   [junit4]   2> 	at org.apache.solr.common.cloud.SolrZkClient.getData(SolrZkClient.java:274)
   [junit4]   2> 	at org.apache.solr.cloud.Overseer$ClusterStateUpdater.checkIfIamStillLeader(Overseer.java:302)
   [junit4]   2> 	at org.apache.solr.cloud.Overseer$ClusterStateUpdater.access$300(Overseer.java:85)
   [junit4]   2> 	at org.apache.solr.cloud.Overseer$ClusterStateUpdater$1.run(Overseer.java:291)
   [junit4]   2> 
   [junit4]   2> 1578121 T6545 oascc.ZkStateReader$3.process WARN ZooKeeper watch triggered, but Solr cannot talk to ZK
   [junit4]   2> 1578211 T6671 oasc.Overseer$ClusterStateUpdater.checkIfIamStillLeader ERROR could not read the data org.apache.zookeeper.KeeperException$SessionExpiredException: KeeperErrorCode = Session expired for /overseer_elect/leader
   [junit4]   2> 	at org.apache.zookeeper.KeeperException.create(KeeperException.java:127)
   [junit4]   2> 	at org.apache.zookeeper.KeeperException.create(KeeperException.java:51)
   [junit4]   2> 	at org.apache.zookeeper.ZooKeeper.getData(ZooKeeper.java:1155)
   [junit4]   2> 	at org.apache.solr.common.cloud.SolrZkClient$7.execute(SolrZkClient.java:277)
   [junit4]   2> 	at org.apache.solr.common.cloud.SolrZkClient$7.execute(SolrZkClient.java:274)
   [junit4]   2> 	at org.apache.solr.common.cloud.ZkCmdExecutor.retryOperation(ZkCmdExecutor.java:73)
   [junit4]   2> 	at org.apache.solr.common.cloud.SolrZkClient.getData(SolrZkClient.java:274)
   [junit4]   2> 	at org.apache.solr.cloud.Overseer$ClusterStateUpdater.checkIfIamStillLeader(Overseer.java:302)
   [junit4]   2> 	at org.apache.solr.cloud.Overseer$ClusterStateUpdater.access$300(Overseer.java:85)
   [junit4]   2> 	at org.apache.solr.cloud.Overseer$ClusterStateUpdater$1.run(Overseer.java:291)
   [junit4]   2> 
   [junit4]   2> 1578211 T6564 oascc.ZkStateReader$3.process WARN ZooKeeper watch triggered, but Solr cannot talk to ZK
   [junit4]   2> NOTE: test params are: codec=Lucene3x, sim=DefaultSimilarity, locale=ar_OM, timezone=SystemV/AST4ADT
   [junit4]   2> NOTE: Linux 3.8.0-39-generic i386/Oracle Corporation 1.7.0_55 (32-bit)/cpus=8,threads=1,free=92743888,total=374964224
   [junit4]   2> NOTE: All tests run in this JVM: [TestLazyCores, TestCSVResponseWriter, DistanceFunctionTest, MinimalSchemaTest, ChaosMonkeySafeLeaderTest, TestZkChroot, PathHierarchyTokenizerFactoryTest, ConvertedLegacyTest, TestMaxScoreQueryParser, DistributedExpandComponentTest, TestDistributedSearch, TestCloudManagedSchema, DateFieldTest, HdfsChaosMonkeySafeLeaderTest, TestSerializedLuceneMatchVersion, TestInfoStreamLogging, IndexSchemaRuntimeFieldTest, TestRestManager, TestIndexingPerformance, CursorMarkTest, TestManagedSchema, TestShardHandlerFactory, RequestHandlersTest, TestSolrCoreProperties, TestCSVLoader, TestArbitraryIndexDir, TestInitQParser, RAMDirectoryFactoryTest, TestSearcherReuse, TestAtomicUpdateErrorCases, SortByFunctionTest, TestComponentsName, TestBinaryField, TestCollationFieldDocValues, NoCacheHeaderTest, HardAutoCommitTest, TestIBSimilarityFactory, TestPhraseSuggestions, NotRequiredUniqueKeyTest, TestManagedSynonymFilterFactory, CurrencyFieldXmlFileTest, AliasIntegrationTest, TestMultiCoreConfBootstrap, SolrIndexConfigTest, TestManagedSchemaFieldResource, SpellCheckComponentTest, MergeStrategyTest, TestQueryTypes, HdfsSyncSliceTest, SolrRequestParserTest, TestDefaultSimilarityFactory, DebugComponentTest, DistributedDebugComponentTest, TestFastWriter, DocValuesMissingTest, NumericFieldsTest, TestQuerySenderListener, QueryResultKeyTest, TestRandomFaceting, SuggesterWFSTTest, TestFuzzyAnalyzedSuggestions, TestNonDefinedSimilarityFactory, TestSolrJ, DirectSolrSpellCheckerTest, ZkSolrClientTest, TestStressReorder, TriLevelCompositeIdRoutingTest, CursorPagingTest, ShardSplitTest, TestNumberUtils, TestFastLRUCache, DefaultValueUpdateProcessorTest, TestNRTOpen, TestCodecSupport, TestQuerySenderNoQuery, SolrPluginUtilsTest, ZkNodePropsTest, ShardRoutingCustomTest, TestRangeQuery, FieldAnalysisRequestHandlerTest, TestFiltering, TestStressRecovery, HdfsWriteToMultipleCollectionsTest, TestFieldTypeResource, CollectionsAPIDistributedZkTest, TestMiniSolrCloudCluster, TestConfigSets, SolrCoreCheckLockOnStartupTest, MultiTermTest, TestSolrQueryParserResource, TestCollationField, AlternateDirectoryTest, TestDistributedMissingSort, StressHdfsTest, TestUpdate, SpellingQueryConverterTest, ShardRoutingTest, RecoveryZkTest, TestReplicationHandler, LeaderElectionTest, TestDistributedGrouping, TestFaceting, TestRecovery, TestHashPartitioner, TestReload, DistributedTermsComponentTest, StatsComponentTest, SolrCmdDistributorTest, QueryElevationComponentTest, DirectUpdateHandlerTest, TestIndexSearcher, SoftAutoCommitTest, SpellCheckCollatorTest, SuggesterTSTTest, TestStressLucene, SchemaVersionSpecificBehaviorTest, TestWordDelimiterFilterFactory, TestRemoteStreaming, XsltUpdateRequestHandlerTest, TestSurroundQueryParser, DisMaxRequestHandlerTest, TestQueryUtils, TestReversedWildcardFilterFactory, TestOmitPositions, TermsComponentTest, MoreLikeThisHandlerTest, TestSolrQueryParser, LoggingHandlerTest, IndexSchemaTest, JSONWriterTest, TestAnalyzedSuggestions, UniqFieldsUpdateProcessorFactoryTest, BinaryUpdateRequestHandlerTest, PingRequestHandlerTest, CoreContainerCoreInitFailuresTest, TestBinaryResponseWriter, TestSolrDeletionPolicy2, ExternalFileFieldSortTest, TestPostingsSolrHighlighter, TestCharFilters, TestXIncludeConfig, TestSweetSpotSimilarityFactory, TestLMDirichletSimilarityFactory, TestFastOutputStream, OpenExchangeRatesOrgProviderTest, PluginInfoTest, ChaosMonkeyNothingIsSafeTest, CollectionsAPIAsyncDistributedZkTest, DeleteReplicaTest, DistribCursorPagingTest, HttpPartitionTest]
   [junit4] Completed on J1 in 71.87s, 1 test, 1 error <<< FAILURES!

[...truncated 194 lines...]
BUILD FAILED
/mnt/ssd/jenkins/workspace/Lucene-Solr-4.x-Linux/build.xml:467: The following error occurred while executing this line:
/mnt/ssd/jenkins/workspace/Lucene-Solr-4.x-Linux/build.xml:447: The following error occurred while executing this line:
/mnt/ssd/jenkins/workspace/Lucene-Solr-4.x-Linux/build.xml:45: The following error occurred while executing this line:
/mnt/ssd/jenkins/workspace/Lucene-Solr-4.x-Linux/extra-targets.xml:37: The following error occurred while executing this line:
/mnt/ssd/jenkins/workspace/Lucene-Solr-4.x-Linux/solr/build.xml:189: The following error occurred while executing this line:
/mnt/ssd/jenkins/workspace/Lucene-Solr-4.x-Linux/solr/common-build.xml:496: The following error occurred while executing this line:
/mnt/ssd/jenkins/workspace/Lucene-Solr-4.x-Linux/lucene/common-build.xml:1297: The following error occurred while executing this line:
/mnt/ssd/jenkins/workspace/Lucene-Solr-4.x-Linux/lucene/common-build.xml:921: There were test failures: 396 suites, 1640 tests, 2 errors, 36 ignored (15 assumptions)

Total time: 70 minutes 51 seconds
Build step 'Invoke Ant' marked build as failure
Description set: Java: 32bit/jdk1.7.0_55 -server -XX:+UseConcMarkSweepGC
Archiving artifacts
Recording test results
Email was triggered for: Failure
Sending email for trigger: Failure



Mime
View raw message