lucene-dev mailing list archives

Site index · List index
Message view « Date » · « Thread »
Top « Date » · « Thread »
From Policeman Jenkins Server <jenk...@thetaphi.de>
Subject [JENKINS] Lucene-Solr-4.8-Linux (64bit/jdk1.8.0_20-ea-b11) - Build # 141 - Failure!
Date Sat, 10 May 2014 22:59:36 GMT
Build: http://jenkins.thetaphi.de/job/Lucene-Solr-4.8-Linux/141/
Java: 64bit/jdk1.8.0_20-ea-b11 -XX:-UseCompressedOops -XX:+UseG1GC

1 tests failed.
REGRESSION:  org.apache.lucene.index.TestIndexWriterExceptions.testNoLostDeletesOrUpdates

Error Message:
doc=2022 expected:<2> but was:<10>

Stack Trace:
java.lang.AssertionError: doc=2022 expected:<2> but was:<10>
	at __randomizedtesting.SeedInfo.seed([AB3621C114DFE483:C24D234AE2712EC3]:0)
	at org.junit.Assert.fail(Assert.java:93)
	at org.junit.Assert.failNotEquals(Assert.java:647)
	at org.junit.Assert.assertEquals(Assert.java:128)
	at org.junit.Assert.assertEquals(Assert.java:472)
	at org.apache.lucene.index.TestIndexWriterExceptions.testNoLostDeletesOrUpdates(TestIndexWriterExceptions.java:1918)
	at sun.reflect.NativeMethodAccessorImpl.invoke0(Native Method)
	at sun.reflect.NativeMethodAccessorImpl.invoke(NativeMethodAccessorImpl.java:62)
	at sun.reflect.DelegatingMethodAccessorImpl.invoke(DelegatingMethodAccessorImpl.java:43)
	at java.lang.reflect.Method.invoke(Method.java:483)
	at com.carrotsearch.randomizedtesting.RandomizedRunner.invoke(RandomizedRunner.java:1618)
	at com.carrotsearch.randomizedtesting.RandomizedRunner$6.evaluate(RandomizedRunner.java:827)
	at com.carrotsearch.randomizedtesting.RandomizedRunner$7.evaluate(RandomizedRunner.java:863)
	at com.carrotsearch.randomizedtesting.RandomizedRunner$8.evaluate(RandomizedRunner.java:877)
	at org.apache.lucene.util.TestRuleSetupTeardownChained$1.evaluate(TestRuleSetupTeardownChained.java:50)
	at org.apache.lucene.util.TestRuleFieldCacheSanity$1.evaluate(TestRuleFieldCacheSanity.java:51)
	at org.apache.lucene.util.AbstractBeforeAfterRule$1.evaluate(AbstractBeforeAfterRule.java:46)
	at com.carrotsearch.randomizedtesting.rules.SystemPropertiesInvariantRule$1.evaluate(SystemPropertiesInvariantRule.java:55)
	at org.apache.lucene.util.TestRuleThreadAndTestName$1.evaluate(TestRuleThreadAndTestName.java:49)
	at org.apache.lucene.util.TestRuleIgnoreAfterMaxFailures$1.evaluate(TestRuleIgnoreAfterMaxFailures.java:65)
	at org.apache.lucene.util.TestRuleMarkFailure$1.evaluate(TestRuleMarkFailure.java:48)
	at com.carrotsearch.randomizedtesting.rules.StatementAdapter.evaluate(StatementAdapter.java:36)
	at com.carrotsearch.randomizedtesting.ThreadLeakControl$StatementRunner.run(ThreadLeakControl.java:360)
	at com.carrotsearch.randomizedtesting.ThreadLeakControl.forkTimeoutingTask(ThreadLeakControl.java:793)
	at com.carrotsearch.randomizedtesting.ThreadLeakControl$3.evaluate(ThreadLeakControl.java:453)
	at com.carrotsearch.randomizedtesting.RandomizedRunner.runSingleTest(RandomizedRunner.java:836)
	at com.carrotsearch.randomizedtesting.RandomizedRunner$3.evaluate(RandomizedRunner.java:738)
	at com.carrotsearch.randomizedtesting.RandomizedRunner$4.evaluate(RandomizedRunner.java:772)
	at com.carrotsearch.randomizedtesting.RandomizedRunner$5.evaluate(RandomizedRunner.java:783)
	at org.apache.lucene.util.AbstractBeforeAfterRule$1.evaluate(AbstractBeforeAfterRule.java:46)
	at org.apache.lucene.util.TestRuleStoreClassName$1.evaluate(TestRuleStoreClassName.java:42)
	at com.carrotsearch.randomizedtesting.rules.SystemPropertiesInvariantRule$1.evaluate(SystemPropertiesInvariantRule.java:55)
	at com.carrotsearch.randomizedtesting.rules.NoShadowingOrOverridesOnMethodsRule$1.evaluate(NoShadowingOrOverridesOnMethodsRule.java:39)
	at com.carrotsearch.randomizedtesting.rules.NoShadowingOrOverridesOnMethodsRule$1.evaluate(NoShadowingOrOverridesOnMethodsRule.java:39)
	at com.carrotsearch.randomizedtesting.rules.StatementAdapter.evaluate(StatementAdapter.java:36)
	at com.carrotsearch.randomizedtesting.rules.StatementAdapter.evaluate(StatementAdapter.java:36)
	at org.apache.lucene.util.TestRuleAssertionsRequired$1.evaluate(TestRuleAssertionsRequired.java:43)
	at org.apache.lucene.util.TestRuleMarkFailure$1.evaluate(TestRuleMarkFailure.java:48)
	at org.apache.lucene.util.TestRuleIgnoreAfterMaxFailures$1.evaluate(TestRuleIgnoreAfterMaxFailures.java:65)
	at org.apache.lucene.util.TestRuleIgnoreTestSuites$1.evaluate(TestRuleIgnoreTestSuites.java:55)
	at com.carrotsearch.randomizedtesting.rules.StatementAdapter.evaluate(StatementAdapter.java:36)
	at com.carrotsearch.randomizedtesting.ThreadLeakControl$StatementRunner.run(ThreadLeakControl.java:360)
	at java.lang.Thread.run(Thread.java:745)




Build Log:
[...truncated 1140 lines...]
   [junit4] Suite: org.apache.lucene.index.TestIndexWriterExceptions
   [junit4]   2> NOTE: reproduce with: ant test  -Dtestcase=TestIndexWriterExceptions -Dtests.method=testNoLostDeletesOrUpdates
-Dtests.seed=AB3621C114DFE483 -Dtests.multiplier=3 -Dtests.slow=true -Dtests.locale=sr_BA_#Latn
-Dtests.timezone=America/Argentina/Ushuaia -Dtests.file.encoding=UTF-8
   [junit4] FAILURE 4.54s J1 | TestIndexWriterExceptions.testNoLostDeletesOrUpdates <<<
   [junit4]    > Throwable #1: java.lang.AssertionError: doc=2022 expected:<2> but
was:<10>
   [junit4]    > 	at __randomizedtesting.SeedInfo.seed([AB3621C114DFE483:C24D234AE2712EC3]:0)
   [junit4]    > 	at org.apache.lucene.index.TestIndexWriterExceptions.testNoLostDeletesOrUpdates(TestIndexWriterExceptions.java:1918)
   [junit4]    > 	at java.lang.Thread.run(Thread.java:745)
   [junit4]   2> NOTE: leaving temporary files on disk at: /mnt/ssd/jenkins/workspace/Lucene-Solr-4.8-Linux/lucene/build/core/test/J1/./lucene.index.TestIndexWriterExceptions-AB3621C114DFE483-001
   [junit4]   2> NOTE: test params are: codec=Lucene46: {foo=PostingsFormat(name=Direct),
content=PostingsFormat(name=Memory doPackFST= false), crash=PostingsFormat(name=FSTPulsing41),
subid=PostingsFormat(name=FSTPulsing41), content7=PostingsFormat(name=Memory doPackFST= true),
content6=PostingsFormat(name=Memory doPackFST= false), field1=PostingsFormat(name=FSTPulsing41),
content5=PostingsFormat(name=Direct), field=PostingsFormat(name=Direct), content4=PostingsFormat(name=FSTPulsing41),
contents=PostingsFormat(name=Memory doPackFST= true), content2=PostingsFormat(name=Memory
doPackFST= false), content1=PostingsFormat(name=Direct), id=PostingsFormat(name=FSTPulsing41),
field2=PostingsFormat(name=Direct)}, docValues:{binarydv=DocValuesFormat(name=Memory), sortedsetdv=DocValuesFormat(name=Memory),
cf=DocValuesFormat(name=Memory), bf=DocValuesFormat(name=Disk), bcf=DocValuesFormat(name=Lucene45),
numericdv=DocValuesFormat(name=Memory), f=DocValuesFormat(name=SimpleText), sorteddv=DocValuesFormat(name=Memory)},
sim=DefaultSimilarity, locale=sr_BA_#Latn, timezone=America/Argentina/Ushuaia
   [junit4]   2> NOTE: Linux 3.8.0-39-generic amd64/Oracle Corporation 1.8.0_20-ea (64-bit)/cpus=8,threads=1,free=108248920,total=536870912
   [junit4]   2> NOTE: All tests run in this JVM: [TestIntBlockPool, TestConsistentFieldNumbers,
TestBackwardsCompatibility, TestBinaryDocValuesUpdates, TestBooleanScorer, TestLazyProxSkipping,
TestBitVector, TestCodecs, TestBlockPostingsFormat, TestTieredMergePolicy, TestVersion, TestBooleanOr,
TestMathUtil, TestNorms, TestIndexFileDeleter, TestIndexWriterOnJRECrash, TestPerSegmentDeletes,
TestHighCompressionMode, TestDocValuesScoring, TestBufferedIndexInput, TestSmallFloat, TestMinimize,
TestNearSpansOrdered, TestTermRangeFilter, TestSegmentMerger, TestIndexWriterOutOfMemory,
TestLucene40TermVectorsFormat, TestCachingWrapperFilter, TestPayloadExplanations, TestBasics,
TestIndexReaderClose, TestAutomatonQuery, TestDuelingCodecs, TestIndexWriterDelete, TestIntroSorter,
TestSameTokenSamePosition, TestIndexWriterUnicode, TestByteBlockPool, TestFieldMaskingSpanQuery,
TestSloppyPhraseQuery2, TestTotalHitCountCollector, TestFilterAtomicReader, TestNeverDelete,
TestPerFieldPostingsFormat, TestTransactions, TestMultiDocValues, TestTopDocsCollector, TestReusableStringReader,
Test2BTerms, TestSloppyMath, TestField, NestedSetupChain, NestedTeardownChain, TestElevationComparator,
TestWorstCaseTestBehavior, TestCharFilter, TestTermScorer, TestDocument, TestInPlaceMergeSorter,
TestFieldValueFilter, TestCheckIndex, TestAtomicUpdate, TestSearchWithThreads, TestPForDeltaDocIdSet,
TestBufferedChecksum, Nested2, Nested, TestTimSorter, Test2BDocs, TestPayloadSpans, TestFSTs,
TestFuzzyQuery, TestOmitNorms, TestDocsAndPositions, TestEliasFanoDocIdSet, TestRamUsageEstimatorOnWildAnimals,
Nested, TestSnapshotDeletionPolicy, Before3, Before3, TestMatchAllDocsQuery, TestTerm, TestRAMDirectory,
TestToken, TestQueryWrapperFilter, TestRecyclingIntBlockAllocator, TestLucene3xStoredFieldsFormat,
TestSpanExplanations, TestPayloadNearQuery, TestDoc, TestTermInfosReaderIndex, TestIndexWriterMergePolicy,
TestMockDirectoryWrapper, TestTermdocPerf, TestPrefixQuery, TestDateSort, TestIndexInput,
TestBooleanQuery, TestTermVectors, Nested1, TestMultiLevelSkipList, TestPerFieldDocValuesFormat,
TestTermVectorsFormat, TestCompressingTermVectorsFormat, TestIndexWriterWithThreads, TestGraphTokenizers,
TestAddIndexes, TestShardSearching, TestIndexWriterExceptions]
   [junit4] Completed on J1 in 28.17s, 29 tests, 1 failure <<< FAILURES!

[...truncated 590 lines...]
BUILD FAILED
/mnt/ssd/jenkins/workspace/Lucene-Solr-4.8-Linux/build.xml:467: The following error occurred
while executing this line:
/mnt/ssd/jenkins/workspace/Lucene-Solr-4.8-Linux/build.xml:447: The following error occurred
while executing this line:
/mnt/ssd/jenkins/workspace/Lucene-Solr-4.8-Linux/build.xml:45: The following error occurred
while executing this line:
/mnt/ssd/jenkins/workspace/Lucene-Solr-4.8-Linux/extra-targets.xml:37: The following error
occurred while executing this line:
/mnt/ssd/jenkins/workspace/Lucene-Solr-4.8-Linux/lucene/build.xml:49: The following error
occurred while executing this line:
/mnt/ssd/jenkins/workspace/Lucene-Solr-4.8-Linux/lucene/common-build.xml:1293: The following
error occurred while executing this line:
/mnt/ssd/jenkins/workspace/Lucene-Solr-4.8-Linux/lucene/common-build.xml:919: There were test
failures: 398 suites, 2910 tests, 1 failure, 90 ignored (77 assumptions)

Total time: 22 minutes 24 seconds
Build step 'Invoke Ant' marked build as failure
Description set: Java: 64bit/jdk1.8.0_20-ea-b11 -XX:-UseCompressedOops -XX:+UseG1GC
Archiving artifacts
Recording test results
Email was triggered for: Failure
Sending email for trigger: Failure



Mime
View raw message