lucene-dev mailing list archives

Site index · List index
Message view « Date » · « Thread »
Top « Date » · « Thread »
From Policeman Jenkins Server <jenk...@thetaphi.de>
Subject [JENKINS] Lucene-Solr-trunk-MacOSX (64bit/jdk1.7.0) - Build # 1568 - Failure!
Date Sun, 11 May 2014 19:40:43 GMT
Build: http://jenkins.thetaphi.de/job/Lucene-Solr-trunk-MacOSX/1568/
Java: 64bit/jdk1.7.0 -XX:+UseCompressedOops -XX:+UseSerialGC

1 tests failed.
REGRESSION:  org.apache.solr.cloud.OverseerRolesTest.testDistribSearch

Error Message:
could not set the new overseer . expected 127.0.0.1:50649_ current order : [127.0.0.1:50649_, 127.0.0.1:50630_, 127.0.0.1:50637_, 127.0.0.1:50640_, 127.0.0.1:50646_, 127.0.0.1:50634_, 127.0.0.1:50643_] ldr :null

Stack Trace:
java.lang.AssertionError: could not set the new overseer . expected 127.0.0.1:50649_ current order : [127.0.0.1:50649_, 127.0.0.1:50630_, 127.0.0.1:50637_, 127.0.0.1:50640_, 127.0.0.1:50646_, 127.0.0.1:50634_, 127.0.0.1:50643_] ldr :null
	at __randomizedtesting.SeedInfo.seed([A511644ABE1B8AF0:24F7EA52C944EACC]:0)
	at org.junit.Assert.fail(Assert.java:93)
	at org.junit.Assert.assertTrue(Assert.java:43)
	at org.apache.solr.cloud.OverseerRolesTest.testOverseerRole(OverseerRolesTest.java:158)
	at org.apache.solr.cloud.OverseerRolesTest.doTest(OverseerRolesTest.java:94)
	at org.apache.solr.BaseDistributedSearchTestCase.testDistribSearch(BaseDistributedSearchTestCase.java:865)
	at sun.reflect.GeneratedMethodAccessor37.invoke(Unknown Source)
	at sun.reflect.DelegatingMethodAccessorImpl.invoke(DelegatingMethodAccessorImpl.java:43)
	at java.lang.reflect.Method.invoke(Method.java:606)
	at com.carrotsearch.randomizedtesting.RandomizedRunner.invoke(RandomizedRunner.java:1618)
	at com.carrotsearch.randomizedtesting.RandomizedRunner$6.evaluate(RandomizedRunner.java:827)
	at com.carrotsearch.randomizedtesting.RandomizedRunner$7.evaluate(RandomizedRunner.java:863)
	at com.carrotsearch.randomizedtesting.RandomizedRunner$8.evaluate(RandomizedRunner.java:877)
	at com.carrotsearch.randomizedtesting.rules.SystemPropertiesRestoreRule$1.evaluate(SystemPropertiesRestoreRule.java:53)
	at org.apache.lucene.util.TestRuleSetupTeardownChained$1.evaluate(TestRuleSetupTeardownChained.java:50)
	at org.apache.lucene.util.TestRuleFieldCacheSanity$1.evaluate(TestRuleFieldCacheSanity.java:51)
	at org.apache.lucene.util.AbstractBeforeAfterRule$1.evaluate(AbstractBeforeAfterRule.java:46)
	at com.carrotsearch.randomizedtesting.rules.SystemPropertiesInvariantRule$1.evaluate(SystemPropertiesInvariantRule.java:55)
	at org.apache.lucene.util.TestRuleThreadAndTestName$1.evaluate(TestRuleThreadAndTestName.java:49)
	at org.apache.lucene.util.TestRuleIgnoreAfterMaxFailures$1.evaluate(TestRuleIgnoreAfterMaxFailures.java:65)
	at org.apache.lucene.util.TestRuleMarkFailure$1.evaluate(TestRuleMarkFailure.java:48)
	at com.carrotsearch.randomizedtesting.rules.StatementAdapter.evaluate(StatementAdapter.java:36)
	at com.carrotsearch.randomizedtesting.ThreadLeakControl$StatementRunner.run(ThreadLeakControl.java:360)
	at com.carrotsearch.randomizedtesting.ThreadLeakControl.forkTimeoutingTask(ThreadLeakControl.java:793)
	at com.carrotsearch.randomizedtesting.ThreadLeakControl$3.evaluate(ThreadLeakControl.java:453)
	at com.carrotsearch.randomizedtesting.RandomizedRunner.runSingleTest(RandomizedRunner.java:836)
	at com.carrotsearch.randomizedtesting.RandomizedRunner$3.evaluate(RandomizedRunner.java:738)
	at com.carrotsearch.randomizedtesting.RandomizedRunner$4.evaluate(RandomizedRunner.java:772)
	at com.carrotsearch.randomizedtesting.RandomizedRunner$5.evaluate(RandomizedRunner.java:783)
	at com.carrotsearch.randomizedtesting.rules.StatementAdapter.evaluate(StatementAdapter.java:36)
	at com.carrotsearch.randomizedtesting.rules.SystemPropertiesRestoreRule$1.evaluate(SystemPropertiesRestoreRule.java:53)
	at org.apache.lucene.util.AbstractBeforeAfterRule$1.evaluate(AbstractBeforeAfterRule.java:46)
	at org.apache.lucene.util.TestRuleStoreClassName$1.evaluate(TestRuleStoreClassName.java:42)
	at com.carrotsearch.randomizedtesting.rules.SystemPropertiesInvariantRule$1.evaluate(SystemPropertiesInvariantRule.java:55)
	at com.carrotsearch.randomizedtesting.rules.NoShadowingOrOverridesOnMethodsRule$1.evaluate(NoShadowingOrOverridesOnMethodsRule.java:39)
	at com.carrotsearch.randomizedtesting.rules.NoShadowingOrOverridesOnMethodsRule$1.evaluate(NoShadowingOrOverridesOnMethodsRule.java:39)
	at com.carrotsearch.randomizedtesting.rules.StatementAdapter.evaluate(StatementAdapter.java:36)
	at com.carrotsearch.randomizedtesting.rules.StatementAdapter.evaluate(StatementAdapter.java:36)
	at com.carrotsearch.randomizedtesting.rules.StatementAdapter.evaluate(StatementAdapter.java:36)
	at org.apache.lucene.util.TestRuleAssertionsRequired$1.evaluate(TestRuleAssertionsRequired.java:43)
	at org.apache.lucene.util.TestRuleMarkFailure$1.evaluate(TestRuleMarkFailure.java:48)
	at org.apache.lucene.util.TestRuleIgnoreAfterMaxFailures$1.evaluate(TestRuleIgnoreAfterMaxFailures.java:65)
	at org.apache.lucene.util.TestRuleIgnoreTestSuites$1.evaluate(TestRuleIgnoreTestSuites.java:55)
	at com.carrotsearch.randomizedtesting.rules.StatementAdapter.evaluate(StatementAdapter.java:36)
	at com.carrotsearch.randomizedtesting.ThreadLeakControl$StatementRunner.run(ThreadLeakControl.java:360)
	at java.lang.Thread.run(Thread.java:745)




Build Log:
[...truncated 10932 lines...]
   [junit4] Suite: org.apache.solr.cloud.OverseerRolesTest
   [junit4]   2> Creating dataDir: /Users/jenkins/workspace/Lucene-Solr-trunk-MacOSX/solr/build/solr-core/test/J0/./solr.cloud.OverseerRolesTest-A511644ABE1B8AF0-001/init-core-data-001
   [junit4]   2> 1303825 T3858 oas.BaseDistributedSearchTestCase.initHostContext Setting hostContext system property: /
   [junit4]   2> 1303838 T3858 oas.SolrTestCaseJ4.setUp ###Starting testDistribSearch
   [junit4]   2> 1303839 T3858 oasc.ZkTestServer.run STARTING ZK TEST SERVER
   [junit4]   1> client port:0.0.0.0/0.0.0.0:0
   [junit4]   2> 1303840 T3859 oasc.ZkTestServer$ZKServerMain.runFromConfig Starting server
   [junit4]   2> 1303941 T3858 oasc.ZkTestServer.run start zk server on port:50627
   [junit4]   2> 1303944 T3858 oascc.ConnectionManager.waitForConnected Waiting for client to connect to ZooKeeper
   [junit4]   2> 1303957 T3865 oascc.ConnectionManager.process Watcher org.apache.solr.common.cloud.ConnectionManager@2dff8e34 name:ZooKeeperConnection Watcher:127.0.0.1:50627 got event WatchedEvent state:SyncConnected type:None path:null path:null type:None
   [junit4]   2> 1303958 T3858 oascc.ConnectionManager.waitForConnected Client is connected to ZooKeeper
   [junit4]   2> 1303958 T3858 oascc.SolrZkClient.makePath makePath: /solr
   [junit4]   2> 1303970 T3858 oascc.ConnectionManager.waitForConnected Waiting for client to connect to ZooKeeper
   [junit4]   2> 1303976 T3867 oascc.ConnectionManager.process Watcher org.apache.solr.common.cloud.ConnectionManager@c42d1d7 name:ZooKeeperConnection Watcher:127.0.0.1:50627/solr got event WatchedEvent state:SyncConnected type:None path:null path:null type:None
   [junit4]   2> 1303976 T3858 oascc.ConnectionManager.waitForConnected Client is connected to ZooKeeper
   [junit4]   2> 1303977 T3858 oascc.SolrZkClient.makePath makePath: /collections/collection1
   [junit4]   2> 1303988 T3858 oascc.SolrZkClient.makePath makePath: /collections/collection1/shards
   [junit4]   2> 1303998 T3858 oascc.SolrZkClient.makePath makePath: /collections/control_collection
   [junit4]   2> 1304006 T3858 oascc.SolrZkClient.makePath makePath: /collections/control_collection/shards
   [junit4]   2> 1304016 T3858 oasc.AbstractZkTestCase.putConfig put /Users/jenkins/workspace/Lucene-Solr-trunk-MacOSX/solr/core/src/test-files/solr/collection1/conf/solrconfig-tlog.xml to /configs/conf1/solrconfig.xml
   [junit4]   2> 1304017 T3858 oascc.SolrZkClient.makePath makePath: /configs/conf1/solrconfig.xml
   [junit4]   2> 1304030 T3858 oasc.AbstractZkTestCase.putConfig put /Users/jenkins/workspace/Lucene-Solr-trunk-MacOSX/solr/core/src/test-files/solr/collection1/conf/schema.xml to /configs/conf1/schema.xml
   [junit4]   2> 1304031 T3858 oascc.SolrZkClient.makePath makePath: /configs/conf1/schema.xml
   [junit4]   2> 1304041 T3858 oasc.AbstractZkTestCase.putConfig put /Users/jenkins/workspace/Lucene-Solr-trunk-MacOSX/solr/core/src/test-files/solr/collection1/conf/solrconfig.snippet.randomindexconfig.xml to /configs/conf1/solrconfig.snippet.randomindexconfig.xml
   [junit4]   2> 1304042 T3858 oascc.SolrZkClient.makePath makePath: /configs/conf1/solrconfig.snippet.randomindexconfig.xml
   [junit4]   2> 1304051 T3858 oasc.AbstractZkTestCase.putConfig put /Users/jenkins/workspace/Lucene-Solr-trunk-MacOSX/solr/core/src/test-files/solr/collection1/conf/stopwords.txt to /configs/conf1/stopwords.txt
   [junit4]   2> 1304051 T3858 oascc.SolrZkClient.makePath makePath: /configs/conf1/stopwords.txt
   [junit4]   2> 1304061 T3858 oasc.AbstractZkTestCase.putConfig put /Users/jenkins/workspace/Lucene-Solr-trunk-MacOSX/solr/core/src/test-files/solr/collection1/conf/protwords.txt to /configs/conf1/protwords.txt
   [junit4]   2> 1304062 T3858 oascc.SolrZkClient.makePath makePath: /configs/conf1/protwords.txt
   [junit4]   2> 1304073 T3858 oasc.AbstractZkTestCase.putConfig put /Users/jenkins/workspace/Lucene-Solr-trunk-MacOSX/solr/core/src/test-files/solr/collection1/conf/currency.xml to /configs/conf1/currency.xml
   [junit4]   2> 1304074 T3858 oascc.SolrZkClient.makePath makePath: /configs/conf1/currency.xml
   [junit4]   2> 1304084 T3858 oasc.AbstractZkTestCase.putConfig put /Users/jenkins/workspace/Lucene-Solr-trunk-MacOSX/solr/core/src/test-files/solr/collection1/conf/enumsConfig.xml to /configs/conf1/enumsConfig.xml
   [junit4]   2> 1304085 T3858 oascc.SolrZkClient.makePath makePath: /configs/conf1/enumsConfig.xml
   [junit4]   2> 1304101 T3858 oasc.AbstractZkTestCase.putConfig put /Users/jenkins/workspace/Lucene-Solr-trunk-MacOSX/solr/core/src/test-files/solr/collection1/conf/open-exchange-rates.json to /configs/conf1/open-exchange-rates.json
   [junit4]   2> 1304102 T3858 oascc.SolrZkClient.makePath makePath: /configs/conf1/open-exchange-rates.json
   [junit4]   2> 1304113 T3858 oasc.AbstractZkTestCase.putConfig put /Users/jenkins/workspace/Lucene-Solr-trunk-MacOSX/solr/core/src/test-files/solr/collection1/conf/mapping-ISOLatin1Accent.txt to /configs/conf1/mapping-ISOLatin1Accent.txt
   [junit4]   2> 1304114 T3858 oascc.SolrZkClient.makePath makePath: /configs/conf1/mapping-ISOLatin1Accent.txt
   [junit4]   2> 1304128 T3858 oasc.AbstractZkTestCase.putConfig put /Users/jenkins/workspace/Lucene-Solr-trunk-MacOSX/solr/core/src/test-files/solr/collection1/conf/old_synonyms.txt to /configs/conf1/old_synonyms.txt
   [junit4]   2> 1304129 T3858 oascc.SolrZkClient.makePath makePath: /configs/conf1/old_synonyms.txt
   [junit4]   2> 1304146 T3858 oasc.AbstractZkTestCase.putConfig put /Users/jenkins/workspace/Lucene-Solr-trunk-MacOSX/solr/core/src/test-files/solr/collection1/conf/synonyms.txt to /configs/conf1/synonyms.txt
   [junit4]   2> 1304147 T3858 oascc.SolrZkClient.makePath makePath: /configs/conf1/synonyms.txt
   [junit4]   2> 1305988 T3858 oejs.Server.doStart jetty-8.1.10.v20130312
   [junit4]   2> 1305997 T3858 oejs.AbstractConnector.doStart Started SelectChannelConnector@127.0.0.1:50630
   [junit4]   2> 1305998 T3858 oass.SolrDispatchFilter.init SolrDispatchFilter.init()
   [junit4]   2> 1305999 T3858 oasc.SolrResourceLoader.locateSolrHome JNDI not configured for solr (NoInitialContextEx)
   [junit4]   2> 1305999 T3858 oasc.SolrResourceLoader.locateSolrHome using system property solr.solr.home: ./solr.cloud.OverseerRolesTest-A511644ABE1B8AF0-001/tempDir-002
   [junit4]   2> 1306000 T3858 oasc.SolrResourceLoader.<init> new SolrResourceLoader for directory: './solr.cloud.OverseerRolesTest-A511644ABE1B8AF0-001/tempDir-002/'
   [junit4]   2> 1306041 T3858 oasc.ConfigSolr.fromFile Loading container configuration from /Users/jenkins/workspace/Lucene-Solr-trunk-MacOSX/solr/build/solr-core/test/J0/./solr.cloud.OverseerRolesTest-A511644ABE1B8AF0-001/tempDir-002/solr.xml
   [junit4]   2> 1306129 T3858 oasc.CorePropertiesLocator.<init> Config-defined core root directory: /Users/jenkins/workspace/Lucene-Solr-trunk-MacOSX/solr/build/solr-core/test/J0/./solr.cloud.OverseerRolesTest-A511644ABE1B8AF0-001/tempDir-002
   [junit4]   2> 1306130 T3858 oasc.CoreContainer.<init> New CoreContainer 374963891
   [junit4]   2> 1306130 T3858 oasc.CoreContainer.load Loading cores into CoreContainer [instanceDir=./solr.cloud.OverseerRolesTest-A511644ABE1B8AF0-001/tempDir-002/]
   [junit4]   2> 1306131 T3858 oashc.HttpShardHandlerFactory.getParameter Setting socketTimeout to: 90000
   [junit4]   2> 1306132 T3858 oashc.HttpShardHandlerFactory.getParameter Setting urlScheme to: 
   [junit4]   2> 1306132 T3858 oashc.HttpShardHandlerFactory.getParameter Setting connTimeout to: 15000
   [junit4]   2> 1306132 T3858 oashc.HttpShardHandlerFactory.getParameter Setting maxConnectionsPerHost to: 20
   [junit4]   2> 1306132 T3858 oashc.HttpShardHandlerFactory.getParameter Setting corePoolSize to: 0
   [junit4]   2> 1306133 T3858 oashc.HttpShardHandlerFactory.getParameter Setting maximumPoolSize to: 2147483647
   [junit4]   2> 1306133 T3858 oashc.HttpShardHandlerFactory.getParameter Setting maxThreadIdleTime to: 5
   [junit4]   2> 1306133 T3858 oashc.HttpShardHandlerFactory.getParameter Setting sizeOfQueue to: -1
   [junit4]   2> 1306134 T3858 oashc.HttpShardHandlerFactory.getParameter Setting fairnessPolicy to: false
   [junit4]   2> 1306134 T3858 oasl.LogWatcher.createWatcher SLF4J impl is org.slf4j.impl.Log4jLoggerFactory
   [junit4]   2> 1306135 T3858 oasl.LogWatcher.newRegisteredLogWatcher Registering Log Listener [Log4j (org.slf4j.impl.Log4jLoggerFactory)]
   [junit4]   2> 1306135 T3858 oasc.CoreContainer.load Host Name: 127.0.0.1
   [junit4]   2> 1306135 T3858 oasc.ZkContainer.initZooKeeper Zookeeper client=127.0.0.1:50627/solr
   [junit4]   2> 1306136 T3858 oasc.ZkController.checkChrootPath zkHost includes chroot
   [junit4]   2> 1306137 T3858 oascc.ConnectionManager.waitForConnected Waiting for client to connect to ZooKeeper
   [junit4]   2> 1306142 T3878 oascc.ConnectionManager.process Watcher org.apache.solr.common.cloud.ConnectionManager@4d8d253b name:ZooKeeperConnection Watcher:127.0.0.1:50627 got event WatchedEvent state:SyncConnected type:None path:null path:null type:None
   [junit4]   2> 1306143 T3858 oascc.ConnectionManager.waitForConnected Client is connected to ZooKeeper
   [junit4]   2> 1306148 T3858 oascc.ConnectionManager.waitForConnected Waiting for client to connect to ZooKeeper
   [junit4]   2> 1306151 T3880 oascc.ConnectionManager.process Watcher org.apache.solr.common.cloud.ConnectionManager@1375bf0c name:ZooKeeperConnection Watcher:127.0.0.1:50627/solr got event WatchedEvent state:SyncConnected type:None path:null path:null type:None
   [junit4]   2> 1306152 T3858 oascc.ConnectionManager.waitForConnected Client is connected to ZooKeeper
   [junit4]   2> 1306156 T3858 oascc.SolrZkClient.makePath makePath: /overseer/queue
   [junit4]   2> 1306167 T3858 oascc.SolrZkClient.makePath makePath: /overseer/collection-queue-work
   [junit4]   2> 1306179 T3858 oascc.SolrZkClient.makePath makePath: /overseer/collection-map-running
   [junit4]   2> 1306189 T3858 oascc.SolrZkClient.makePath makePath: /overseer/collection-map-completed
   [junit4]   2> 1306200 T3858 oascc.SolrZkClient.makePath makePath: /overseer/collection-map-failure
   [junit4]   2> 1306210 T3858 oascc.SolrZkClient.makePath makePath: /live_nodes
   [junit4]   2> 1306215 T3858 oasc.ZkController.createEphemeralLiveNode Register node as live in ZooKeeper:/live_nodes/127.0.0.1:50630_
   [junit4]   2> 1306217 T3858 oascc.SolrZkClient.makePath makePath: /live_nodes/127.0.0.1:50630_
   [junit4]   2> 1306227 T3858 oascc.SolrZkClient.makePath makePath: /overseer_elect
   [junit4]   2> 1306233 T3858 oascc.SolrZkClient.makePath makePath: /overseer_elect/election
   [junit4]   2> 1306245 T3858 oasc.OverseerElectionContext.runLeaderProcess I am going to be the leader 127.0.0.1:50630_
   [junit4]   2> 1306246 T3858 oascc.SolrZkClient.makePath makePath: /overseer_elect/leader
   [junit4]   2> 1306252 T3858 oasc.Overseer.start Overseer (id=91739532891848707-127.0.0.1:50630_-n_0000000000) starting
   [junit4]   2> 1306262 T3858 oascc.SolrZkClient.makePath makePath: /overseer/queue-work
   [junit4]   2> 1306305 T3882 oasc.OverseerCollectionProcessor.run Process current queue of collection creations
   [junit4]   2> 1306308 T3858 oascc.SolrZkClient.makePath makePath: /clusterstate.json
   [junit4]   2> 1306309 T3882 oasc.OverseerCollectionProcessor.prioritizeOverseerNodes prioritizing overseer nodes at 127.0.0.1:50630_
   [junit4]   2> 1306316 T3858 oascc.SolrZkClient.makePath makePath: /aliases.json
   [junit4]   2> 1306320 T3858 oascc.ZkStateReader.createClusterStateWatchersAndUpdate Updating cluster state from ZooKeeper... 
   [junit4]   2> 1306329 T3881 oasc.Overseer$ClusterStateUpdater.run Starting to work on the main queue
   [junit4]   2> 1306335 T3858 oasc.CorePropertiesLocator.discover Looking for core definitions underneath /Users/jenkins/workspace/Lucene-Solr-trunk-MacOSX/solr/build/solr-core/test/J0/./solr.cloud.OverseerRolesTest-A511644ABE1B8AF0-001/tempDir-002
   [junit4]   2> 1306832 T3858 oasc.CorePropertiesLocator.discoverUnder Found core conf in /Users/jenkins/workspace/Lucene-Solr-trunk-MacOSX/solr/build/solr-core/test/J0/./solr.cloud.OverseerRolesTest-A511644ABE1B8AF0-001/tempDir-002/conf/
   [junit4]   2> 1306889 T3858 oasc.CorePropertiesLocator.discover Found 1 core definitions
   [junit4]   2> 1306892 T3858 oass.SolrDispatchFilter.init user.dir=/Users/jenkins/workspace/Lucene-Solr-trunk-MacOSX/solr/build/solr-core/test/J0
   [junit4]   2> 1306892 T3858 oass.SolrDispatchFilter.init SolrDispatchFilter.init() done
   [junit4]   2> 1306895 T3858 oascc.ConnectionManager.waitForConnected Waiting for client to connect to ZooKeeper
   [junit4]   2> 1306898 T3885 oascc.ConnectionManager.process Watcher org.apache.solr.common.cloud.ConnectionManager@3fc9a779 name:ZooKeeperConnection Watcher:127.0.0.1:50627/solr got event WatchedEvent state:SyncConnected type:None path:null path:null type:None
   [junit4]   2> 1306900 T3858 oascc.ConnectionManager.waitForConnected Client is connected to ZooKeeper
   [junit4]   2> 1306904 T3858 oascc.ZkStateReader.createClusterStateWatchersAndUpdate Updating cluster state from ZooKeeper... 
   [junit4]   2> 1306918 T3858 oasc.ChaosMonkey.monkeyLog monkey: init - expire sessions:false cause connection loss:false
   [junit4]   2> 1308434 T3858 oasc.AbstractFullDistribZkTestBase.createJettys create jetty 1
   [junit4]   2> 1308435 T3858 oejs.Server.doStart jetty-8.1.10.v20130312
   [junit4]   2> 1308445 T3858 oejs.AbstractConnector.doStart Started SelectChannelConnector@127.0.0.1:50634
   [junit4]   2> 1308447 T3858 oass.SolrDispatchFilter.init SolrDispatchFilter.init()
   [junit4]   2> 1308447 T3858 oasc.SolrResourceLoader.locateSolrHome JNDI not configured for solr (NoInitialContextEx)
   [junit4]   2> 1308448 T3858 oasc.SolrResourceLoader.locateSolrHome using system property solr.solr.home: ../../../../../../../../../Users/jenkins/workspace/Lucene-Solr-trunk-MacOSX/solr/build/solr-core/test/J0/./solr.cloud.OverseerRolesTest-A511644ABE1B8AF0-001/tempDir-003
   [junit4]   2> 1308449 T3858 oasc.SolrResourceLoader.<init> new SolrResourceLoader for directory: '../../../../../../../../../Users/jenkins/workspace/Lucene-Solr-trunk-MacOSX/solr/build/solr-core/test/J0/./solr.cloud.OverseerRolesTest-A511644ABE1B8AF0-001/tempDir-003/'
   [junit4]   2> 1308491 T3858 oasc.ConfigSolr.fromFile Loading container configuration from /Users/jenkins/workspace/Lucene-Solr-trunk-MacOSX/solr/build/solr-core/test/J0/../../../../../../../../../Users/jenkins/workspace/Lucene-Solr-trunk-MacOSX/solr/build/solr-core/test/J0/./solr.cloud.OverseerRolesTest-A511644ABE1B8AF0-001/tempDir-003/solr.xml
   [junit4]   2> 1308582 T3858 oasc.CorePropertiesLocator.<init> Config-defined core root directory: /Users/jenkins/workspace/Lucene-Solr-trunk-MacOSX/solr/build/solr-core/test/J0/../../../../../../../../../Users/jenkins/workspace/Lucene-Solr-trunk-MacOSX/solr/build/solr-core/test/J0/./solr.cloud.OverseerRolesTest-A511644ABE1B8AF0-001/tempDir-003
   [junit4]   2> 1308583 T3858 oasc.CoreContainer.<init> New CoreContainer 67593371
   [junit4]   2> 1308583 T3858 oasc.CoreContainer.load Loading cores into CoreContainer [instanceDir=../../../../../../../../../Users/jenkins/workspace/Lucene-Solr-trunk-MacOSX/solr/build/solr-core/test/J0/./solr.cloud.OverseerRolesTest-A511644ABE1B8AF0-001/tempDir-003/]
   [junit4]   2> 1308584 T3858 oashc.HttpShardHandlerFactory.getParameter Setting socketTimeout to: 90000
   [junit4]   2> 1308584 T3858 oashc.HttpShardHandlerFactory.getParameter Setting urlScheme to: 
   [junit4]   2> 1308586 T3858 oashc.HttpShardHandlerFactory.getParameter Setting connTimeout to: 15000
   [junit4]   2> 1308586 T3858 oashc.HttpShardHandlerFactory.getParameter Setting maxConnectionsPerHost to: 20
   [junit4]   2> 1308586 T3858 oashc.HttpShardHandlerFactory.getParameter Setting corePoolSize to: 0
   [junit4]   2> 1308587 T3858 oashc.HttpShardHandlerFactory.getParameter Setting maximumPoolSize to: 2147483647
   [junit4]   2> 1308587 T3858 oashc.HttpShardHandlerFactory.getParameter Setting maxThreadIdleTime to: 5
   [junit4]   2> 1308587 T3858 oashc.HttpShardHandlerFactory.getParameter Setting sizeOfQueue to: -1
   [junit4]   2> 1308588 T3858 oashc.HttpShardHandlerFactory.getParameter Setting fairnessPolicy to: false
   [junit4]   2> 1308588 T3858 oasl.LogWatcher.createWatcher SLF4J impl is org.slf4j.impl.Log4jLoggerFactory
   [junit4]   2> 1308589 T3858 oasl.LogWatcher.newRegisteredLogWatcher Registering Log Listener [Log4j (org.slf4j.impl.Log4jLoggerFactory)]
   [junit4]   2> 1308589 T3858 oasc.CoreContainer.load Host Name: 127.0.0.1
   [junit4]   2> 1308590 T3858 oasc.ZkContainer.initZooKeeper Zookeeper client=127.0.0.1:50627/solr
   [junit4]   2> 1308590 T3858 oasc.ZkController.checkChrootPath zkHost includes chroot
   [junit4]   2> 1308592 T3858 oascc.ConnectionManager.waitForConnected Waiting for client to connect to ZooKeeper
   [junit4]   2> 1308595 T3896 oascc.ConnectionManager.process Watcher org.apache.solr.common.cloud.ConnectionManager@15dfe2e name:ZooKeeperConnection Watcher:127.0.0.1:50627 got event WatchedEvent state:SyncConnected type:None path:null path:null type:None
   [junit4]   2> 1308596 T3858 oascc.ConnectionManager.waitForConnected Client is connected to ZooKeeper
   [junit4]   2> 1308602 T3858 oascc.ConnectionManager.waitForConnected Waiting for client to connect to ZooKeeper
   [junit4]   2> 1308609 T3898 oascc.ConnectionManager.process Watcher org.apache.solr.common.cloud.ConnectionManager@57dbb7c2 name:ZooKeeperConnection Watcher:127.0.0.1:50627/solr got event WatchedEvent state:SyncConnected type:None path:null path:null type:None
   [junit4]   2> 1308610 T3858 oascc.ConnectionManager.waitForConnected Client is connected to ZooKeeper
   [junit4]   2> 1308634 T3858 oascc.ZkStateReader.createClusterStateWatchersAndUpdate Updating cluster state from ZooKeeper... 
   [junit4]   2> 1309645 T3858 oasc.ZkController.createEphemeralLiveNode Register node as live in ZooKeeper:/live_nodes/127.0.0.1:50634_
   [junit4]   2> 1309647 T3858 oascc.SolrZkClient.makePath makePath: /live_nodes/127.0.0.1:50634_
   [junit4]   2> 1309671 T3858 oasc.CorePropertiesLocator.discover Looking for core definitions underneath /Users/jenkins/workspace/Lucene-Solr-trunk-MacOSX/solr/build/solr-core/test/J0/../../../../../../../../../Users/jenkins/workspace/Lucene-Solr-trunk-MacOSX/solr/build/solr-core/test/J0/./solr.cloud.OverseerRolesTest-A511644ABE1B8AF0-001/tempDir-003
   [junit4]   2> 1310434 T3858 oasc.CorePropertiesLocator.discoverUnder Found core conf in /Users/jenkins/workspace/Lucene-Solr-trunk-MacOSX/solr/build/solr-core/test/J0/../../../../../../../../../Users/jenkins/workspace/Lucene-Solr-trunk-MacOSX/solr/build/solr-core/test/J0/./solr.cloud.OverseerRolesTest-A511644ABE1B8AF0-001/tempDir-003/conf/
   [junit4]   2> 1310518 T3858 oasc.CorePropertiesLocator.discover Found 1 core definitions
   [junit4]   2> 1310520 T3858 oass.SolrDispatchFilter.init user.dir=/Users/jenkins/workspace/Lucene-Solr-trunk-MacOSX/solr/build/solr-core/test/J0
   [junit4]   2> 1310521 T3858 oass.SolrDispatchFilter.init SolrDispatchFilter.init() done
   [junit4]   2> 1312065 T3858 oasc.AbstractFullDistribZkTestBase.createJettys create jetty 2
   [junit4]   2> 1312066 T3858 oejs.Server.doStart jetty-8.1.10.v20130312
   [junit4]   2> 1312073 T3858 oejs.AbstractConnector.doStart Started SelectChannelConnector@127.0.0.1:50637
   [junit4]   2> 1312075 T3858 oass.SolrDispatchFilter.init SolrDispatchFilter.init()
   [junit4]   2> 1312075 T3858 oasc.SolrResourceLoader.locateSolrHome JNDI not configured for solr (NoInitialContextEx)
   [junit4]   2> 1312076 T3858 oasc.SolrResourceLoader.locateSolrHome using system property solr.solr.home: ../../../../../../../../../Users/jenkins/workspace/Lucene-Solr-trunk-MacOSX/solr/build/solr-core/test/J0/./solr.cloud.OverseerRolesTest-A511644ABE1B8AF0-001/tempDir-004
   [junit4]   2> 1312076 T3858 oasc.SolrResourceLoader.<init> new SolrResourceLoader for directory: '../../../../../../../../../Users/jenkins/workspace/Lucene-Solr-trunk-MacOSX/solr/build/solr-core/test/J0/./solr.cloud.OverseerRolesTest-A511644ABE1B8AF0-001/tempDir-004/'
   [junit4]   2> 1312125 T3858 oasc.ConfigSolr.fromFile Loading container configuration from /Users/jenkins/workspace/Lucene-Solr-trunk-MacOSX/solr/build/solr-core/test/J0/../../../../../../../../../Users/jenkins/workspace/Lucene-Solr-trunk-MacOSX/solr/build/solr-core/test/J0/./solr.cloud.OverseerRolesTest-A511644ABE1B8AF0-001/tempDir-004/solr.xml
   [junit4]   2> 1312234 T3858 oasc.CorePropertiesLocator.<init> Config-defined core root directory: /Users/jenkins/workspace/Lucene-Solr-trunk-MacOSX/solr/build/solr-core/test/J0/../../../../../../../../../Users/jenkins/workspace/Lucene-Solr-trunk-MacOSX/solr/build/solr-core/test/J0/./solr.cloud.OverseerRolesTest-A511644ABE1B8AF0-001/tempDir-004
   [junit4]   2> 1312234 T3858 oasc.CoreContainer.<init> New CoreContainer 1292223787
   [junit4]   2> 1312235 T3858 oasc.CoreContainer.load Loading cores into CoreContainer [instanceDir=../../../../../../../../../Users/jenkins/workspace/Lucene-Solr-trunk-MacOSX/solr/build/solr-core/test/J0/./solr.cloud.OverseerRolesTest-A511644ABE1B8AF0-001/tempDir-004/]
   [junit4]   2> 1312236 T3858 oashc.HttpShardHandlerFactory.getParameter Setting socketTimeout to: 90000
   [junit4]   2> 1312237 T3858 oashc.HttpShardHandlerFactory.getParameter Setting urlScheme to: 
   [junit4]   2> 1312238 T3858 oashc.HttpShardHandlerFactory.getParameter Setting connTimeout to: 15000
   [junit4]   2> 1312238 T3858 oashc.HttpShardHandlerFactory.getParameter Setting maxConnectionsPerHost to: 20
   [junit4]   2> 1312238 T3858 oashc.HttpShardHandlerFactory.getParameter Setting corePoolSize to: 0
   [junit4]   2> 1312238 T3858 oashc.HttpShardHandlerFactory.getParameter Setting maximumPoolSize to: 2147483647
   [junit4]   2> 1312239 T3858 oashc.HttpShardHandlerFactory.getParameter Setting maxThreadIdleTime to: 5
   [junit4]   2> 1312240 T3858 oashc.HttpShardHandlerFactory.getParameter Setting sizeOfQueue to: -1
   [junit4]   2> 1312240 T3858 oashc.HttpShardHandlerFactory.getParameter Setting fairnessPolicy to: false
   [junit4]   2> 1312240 T3858 oasl.LogWatcher.createWatcher SLF4J impl is org.slf4j.impl.Log4jLoggerFactory
   [junit4]   2> 1312241 T3858 oasl.LogWatcher.newRegisteredLogWatcher Registering Log Listener [Log4j (org.slf4j.impl.Log4jLoggerFactory)]
   [junit4]   2> 1312242 T3858 oasc.CoreContainer.load Host Name: 127.0.0.1
   [junit4]   2> 1312242 T3858 oasc.ZkContainer.initZooKeeper Zookeeper client=127.0.0.1:50627/solr
   [junit4]   2> 1312242 T3858 oasc.ZkController.checkChrootPath zkHost includes chroot
   [junit4]   2> 1312244 T3858 oascc.ConnectionManager.waitForConnected Waiting for client to connect to ZooKeeper
   [junit4]   2> 1312248 T3910 oascc.ConnectionManager.process Watcher org.apache.solr.common.cloud.ConnectionManager@35d3b18e name:ZooKeeperConnection Watcher:127.0.0.1:50627 got event WatchedEvent state:SyncConnected type:None path:null path:null type:None
   [junit4]   2> 1312249 T3858 oascc.ConnectionManager.waitForConnected Client is connected to ZooKeeper
   [junit4]   2> 1312254 T3858 oascc.ConnectionManager.waitForConnected Waiting for client to connect to ZooKeeper
   [junit4]   2> 1312259 T3912 oascc.ConnectionManager.process Watcher org.apache.solr.common.cloud.ConnectionManager@565b0938 name:ZooKeeperConnection Watcher:127.0.0.1:50627/solr got event WatchedEvent state:SyncConnected type:None path:null path:null type:None
   [junit4]   2> 1312259 T3858 oascc.ConnectionManager.waitForConnected Client is connected to ZooKeeper
   [junit4]   2> 1312285 T3858 oascc.ZkStateReader.createClusterStateWatchersAndUpdate Updating cluster state from ZooKeeper... 
   [junit4]   2> 1313296 T3858 oasc.ZkController.createEphemeralLiveNode Register node as live in ZooKeeper:/live_nodes/127.0.0.1:50637_
   [junit4]   2> 1313299 T3858 oascc.SolrZkClient.makePath makePath: /live_nodes/127.0.0.1:50637_
   [junit4]   2> 1313327 T3858 oasc.CorePropertiesLocator.discover Looking for core definitions underneath /Users/jenkins/workspace/Lucene-Solr-trunk-MacOSX/solr/build/solr-core/test/J0/../../../../../../../../../Users/jenkins/workspace/Lucene-Solr-trunk-MacOSX/solr/build/solr-core/test/J0/./solr.cloud.OverseerRolesTest-A511644ABE1B8AF0-001/tempDir-004
   [junit4]   2> 1314042 T3858 oasc.CorePropertiesLocator.discoverUnder Found core conf in /Users/jenkins/workspace/Lucene-Solr-trunk-MacOSX/solr/build/solr-core/test/J0/../../../../../../../../../Users/jenkins/workspace/Lucene-Solr-trunk-MacOSX/solr/build/solr-core/test/J0/./solr.cloud.OverseerRolesTest-A511644ABE1B8AF0-001/tempDir-004/conf/
   [junit4]   2> 1314126 T3858 oasc.CorePropertiesLocator.discover Found 1 core definitions
   [junit4]   2> 1314130 T3858 oass.SolrDispatchFilter.init user.dir=/Users/jenkins/workspace/Lucene-Solr-trunk-MacOSX/solr/build/solr-core/test/J0
   [junit4]   2> 1314131 T3858 oass.SolrDispatchFilter.init SolrDispatchFilter.init() done
   [junit4]   2> 1315900 T3858 oasc.AbstractFullDistribZkTestBase.createJettys create jetty 3
   [junit4]   2> 1315901 T3858 oejs.Server.doStart jetty-8.1.10.v20130312
   [junit4]   2> 1315907 T3858 oejs.AbstractConnector.doStart Started SelectChannelConnector@127.0.0.1:50640
   [junit4]   2> 1315909 T3858 oass.SolrDispatchFilter.init SolrDispatchFilter.init()
   [junit4]   2> 1315909 T3858 oasc.SolrResourceLoader.locateSolrHome JNDI not configured for solr (NoInitialContextEx)
   [junit4]   2> 1315909 T3858 oasc.SolrResourceLoader.locateSolrHome using system property solr.solr.home: ./solr.cloud.OverseerRolesTest-A511644ABE1B8AF0-001/tempDir-005
   [junit4]   2> 1315910 T3858 oasc.SolrResourceLoader.<init> new SolrResourceLoader for directory: './solr.cloud.OverseerRolesTest-A511644ABE1B8AF0-001/tempDir-005/'
   [junit4]   2> 1315975 T3858 oasc.ConfigSolr.fromFile Loading container configuration from /Users/jenkins/workspace/Lucene-Solr-trunk-MacOSX/solr/build/solr-core/test/J0/./solr.cloud.OverseerRolesTest-A511644ABE1B8AF0-001/tempDir-005/solr.xml
   [junit4]   2> 1316091 T3858 oasc.CorePropertiesLocator.<init> Config-defined core root directory: /Users/jenkins/workspace/Lucene-Solr-trunk-MacOSX/solr/build/solr-core/test/J0/./solr.cloud.OverseerRolesTest-A511644ABE1B8AF0-001/tempDir-005
   [junit4]   2> 1316092 T3858 oasc.CoreContainer.<init> New CoreContainer 555584348
   [junit4]   2> 1316092 T3858 oasc.CoreContainer.load Loading cores into CoreContainer [instanceDir=./solr.cloud.OverseerRolesTest-A511644ABE1B8AF0-001/tempDir-005/]
   [junit4]   2> 1316094 T3858 oashc.HttpShardHandlerFactory.getParameter Setting socketTimeout to: 90000
   [junit4]   2> 1316094 T3858 oashc.HttpShardHandlerFactory.getParameter Setting urlScheme to: 
   [junit4]   2> 1316095 T3858 oashc.HttpShardHandlerFactory.getParameter Setting connTimeout to: 15000
   [junit4]   2> 1316095 T3858 oashc.HttpShardHandlerFactory.getParameter Setting maxConnectionsPerHost to: 20
   [junit4]   2> 1316095 T3858 oashc.HttpShardHandlerFactory.getParameter Setting corePoolSize to: 0
   [junit4]   2> 1316096 T3858 oashc.HttpShardHandlerFactory.getParameter Setting maximumPoolSize to: 2147483647
   [junit4]   2> 1316097 T3858 oashc.HttpShardHandlerFactory.getParameter Setting maxThreadIdleTime to: 5
   [junit4]   2> 1316097 T3858 oashc.HttpShardHandlerFactory.getParameter Setting sizeOfQueue to: -1
   [junit4]   2> 1316097 T3858 oashc.HttpShardHandlerFactory.getParameter Setting fairnessPolicy to: false
   [junit4]   2> 1316097 T3858 oasl.LogWatcher.createWatcher SLF4J impl is org.slf4j.impl.Log4jLoggerFactory
   [junit4]   2> 1316098 T3858 oasl.LogWatcher.newRegisteredLogWatcher Registering Log Listener [Log4j (org.slf4j.impl.Log4jLoggerFactory)]
   [junit4]   2> 1316099 T3858 oasc.CoreContainer.load Host Name: 127.0.0.1
   [junit4]   2> 1316099 T3858 oasc.ZkContainer.initZooKeeper Zookeeper client=127.0.0.1:50627/solr
   [junit4]   2> 1316099 T3858 oasc.ZkController.checkChrootPath zkHost includes chroot
   [junit4]   2> 1316102 T3858 oascc.ConnectionManager.waitForConnected Waiting for client to connect to ZooKeeper
   [junit4]   2> 1316107 T3924 oascc.ConnectionManager.process Watcher org.apache.solr.common.cloud.ConnectionManager@1aa85600 name:ZooKeeperConnection Watcher:127.0.0.1:50627 got event WatchedEvent state:SyncConnected type:None path:null path:null type:None
   [junit4]   2> 1316108 T3858 oascc.ConnectionManager.waitForConnected Client is connected to ZooKeeper
   [junit4]   2> 1316114 T3858 oascc.ConnectionManager.waitForConnected Waiting for client to connect to ZooKeeper
   [junit4]   2> 1316120 T3926 oascc.ConnectionManager.process Watcher org.apache.solr.common.cloud.ConnectionManager@15f44133 name:ZooKeeperConnection Watcher:127.0.0.1:50627/solr got event WatchedEvent state:SyncConnected type:None path:null path:null type:None
   [junit4]   2> 1316120 T3858 oascc.ConnectionManager.waitForConnected Client is connected to ZooKeeper
   [junit4]   2> 1316147 T3858 oascc.ZkStateReader.createClusterStateWatchersAndUpdate Updating cluster state from ZooKeeper... 
   [junit4]   2> 1317159 T3858 oasc.ZkController.createEphemeralLiveNode Register node as live in ZooKeeper:/live_nodes/127.0.0.1:50640_
   [junit4]   2> 1317161 T3858 oascc.SolrZkClient.makePath makePath: /live_nodes/127.0.0.1:50640_
   [junit4]   2> 1317190 T3858 oasc.CorePropertiesLocator.discover Looking for core definitions underneath /Users/jenkins/workspace/Lucene-Solr-trunk-MacOSX/solr/build/solr-core/test/J0/./solr.cloud.OverseerRolesTest-A511644ABE1B8AF0-001/tempDir-005
   [junit4]   2> 1317783 T3858 oasc.CorePropertiesLocator.discoverUnder Found core conf in /Users/jenkins/workspace/Lucene-Solr-trunk-MacOSX/solr/build/solr-core/test/J0/./solr.cloud.OverseerRolesTest-A511644ABE1B8AF0-001/tempDir-005/conf/
   [junit4]   2> 1317841 T3858 oasc.CorePropertiesLocator.discover Found 1 core definitions
   [junit4]   2> 1317845 T3858 oass.SolrDispatchFilter.init user.dir=/Users/jenkins/workspace/Lucene-Solr-trunk-MacOSX/solr/build/solr-core/test/J0
   [junit4]   2> 1317845 T3858 oass.SolrDispatchFilter.init SolrDispatchFilter.init() done
   [junit4]   2> 1319700 T3858 oasc.AbstractFullDistribZkTestBase.createJettys create jetty 4
   [junit4]   2> 1319701 T3858 oejs.Server.doStart jetty-8.1.10.v20130312
   [junit4]   2> 1319708 T3858 oejs.AbstractConnector.doStart Started SelectChannelConnector@127.0.0.1:50643
   [junit4]   2> 1319710 T3858 oass.SolrDispatchFilter.init SolrDispatchFilter.init()
   [junit4]   2> 1319710 T3858 oasc.SolrResourceLoader.locateSolrHome JNDI not configured for solr (NoInitialContextEx)
   [junit4]   2> 1319710 T3858 oasc.SolrResourceLoader.locateSolrHome using system property solr.solr.home: ../../../../../../../../../Users/jenkins/workspace/Lucene-Solr-trunk-MacOSX/solr/build/solr-core/test/J0/./solr.cloud.OverseerRolesTest-A511644ABE1B8AF0-001/tempDir-006
   [junit4]   2> 1319711 T3858 oasc.SolrResourceLoader.<init> new SolrResourceLoader for directory: '../../../../../../../../../Users/jenkins/workspace/Lucene-Solr-trunk-MacOSX/solr/build/solr-core/test/J0/./solr.cloud.OverseerRolesTest-A511644ABE1B8AF0-001/tempDir-006/'
   [junit4]   2> 1319762 T3858 oasc.ConfigSolr.fromFile Loading container configuration from /Users/jenkins/workspace/Lucene-Solr-trunk-MacOSX/solr/build/solr-core/test/J0/../../../../../../../../../Users/jenkins/workspace/Lucene-Solr-trunk-MacOSX/solr/build/solr-core/test/J0/./solr.cloud.OverseerRolesTest-A511644ABE1B8AF0-001/tempDir-006/solr.xml
   [junit4]   2> 1319886 T3858 oasc.CorePropertiesLocator.<init> Config-defined core root directory: /Users/jenkins/workspace/Lucene-Solr-trunk-MacOSX/solr/build/solr-core/test/J0/../../../../../../../../../Users/jenkins/workspace/Lucene-Solr-trunk-MacOSX/solr/build/solr-core/test/J0/./solr.cloud.OverseerRolesTest-A511644ABE1B8AF0-001/tempDir-006
   [junit4]   2> 1319886 T3858 oasc.CoreContainer.<init> New CoreContainer 524236912
   [junit4]   2> 1319887 T3858 oasc.CoreContainer.load Loading cores into CoreContainer [instanceDir=../../../../../../../../../Users/jenkins/workspace/Lucene-Solr-trunk-MacOSX/solr/build/solr-core/test/J0/./solr.cloud.OverseerRolesTest-A511644ABE1B8AF0-001/tempDir-006/]
   [junit4]   2> 1319890 T3858 oashc.HttpShardHandlerFactory.getParameter Setting socketTimeout to: 90000
   [junit4]   2> 1319890 T3858 oashc.HttpShardHandlerFactory.getParameter Setting urlScheme to: 
   [junit4]   2> 1319890 T3858 oashc.HttpShardHandlerFactory.getParameter Setting connTimeout to: 15000
   [junit4]   2> 1319891 T3858 oashc.HttpShardHandlerFactory.getParameter Setting maxConnectionsPerHost to: 20
   [junit4]   2> 1319891 T3858 oashc.HttpShardHandlerFactory.getParameter Setting corePoolSize to: 0
   [junit4]   2> 1319892 T3858 oashc.HttpShardHandlerFactory.getParameter Setting maximumPoolSize to: 2147483647
   [junit4]   2> 1319892 T3858 oashc.HttpShardHandlerFactory.getParameter Setting maxThreadIdleTime to: 5
   [junit4]   2> 1319892 T3858 oashc.HttpShardHandlerFactory.getParameter Setting sizeOfQueue to: -1
   [junit4]   2> 1319893 T3858 oashc.HttpShardHandlerFactory.getParameter Setting fairnessPolicy to: false
   [junit4]   2> 1319893 T3858 oasl.LogWatcher.createWatcher SLF4J impl is org.slf4j.impl.Log4jLoggerFactory
   [junit4]   2> 1319894 T3858 oasl.LogWatcher.newRegisteredLogWatcher Registering Log Listener [Log4j (org.slf4j.impl.Log4jLoggerFactory)]
   [junit4]   2> 1319894 T3858 oasc.CoreContainer.load Host Name: 127.0.0.1
   [junit4]   2> 1319895 T3858 oasc.ZkContainer.initZooKeeper Zookeeper client=127.0.0.1:50627/solr
   [junit4]   2> 1319895 T3858 oasc.ZkController.checkChrootPath zkHost includes chroot
   [junit4]   2> 1319896 T3858 oascc.ConnectionManager.waitForConnected Waiting for client to connect to ZooKeeper
   [junit4]   2> 1319903 T3938 oascc.ConnectionManager.process Watcher org.apache.solr.common.cloud.ConnectionManager@6f925116 name:ZooKeeperConnection Watcher:127.0.0.1:50627 got event WatchedEvent state:SyncConnected type:None path:null path:null type:None
   [junit4]   2> 1319904 T3858 oascc.ConnectionManager.waitForConnected Client is connected to ZooKeeper
   [junit4]   2> 1319910 T3858 oascc.ConnectionManager.waitForConnected Waiting for client to connect to ZooKeeper
   [junit4]   2> 1319913 T3940 oascc.ConnectionManager.process Watcher org.apache.solr.common.cloud.ConnectionManager@37da8a35 name:ZooKeeperConnection Watcher:127.0.0.1:50627/solr got event WatchedEvent state:SyncConnected type:None path:null path:null type:None
   [junit4]   2> 1319914 T3858 oascc.ConnectionManager.waitForConnected Client is connected to ZooKeeper
   [junit4]   2> 1319943 T3858 oascc.ZkStateReader.createClusterStateWatchersAndUpdate Updating cluster state from ZooKeeper... 
   [junit4]   2> 1320955 T3858 oasc.ZkController.createEphemeralLiveNode Register node as live in ZooKeeper:/live_nodes/127.0.0.1:50643_
   [junit4]   2> 1320958 T3858 oascc.SolrZkClient.makePath makePath: /live_nodes/127.0.0.1:50643_
   [junit4]   2> 1320991 T3858 oasc.CorePropertiesLocator.discover Looking for core definitions underneath /Users/jenkins/workspace/Lucene-Solr-trunk-MacOSX/solr/build/solr-core/test/J0/../../../../../../../../../Users/jenkins/workspace/Lucene-Solr-trunk-MacOSX/solr/build/solr-core/test/J0/./solr.cloud.OverseerRolesTest-A511644ABE1B8AF0-001/tempDir-006
   [junit4]   2> 1321799 T3858 oasc.CorePropertiesLocator.discoverUnder Found core conf in /Users/jenkins/workspace/Lucene-Solr-trunk-MacOSX/solr/build/solr-core/test/J0/../../../../../../../../../Users/jenkins/workspace/Lucene-Solr-trunk-MacOSX/solr/build/solr-core/test/J0/./solr.cloud.OverseerRolesTest-A511644ABE1B8AF0-001/tempDir-006/conf/
   [junit4]   2> 1321879 T3858 oasc.CorePropertiesLocator.discover Found 1 core definitions
   [junit4]   2> 1321882 T3858 oass.SolrDispatchFilter.init user.dir=/Users/jenkins/workspace/Lucene-Solr-trunk-MacOSX/solr/build/solr-core/test/J0
   [junit4]   2> 1321882 T3858 oass.SolrDispatchFilter.init SolrDispatchFilter.init() done
   [junit4]   2> 1323824 T3858 oasc.AbstractFullDistribZkTestBase.createJettys create jetty 5
   [junit4]   2> 1323824 T3858 oejs.Server.doStart jetty-8.1.10.v20130312
   [junit4]   2> 1323832 T3858 oejs.AbstractConnector.doStart Started SelectChannelConnector@127.0.0.1:50646
   [junit4]   2> 1323834 T3858 oass.SolrDispatchFilter.init SolrDispatchFilter.init()
   [junit4]   2> 1323834 T3858 oasc.SolrResourceLoader.locateSolrHome JNDI not configured for solr (NoInitialContextEx)
   [junit4]   2> 1323835 T3858 oasc.SolrResourceLoader.locateSolrHome using system property solr.solr.home: ../../../../../../../../../Users/jenkins/workspace/Lucene-Solr-trunk-MacOSX/solr/build/solr-core/test/J0/./solr.cloud.OverseerRolesTest-A511644ABE1B8AF0-001/tempDir-007
   [junit4]   2> 1323835 T3858 oasc.SolrResourceLoader.<init> new SolrResourceLoader for directory: '../../../../../../../../../Users/jenkins/workspace/Lucene-Solr-trunk-MacOSX/solr/build/solr-core/test/J0/./solr.cloud.OverseerRolesTest-A511644ABE1B8AF0-001/tempDir-007/'
   [junit4]   2> 1323888 T3858 oasc.ConfigSolr.fromFile Loading container configuration from /Users/jenkins/workspace/Lucene-Solr-trunk-MacOSX/solr/build/solr-core/test/J0/../../../../../../../../../Users/jenkins/workspace/Lucene-Solr-trunk-MacOSX/solr/build/solr-core/test/J0/./solr.cloud.OverseerRolesTest-A511644ABE1B8AF0-001/tempDir-007/solr.xml
   [junit4]   2> 1323996 T3858 oasc.CorePropertiesLocator.<init> Config-defined core root directory: /Users/jenkins/workspace/Lucene-Solr-trunk-MacOSX/solr/build/solr-core/test/J0/../../../../../../../../../Users/jenkins/workspace/Lucene-Solr-trunk-MacOSX/solr/build/solr-core/test/J0/./solr.cloud.OverseerRolesTest-A511644ABE1B8AF0-001/tempDir-007
   [junit4]   2> 1323997 T3858 oasc.CoreContainer.<init> New CoreContainer 1350268892
   [junit4]   2> 1323997 T3858 oasc.CoreContainer.load Loading cores into CoreContainer [instanceDir=../../../../../../../../../Users/jenkins/workspace/Lucene-Solr-trunk-MacOSX/solr/build/solr-core/test/J0/./solr.cloud.OverseerRolesTest-A511644ABE1B8AF0-001/tempDir-007/]
   [junit4]   2> 1324019 T3858 oashc.HttpShardHandlerFactory.getParameter Setting socketTimeout to: 90000
   [junit4]   2> 1324020 T3858 oashc.HttpShardHandlerFactory.getParameter Setting urlScheme to: 
   [junit4]   2> 1324020 T3858 oashc.HttpShardHandlerFactory.getParameter Setting connTimeout to: 15000
   [junit4]   2> 1324021 T3858 oashc.HttpShardHandlerFactory.getParameter Setting maxConnectionsPerHost to: 20
   [junit4]   2> 1324023 T3858 oashc.HttpShardHandlerFactory.getParameter Setting corePoolSize to: 0
   [junit4]   2> 1324023 T3858 oashc.HttpShardHandlerFactory.getParameter Setting maximumPoolSize to: 2147483647
   [junit4]   2> 1324024 T3858 oashc.HttpShardHandlerFactory.getParameter Setting maxThreadIdleTime to: 5
   [junit4]   2> 1324024 T3858 oashc.HttpShardHandlerFactory.getParameter Setting sizeOfQueue to: -1
   [junit4]   2> 1324025 T3858 oashc.HttpShardHandlerFactory.getParameter Setting fairnessPolicy to: false
   [junit4]   2> 1324026 T3858 oasl.LogWatcher.createWatcher SLF4J impl is org.slf4j.impl.Log4jLoggerFactory
   [junit4]   2> 1324027 T3858 oasl.LogWatcher.newRegisteredLogWatcher Registering Log Listener [Log4j (org.slf4j.impl.Log4jLoggerFactory)]
   [junit4]   2> 1324028 T3858 oasc.CoreContainer.load Host Name: 127.0.0.1
   [junit4]   2> 1324029 T3858 oasc.ZkContainer.initZooKeeper Zookeeper client=127.0.0.1:50627/solr
   [junit4]   2> 1324029 T3858 oasc.ZkController.checkChrootPath zkHost includes chroot
   [junit4]   2> 1324031 T3858 oascc.ConnectionManager.waitForConnected Waiting for client to connect to ZooKeeper
   [junit4]   2> 1324036 T3952 oascc.ConnectionManager.process Watcher org.apache.solr.common.cloud.ConnectionManager@39e1d093 name:ZooKeeperConnection Watcher:127.0.0.1:50627 got event WatchedEvent state:SyncConnected type:None path:null path:null type:None
   [junit4]   2> 1324038 T3858 oascc.ConnectionManager.waitForConnected Client is connected to ZooKeeper
   [junit4]   2> 1324044 T3858 oascc.ConnectionManager.waitForConnected Waiting for client to connect to ZooKeeper
   [junit4]   2> 1324048 T3954 oascc.ConnectionManager.process Watcher org.apache.solr.common.cloud.ConnectionManager@203f43ad name:ZooKeeperConnection Watcher:127.0.0.1:50627/solr got event WatchedEvent state:SyncConnected type:None path:null path:null type:None
   [junit4]   2> 1324048 T3858 oascc.ConnectionManager.waitForConnected Client is connected to ZooKeeper
   [junit4]   2> 1324079 T3858 oascc.ZkStateReader.createClusterStateWatchersAndUpdate Updating cluster state from ZooKeeper... 
   [junit4]   2> 1325090 T3858 oasc.ZkController.createEphemeralLiveNode Register node as live in ZooKeeper:/live_nodes/127.0.0.1:50646_
   [junit4]   2> 1325093 T3858 oascc.SolrZkClient.makePath makePath: /live_nodes/127.0.0.1:50646_
   [junit4]   2> 1325122 T3858 oasc.CorePropertiesLocator.discover Looking for core definitions underneath /Users/jenkins/workspace/Lucene-Solr-trunk-MacOSX/solr/build/solr-core/test/J0/../../../../../../../../../Users/jenkins/workspace/Lucene-Solr-trunk-MacOSX/solr/build/solr-core/test/J0/./solr.cloud.OverseerRolesTest-A511644ABE1B8AF0-001/tempDir-007
   [junit4]   2> 1325870 T3858 oasc.CorePropertiesLocator.discoverUnder Found core conf in /Users/jenkins/workspace/Lucene-Solr-trunk-MacOSX/solr/build/solr-core/test/J0/../../../../../../../../../Users/jenkins/workspace/Lucene-Solr-trunk-MacOSX/solr/build/solr-core/test/J0/./solr.cloud.OverseerRolesTest-A511644ABE1B8AF0-001/tempDir-007/conf/
   [junit4]   2> 1325999 T3858 oasc.CorePropertiesLocator.discover Found 1 core definitions
   [junit4]   2> 1326003 T3858 oass.SolrDispatchFilter.init user.dir=/Users/jenkins/workspace/Lucene-Solr-trunk-MacOSX/solr/build/solr-core/test/J0
   [junit4]   2> 1326003 T3858 oass.SolrDispatchFilter.init SolrDispatchFilter.init() done
   [junit4]   2> 1327780 T3858 oasc.AbstractFullDistribZkTestBase.createJettys create jetty 6
   [junit4]   2> 1327781 T3858 oejs.Server.doStart jetty-8.1.10.v20130312
   [junit4]   2> 1327787 T3858 oejs.AbstractConnector.doStart Started SelectChannelConnector@127.0.0.1:50649
   [junit4]   2> 1327790 T3858 oass.SolrDispatchFilter.init SolrDispatchFilter.init()
   [junit4]   2> 1327790 T3858 oasc.SolrResourceLoader.locateSolrHome JNDI not configured for solr (NoInitialContextEx)
   [junit4]   2> 1327791 T3858 oasc.SolrResourceLoader.locateSolrHome using system property solr.solr.home: ../../../../../../../../../Users/jenkins/workspace/Lucene-Solr-trunk-MacOSX/solr/build/solr-core/test/J0/./solr.cloud.OverseerRolesTest-A511644ABE1B8AF0-001/tempDir-008
   [junit4]   2> 1327791 T3858 oasc.SolrResourceLoader.<init> new SolrResourceLoader for directory: '../../../../../../../../../Users/jenkins/workspace/Lucene-Solr-trunk-MacOSX/solr/build/solr-core/test/J0/./solr.cloud.OverseerRolesTest-A511644ABE1B8AF0-001/tempDir-008/'
   [junit4]   2> 1327841 T3858 oasc.ConfigSolr.fromFile Loading container configuration from /Users/jenkins/workspace/Lucene-Solr-trunk-MacOSX/solr/build/solr-core/test/J0/../../../../../../../../../Users/jenkins/workspace/Lucene-Solr-trunk-MacOSX/solr/build/solr-core/test/J0/./solr.cloud.OverseerRolesTest-A511644ABE1B8AF0-001/tempDir-008/solr.xml
   [junit4]   2> 1327951 T3858 oasc.CorePropertiesLocator.<init> Config-defined core root directory: /Users/jenkins/workspace/Lucene-Solr-trunk-MacOSX/solr/build/solr-core/test/J0/../../../../../../../../../Users/jenkins/workspace/Lucene-Solr-trunk-MacOSX/solr/build/solr-core/test/J0/./solr.cloud.OverseerRolesTest-A511644ABE1B8AF0-001/tempDir-008
   [junit4]   2> 1327952 T3858 oasc.CoreContainer.<init> New CoreContainer 1439885175
   [junit4]   2> 1327952 T3858 oasc.CoreContainer.load Loading cores into CoreContainer [instanceDir=../../../../../../../../../Users/jenkins/workspace/Lucene-Solr-trunk-MacOSX/solr/build/solr-core/test/J0/./solr.cloud.OverseerRolesTest-A511644ABE1B8AF0-001/tempDir-008/]
   [junit4]   2> 1327955 T3858 oashc.HttpShardHandlerFactory.getParameter Setting socketTimeout to: 90000
   [junit4]   2> 1327956 T3858 oashc.HttpShardHandlerFactory.getParameter Setting urlScheme to: 
   [junit4]   2> 1327956 T3858 oashc.HttpShardHandlerFactory.getParameter Setting connTimeout to: 15000
   [junit4]   2> 1327956 T3858 oashc.HttpShardHandlerFactory.getParameter Setting maxConnectionsPerHost to: 20
   [junit4]   2> 1327957 T3858 oashc.HttpShardHandlerFactory.getParameter Setting corePoolSize to: 0
   [junit4]   2> 1327957 T3858 oashc.HttpShardHandlerFactory.getParameter Setting maximumPoolSize to: 2147483647
   [junit4]   2> 1327957 T3858 oashc.HttpShardHandlerFactory.getParameter Setting maxThreadIdleTime to: 5
   [junit4]   2> 1327957 T3858 oashc.HttpShardHandlerFactory.getParameter Setting sizeOfQueue to: -1
   [junit4]   2> 1327958 T3858 oashc.HttpShardHandlerFactory.getParameter Setting fairnessPolicy to: false
   [junit4]   2> 1327959 T3858 oasl.LogWatcher.createWatcher SLF4J impl is org.slf4j.impl.Log4jLoggerFactory
   [junit4]   2> 1327959 T3858 oasl.LogWatcher.newRegisteredLogWatcher Registering Log Listener [Log4j (org.slf4j.impl.Log4jLoggerFactory)]
   [junit4]   2> 1327959 T3858 oasc.CoreContainer.load Host Name: 127.0.0.1
   [junit4]   2> 1327960 T3858 oasc.ZkContainer.initZooKeeper Zookeeper client=127.0.0.1:50627/solr
   [junit4]   2> 1327960 T3858 oasc.ZkController.checkChrootPath zkHost includes chroot
   [junit4]   2> 1327962 T3858 oascc.ConnectionManager.waitForConnected Waiting for client to connect to ZooKeeper
   [junit4]   2> 1327967 T3966 oascc.ConnectionManager.process Watcher org.apache.solr.common.cloud.ConnectionManager@95a61a6 name:ZooKeeperConnection Watcher:127.0.0.1:50627 got event WatchedEvent state:SyncConnected type:None path:null path:null type:None
   [junit4]   2> 1327968 T3858 oascc.ConnectionManager.waitForConnected Client is connected to ZooKeeper
   [junit4]   2> 1327976 T3858 oascc.ConnectionManager.waitForConnected Waiting for client to connect to ZooKeeper
   [junit4]   2> 1327979 T3968 oascc.ConnectionManager.process Watcher org.apache.solr.common.cloud.ConnectionManager@5818717 name:ZooKeeperConnection Watcher:127.0.0.1:50627/solr got event WatchedEvent state:SyncConnected type:None path:null path:null type:None
   [junit4]   2> 1327980 T3858 oascc.ConnectionManager.waitForConnected Client is connected to ZooKeeper
   [junit4]   2> 1328005 T3858 oascc.ZkStateReader.createClusterStateWatchersAndUpdate Updating cluster state from ZooKeeper... 
   [junit4]   2> 1329016 T3858 oasc.ZkController.createEphemeralLiveNode Register node as live in ZooKeeper:/live_nodes/127.0.0.1:50649_
   [junit4]   2> 1329019 T3858 oascc.SolrZkClient.makePath makePath: /live_nodes/127.0.0.1:50649_
   [junit4]   2> 1329052 T3858 oasc.CorePropertiesLocator.discover Looking for core definitions underneath /Users/jenkins/workspace/Lucene-Solr-trunk-MacOSX/solr/build/solr-core/test/J0/../../../../../../../../../Users/jenkins/workspace/Lucene-Solr-trunk-MacOSX/solr/build/solr-core/test/J0/./solr.cloud.OverseerRolesTest-A511644ABE1B8AF0-001/tempDir-008
   [junit4]   2> 1329924 T3858 oasc.CorePropertiesLocator.discoverUnder Found core conf in /Users/jenkins/workspace/Lucene-Solr-trunk-MacOSX/solr/build/solr-core/test/J0/../../../../../../../../../Users/jenkins/workspace/Lucene-Solr-trunk-MacOSX/solr/build/solr-core/test/J0/./solr.cloud.OverseerRolesTest-A511644ABE1B8AF0-001/tempDir-008/conf/
   [junit4]   2> 1330038 T3858 oasc.CorePropertiesLocator.discover Found 1 core definitions
   [junit4]   2> 1330042 T3858 oass.SolrDispatchFilter.init user.dir=/Users/jenkins/workspace/Lucene-Solr-trunk-MacOSX/solr/build/solr-core/test/J0
   [junit4]   2> 1330042 T3858 oass.SolrDispatchFilter.init SolrDispatchFilter.init() done
   [junit4]   2> 1330044 T3858 oascc.ConnectionManager.waitForConnected Waiting for client to connect to ZooKeeper
   [junit4]   2> 1330049 T3971 oascc.ConnectionManager.process Watcher org.apache.solr.common.cloud.ConnectionManager@104808ea name:ZooKeeperConnection Watcher:127.0.0.1:50627/solr got event WatchedEvent state:SyncConnected type:None path:null path:null type:None
   [junit4]   2> 1330049 T3858 oascc.ConnectionManager.waitForConnected Client is connected to ZooKeeper
   [junit4]   2> 1330053 T3858 oascc.ZkStateReader.createClusterStateWatchersAndUpdate Updating cluster state from ZooKeeper... 
   [junit4]   2> 1330063 T3858 oascc.ConnectionManager.waitForConnected Waiting for client to connect to ZooKeeper
   [junit4]   2> 1330067 T3973 oascc.ConnectionManager.process Watcher org.apache.solr.common.cloud.ConnectionManager@46aae24 name:ZooKeeperConnection Watcher:127.0.0.1:50627/solr got event WatchedEvent state:SyncConnected type:None path:null path:null type:None
   [junit4]   2> 1330068 T3858 oascc.ConnectionManager.waitForConnected Client is connected to ZooKeeper
   [junit4]   2> 1330072 T3858 oascc.ZkStateReader.createClusterStateWatchersAndUpdate Updating cluster state from ZooKeeper... 
   [junit4]   2> 1330096 T3964 oasha.CollectionsHandler.handleCreateAction Creating Collection : wt=javabin&replicationFactor=2&version=2&action=CREATE&maxShardsPerNode=2&name=testOverseerQuit&numShards=4
   [junit4]   2> 1330100 T3880 oasc.DistributedQueue$LatchChildWatcher.process LatchChildWatcher fired on path: /overseer/collection-queue-work state: SyncConnected type NodeChildrenChanged
   [junit4]   2> 1330104 T3882 oasc.OverseerCollectionProcessor.run Overseer Collection Processor: Get the message id:/overseer/collection-queue-work/qn-0000000000 message:{
   [junit4]   2> 	  "operation":"createcollection",
   [junit4]   2> 	  "fromApi":"true",
   [junit4]   2> 	  "name":"testOverseerQuit",
   [junit4]   2> 	  "replicationFactor":"2",
   [junit4]   2> 	  "numShards":"4",
   [junit4]   2> 	  "maxShardsPerNode":"2"}
   [junit4]   2> 1330104 T3882 oasc.OverseerCollectionProcessor.processMessage WARN OverseerCollectionProcessor.processMessage : createcollection , {
   [junit4]   2> 	  "operation":"createcollection",
   [junit4]   2> 	  "fromApi":"true",
   [junit4]   2> 	  "name":"testOverseerQuit",
   [junit4]   2> 	  "replicationFactor":"2",
   [junit4]   2> 	  "numShards":"4",
   [junit4]   2> 	  "maxShardsPerNode":"2"}
   [junit4]   2> 1330109 T3882 oasc.OverseerCollectionProcessor.createConfNode Only one config set found in zk - using it:conf1
   [junit4]   2> 1330109 T3882 oasc.OverseerCollectionProcessor.createConfNode creating collections conf node /collections/testOverseerQuit 
   [junit4]   2> 1330109 T3882 oascc.SolrZkClient.makePath makePath: /collections/testOverseerQuit
   [junit4]   2> 1330124 T3880 oasc.DistributedQueue$LatchChildWatcher.process LatchChildWatcher fired on path: /overseer/queue state: SyncConnected type NodeChildrenChanged
   [junit4]   2> 1330150 T3881 oascc.ZkStateReader.updateClusterState Updating cloud state from ZooKeeper... 
   [junit4]   2> 1330152 T3881 oasc.Overseer$ClusterStateUpdater.buildCollection building a new collection: testOverseerQuit
   [junit4]   2> 1330153 T3881 oasc.Overseer$ClusterStateUpdater.createCollection Create collection testOverseerQuit with shards [shard1, shard2, shard3, shard4]
   [junit4]   2> 1330167 T3880 oasc.DistributedQueue$LatchChildWatcher.process LatchChildWatcher fired on path: /overseer/queue state: SyncConnected type NodeChildrenChanged
   [junit4]   2> 1330170 T3880 oascc.ZkStateReader$2.process A cluster state change: WatchedEvent state:SyncConnected type:NodeDataChanged path:/clusterstate.json, has occurred - updating... (live nodes size: 7)
   [junit4]   2> 1330171 T3898 oascc.ZkStateReader$2.process A cluster state change: WatchedEvent state:SyncConnected type:NodeDataChanged path:/clusterstate.json, has occurred - updating... (live nodes size: 7)
   [junit4]   2> 1330171 T3885 oascc.ZkStateReader$2.process A cluster state change: WatchedEvent state:SyncConnected type:NodeDataChanged path:/clusterstate.json, has occurred - updating... (live nodes size: 7)
   [junit4]   2> 1330172 T3971 oascc.ZkStateReader$2.process A cluster state change: WatchedEvent state:SyncConnected type:NodeDataChanged path:/clusterstate.json, has occurred - updating... (live nodes size: 7)
   [junit4]   2> 1330172 T3926 oascc.ZkStateReader$2.process A cluster state change: WatchedEvent state:SyncConnected type:NodeDataChanged path:/clusterstate.json, has occurred - updating... (live nodes size: 7)
   [junit4]   2> 1330173 T3973 oascc.ZkStateReader$2.process A cluster state change: WatchedEvent state:SyncConnected type:NodeDataChanged path:/clusterstate.json, has occurred - updating... (live nodes size: 7)
   [junit4]   2> 1330173 T3940 oascc.ZkStateReader$2.process A cluster state change: WatchedEvent state:SyncConnected type:NodeDataChanged path:/clusterstate.json, has occurred - updating... (live nodes size: 7)
   [junit4]   2> 1330172 T3968 oascc.ZkStateReader$2.process A cluster state change: WatchedEvent state:SyncConnected type:NodeDataChanged path:/clusterstate.json, has occurred - updating... (live nodes size: 7)
   [junit4]   2> 1330173 T3954 oascc.ZkStateReader$2.process A cluster state change: WatchedEvent state:SyncConnected type:NodeDataChanged path:/clusterstate.json, has occurred - updating... (live nodes size: 7)
   [junit4]   2> 1330173 T3912 oascc.ZkStateReader$2.process A cluster state change: WatchedEvent state:SyncConnected type:NodeDataChanged path:/clusterstate.json, has occurred - updating... (live nodes size: 7)
   [junit4]   2> 1330225 T3882 oasc.OverseerCollectionProcessor.createCollection Creating SolrCores for new collection, shardNames [shard1, shard2, shard3, shard4] , replicationFactor : 2
   [junit4]   2> 1330226 T3882 oasc.OverseerCollectionProcessor.createCollection Creating shard testOverseerQuit_shard1_replica1 as part of slice shard1 of collection testOverseerQuit on 127.0.0.1:50630_
   [junit4]   2> 1330229 T3882 oasc.OverseerCollectionProcessor.createCollection Creating shard testOverseerQuit_shard1_replica2 as part of slice shard1 of collection testOverseerQuit on 127.0.0.1:50637_
   [junit4]   2> 1330233 T3882 oasc.OverseerCollectionProcessor.createCollection Creating shard testOverseerQuit_shard2_replica1 as part of slice shard2 of collection testOverseerQuit on 127.0.0.1:50643_
   [junit4]   2> 1330237 T3870 oasha.CoreAdminHandler.handleCreateAction core create command wt=javabin&qt=/admin/cores&version=2&action=CREATE&name=testOverseerQuit_shard1_replica1&numShards=4&collection.configName=conf1&collection=testOverseerQuit&shard=shard1
   [junit4]   2> 1330238 T3906 oasha.CoreAdminHandler.handleCreateAction core create command wt=javabin&qt=/admin/cores&version=2&action=CREATE&name=testOverseerQuit_shard1_replica2&numShards=4&collection.configName=conf1&collection=testOverseerQuit&shard=shard1
   [junit4]   2> 1330243 T3882 oasc.OverseerCollectionProcessor.createCollection Creating shard testOverseerQuit_shard2_replica2 as part of slice shard2 of collection testOverseerQuit on 127.0.0.1:50649_
   [junit4]   2> 1330246 T3906 oasc.ZkController.publish publishing core=testOverseerQuit_shard1_replica2 state=down collection=testOverseerQuit
   [junit4]   2> 1330247 T3870 oasc.ZkController.publish publishing core=testOverseerQuit_shard1_replica1 state=down collection=testOverseerQuit
   [junit4]   2> 1330251 T3935 oasha.CoreAdminHandler.handleCreateAction core create command wt=javabin&qt=/admin/cores&version=2&action=CREATE&name=testOverseerQuit_shard2_replica1&numShards=4&collection.configName=conf1&collection=testOverseerQuit&shard=shard2
   [junit4]   2> 1330251 T3882 oasc.OverseerCollectionProcessor.createCollection Creating shard testOverseerQuit_shard3_replica1 as part of slice shard3 of collection testOverseerQuit on 127.0.0.1:50646_
   [junit4]   2> 1330259 T3880 oasc.DistributedQueue$LatchChildWatcher.process LatchChildWatcher fired on path: /overseer/queue state: SyncConnected type NodeChildrenChanged
   [junit4]   2> 1330260 T3870 oasc.ZkController.waitForCoreNodeName look for our core node name
   [junit4]   2> 1330260 T3959 oasha.CoreAdminHandler.handleCreateAction core create command wt=javabin&qt=/admin/cores&version=2&action=CREATE&name=testOverseerQuit_shard2_replica2&numShards=4&collection.configName=conf1&collection=testOverseerQuit&shard=shard2
   [junit4]   2> 1330266 T3935 oasc.ZkController.publish publishing core=testOverseerQuit_shard2_replica1 state=down collection=testOverseerQuit
   [junit4]   2> 1330266 T3882 oasc.OverseerCollectionProcessor.createCollection Creating shard testOverseerQuit_shard3_replica2 as part of slice shard3 of collection testOverseerQuit on 127.0.0.1:50640_
   [junit4]   2> 1330261 T3906 oasc.ZkController.waitForCoreNodeName look for our core node name
   [junit4]   2> 1330273 T3949 oasha.CoreAdminHandler.handleCreateAction core create command wt=javabin&qt=/admin/cores&version=2&action=CREATE&name=testOverseerQuit_shard3_replica1&numShards=4&collection.configName=conf1&collection=testOverseerQuit&shard=shard3
   [junit4]   2> 1330273 T3959 oasc.ZkController.publish publishing core=testOverseerQuit_shard2_replica2 state=down collection=testOverseerQuit
   [junit4]   2> 1330278 T3935 oasc.ZkController.waitForCoreNodeName look for our core node name
   [junit4]   2> 1330278 T3880 oasc.DistributedQueue$LatchChildWatcher.process LatchChildWatcher fired on path: /overseer/queue state: SyncConnected type NodeChildrenChanged
   [junit4]   2> 1330280 T3959 oasc.ZkController.waitForCoreNodeName look for our core node name
   [junit4]   2> 1330284 T3949 oasc.ZkController.publish publishing core=testOverseerQuit_shard3_replica1 state=down collection=testOverseerQuit
   [junit4]   2> 1330286 T3882 oasc.OverseerCollectionProcessor.createCollection Creating shard testOverseerQuit_shard4_replica1 as part of slice shard4 of collection testOverseerQuit on 127.0.0.1:50634_
   [junit4]   2> 1330288 T3919 oasha.CoreAdminHandler.handleCreateAction core create command wt=javabin&qt=/admin/cores&version=2&action=CREATE&name=testOverseerQuit_shard3_replica2&numShards=4&collection.configName=conf1&collection=testOverseerQuit&shard=shard3
   [junit4]   2> 1330291 T3881 oascc.ZkStateReader.updateClusterState Updating cloud state from ZooKeeper... 
   [junit4]   2> 1330292 T3949 oasc.ZkController.waitForCoreNodeName look for our core node name
   [junit4]   2> 1330294 T3919 oasc.ZkController.publish publishing core=testOverseerQuit_shard3_replica2 state=down collection=testOverseerQuit
   [junit4]   2> 1330295 T3881 oasc.Overseer$ClusterStateUpdater.updateState Update state numShards=4 message={
   [junit4]   2> 	  "operation":"state",
   [junit4]   2> 	  "state":"down",
   [junit4]   2> 	  "base_url":"http://127.0.0.1:50630",
   [junit4]   2> 	  "core":"testOverseerQuit_shard1_replica1",
   [junit4]   2> 	  "roles":null,
   [junit4]   2> 	  "node_name":"127.0.0.1:50630_",
   [junit4]   2> 	  "shard":"shard1",
   [junit4]   2> 	  "collection":"testOverseerQuit",
   [junit4]   2> 	  "numShards":"4",
   [junit4]   2> 	  "core_node_name":null}
   [junit4]   2> 1330297 T3882 oasc.OverseerCollectionProcessor.createCollection Creating shard testOverseerQuit_shard4_replica2 as part of slice shard4 of collection testOverseerQuit on 127.0.0.1:50630_
   [junit4]   2> 1330302 T3892 oasha.CoreAdminHandler.handleCreateAction core create command wt=javabin&qt=/admin/cores&version=2&action=CREATE&name=testOverseerQuit_shard4_replica1&numShards=4&collection.configName=conf1&collection=testOverseerQuit&shard=shard4
   [junit4]   2> 1330305 T3919 oasc.ZkController.waitForCoreNodeName look for our core node name
   [junit4]   2> 1330309 T3873 oasha.CoreAdminHandler.handleCreateAction core create command wt=javabin&qt=/admin/cores&version=2&action=CREATE&name=testOverseerQuit_shard4_replica2&numShards=4&collection.configName=conf1&collection=testOverseerQuit&shard=shard4
   [junit4]   2> 1330310 T3892 oasc.ZkController.publish publishing core=testOverseerQuit_shard4_replica1 state=down collection=testOverseerQuit
   [junit4]   2> 1330314 T3892 oasc.ZkController.waitForCoreNodeName look for our core node name
   [junit4]   2> 1330316 T3873 oasc.ZkController.publish publishing core=testOverseerQuit_shard4_replica2 state=down collection=testOverseerQuit
   [junit4]   2> 1330319 T3881 oasc.Overseer$ClusterStateUpdater.updateState Update state numShards=4 message={
   [junit4]   2> 	  "operation":"state",
   [junit4]   2> 	  "state":"down",
   [junit4]   2> 	  "base_url":"http://127.0.0.1:50637",
   [junit4]   2> 	  "core":"testOverseerQuit_shard1_replica2",
   [junit4]   2> 	  "roles":null,
   [junit4]   2> 	  "node_name":"127.0.0.1:50637_",
   [junit4]   2> 	  "shard":"shard1",
   [junit4]   2> 	  "collection":"testOverseerQuit",
   [junit4]   2> 	  "numShards":"4",
   [junit4]   2> 	  "core_node_name":null}
   [junit4]   2> 1330328 T3880 oasc.DistributedQueue$LatchChildWatcher.process LatchChildWatcher fired on path: /overseer/queue state: SyncConnected type NodeChildrenChanged
   [junit4]   2> 1330328 T3873 oasc.ZkController.waitForCoreNodeName look for our core node name
   [junit4]   2> 1330334 T3881 oasc.Overseer$ClusterStateUpdater.updateState Update state numShards=4 message={
   [junit4]   2> 	  "operation":"state",
   [junit4]   2> 	  "state":"down",
   [junit4]   2> 	  "base_url":"http://127.0.0.1:50643",
   [junit4]   2> 	  "core":"testOverseerQuit_shard2_replica1",
   [junit4]   2> 	  "roles":null,
   [junit4]   2> 	  "node_name":"127.0.0.1:50643_",
   [junit4]   2> 	  "shard":"shard2",
   [junit4]   2> 	  "collection":"testOverseerQuit",
   [junit4]   2> 	  "numShards":"4",
   [junit4]   2> 	  "core_node_name":null}
   [junit4]   2> 1330344 T3880 oasc.DistributedQueue$LatchChildWatcher.process LatchChildWatcher fired on path: /overseer/queue state: SyncConnected type NodeChildrenChanged
   [junit4]   2> 1330348 T3881 oasc.Overseer$ClusterStateUpdater.updateState Update state numShards=4 message={
   [junit4]   2> 	  "operation":"state",
   [junit4]   2> 	  "state":"down",
   [junit4]   2> 	  "base_url":"http://127.0.0.1:50649",
   [junit4]   2> 	  "core":"testOverseerQuit_shard2_replica2",
   [junit4]   2> 	  "roles":null,
   [junit4]   2> 	  "node_name":"127.0.0.1:50649_",
   [junit4]   2> 	  "shard":"shard2",
   [junit4]   2> 	  "collection":"testOverseerQuit",
   [junit4]   2> 	  "numShards":"4",
   [junit4]   2> 	  "core_node_name":null}
   [junit4]   2> 1330356 T3880 oasc.DistributedQueue$LatchChildWatcher.process LatchChildWatcher fired on path: /overseer/queue state: SyncConnected type NodeChildrenChanged
   [junit4]   2> 1330359 T3881 oasc.Overseer$ClusterStateUpdater.updateState Update state numShards=4 message={
   [junit4]   2> 	  "operation":"state",
   [junit4]   2> 	  "state":"down",
   [junit4]   2> 	  "base_url":"http://127.0.0.1:50646",
   [junit4]   2> 	  "core":"testOverseerQuit_shard3_replica1",
   [junit4]   2> 	  "roles":null,
   [junit4]   2> 	  "node_name":"127.0.0.1:50646_",
   [junit4]   2> 	  "shard":"shard3",
   [junit4]   2> 	  "collection":"testOverseerQuit",
   [junit4]   2> 	  "numShards":"4",
   [junit4]   2> 	  "core_node_name":null}
   [junit4]   2> 1330368 T3880 oasc.DistributedQueue$LatchChildWatcher.process LatchChildWatcher fired on path: /overseer/queue state: SyncConnected type NodeChildrenChanged
   [junit4]   2> 1330371 T3881 oasc.Overseer$ClusterStateUpdater.updateState Update state numShards=4 message={
   [junit4]   2> 	  "operation":"state",
   [junit4]   2> 	  "state":"down",
   [junit4]   2> 	  "base_url":"http://127.0.0.1:50640",
   [junit4]   2> 	  "core":"testOverseerQuit_shard3_replica2",
   [junit4]   2> 	  "roles":null,
   [junit4]   2> 	  "node_name":"127.0.0.1:50640_",
   [junit4]   2> 	  "shard":"shard3",
   [junit4]   2> 	  "collection":"testOverseerQuit",
   [junit4]   2> 	  "numShards":"4",
   [junit4]   2> 	  "core_node_name":null}
   [junit4]   2> 1330386 T3880 oasc.DistributedQueue$LatchChildWatcher.process LatchChildWatcher fired on path: /overseer/queue state: SyncConnected type NodeChildrenChanged
   [junit4]   2> 1330391 T3881 oasc.Overseer$ClusterStateUpdater.updateState Update state numShards=4 message={
   [junit4]   2> 	  "operation":"state",
   [junit4]   2> 	  "state":"down",
   [junit4]   2> 	  "base_url":"http://127.0.0.1:50634",
   [junit4]   2> 	  "core":"testOverseerQuit_shard4_replica1",
   [junit4]   2> 	  "roles":null,
   [junit4]   2> 	  "node_name":"127.0.0.1:50634_",
   [junit4]   2> 	  "shard":"shard4",
   [junit4]   2> 	  "collection":"testOverseerQuit",
   [junit4]   2> 	  "numShards":"4",
   [junit4]   2> 	  "core_node_name":null}
   [junit4]   2> 1330401 T3880 oasc.DistributedQueue$LatchChildWatcher.process LatchChildWatcher fired on path: /overseer/queue state: SyncConnected type NodeChildrenChanged
   [junit4]   2> 1330407 T3881 oasc.Overseer$ClusterStateUpdater.updateState Update state numShards=4 message={
   [junit4]   2> 	  "operation":"state",
   [junit4]   2> 	  "state":"down",
   [junit4]   2> 	  "base_url":"http://127.0.0.1:50630",
   [junit4]   2> 	  "core":"testOverseerQuit_shard4_replica2",
   [junit4]   2> 	  "roles":null,
   [junit4]   2> 	  "node_name":"127.0.0.1:50630_",
   [junit4]   2> 	  "shard":"shard4",
   [junit4]   2> 	  "collection":"testOverseerQuit",
   [junit4]   2> 	  "numShards":"4",
   [junit4]   2> 	  "core_node_name":null}
   [junit4]   2> 1330417 T3880 oasc.DistributedQueue$LatchChildWatcher.process LatchChildWatcher fired on path: /overseer/queue state: SyncConnected type NodeChildrenChanged
   [junit4]   2> 1330525 T3940 oascc.ZkStateReader$2.process A cluster state change: WatchedEvent state:SyncConnected type:NodeDataChanged path:/clusterstate.json, has occurred - updating... (live nodes size: 7)
   [junit4]   2> 1330525 T3971 oascc.ZkStateReader$2.process A cluster state change: WatchedEvent state:SyncConnected type:NodeDataChanged path:/clusterstate.json, has occurred - updating... (live nodes size: 7)
   [junit4]   2> 1330526 T3926 oascc.ZkStateReader$2.process A cluster state change: WatchedEvent state:SyncConnected type:NodeDataChanged path:/clusterstate.json, has occurred - updating... (live nodes size: 7)
   [junit4]   2> 1330525 T3912 oascc.ZkStateReader$2.process A cluster state change: WatchedEvent state:SyncConnected type:NodeDataChanged path:/clusterstate.json, has occurred - updating... (live nodes size: 7)
   [junit4]   2> 1330527 T3885 oascc.ZkStateReader$2.process A cluster state change: WatchedEvent state:SyncConnected type:NodeDataChanged path:/clusterstate.json, has occurred - updating... (live nodes size: 7)
   [junit4]   2> 1330527 T3898 oascc.ZkStateReader$2.process A cluster state change: WatchedEvent state:SyncConnected type:NodeDataChanged path:/clusterstate.json, has occurred - updating... (live nodes size: 7)
   [junit4]   2> 1330527 T3973 oascc.ZkStateReader$2.process A cluster state change: WatchedEvent state:SyncConnected type:NodeDataChanged path:/clusterstate.json, has occurred - updating... (live nodes size: 7)
   [junit4]   2> 1330527 T3968 oascc.ZkStateReader$2.process A cluster state change: WatchedEvent state:SyncConnected type:NodeDataChanged path:/clusterstate.json, has occurred - updating... (live nodes size: 7)
   [junit4]   2> 1330526 T3954 oascc.ZkStateReader$2.process A cluster state change: WatchedEvent state:SyncConnected type:NodeDataChanged path:/clusterstate.json, has occurred - updating... (live nodes size: 7)
   [junit4]   2> 1330526 T3880 oascc.ZkStateReader$2.process A cluster state change: WatchedEvent state:SyncConnected type:NodeDataChanged path:/clusterstate.json, has occurred - updating... (live nodes size: 7)
   [junit4]   2> 1331263 T3870 oasc.ZkController.waitForShardId waiting to find shard id in clusterstate for testOverseerQuit_shard1_replica1
   [junit4]   2> 1331266 T3870 oasc.ZkController.createCollectionZkNode Check for collection zkNode:testOverseerQuit
   [junit4]   2> 1331269 T3870 oasc.ZkController.createCollectionZkNode Collection zkNode exists
   [junit4]   2> 1331269 T3870 oascc.ZkStateReader.readConfigName Load collection config from:/collections/testOverseerQuit
   [junit4]   2> 1331273 T3870 oascc.ZkStateReader.readConfigName path=/collections/testOverseerQuit configName=conf1 specified config exists in ZooKeeper
   [junit4]   2> 1331273 T3870 oasc.SolrResourceLoader.<init> new SolrResourceLoader for directory: './solr.cloud.OverseerRolesTest-A511644ABE1B8AF0-001/tempDir-002/testOverseerQuit_shard1_replica1/'
   [junit4]   2> 1331273 T3906 oasc.ZkController.waitForShardId waiting to find shard id in clusterstate for testOverseerQuit_shard1_replica2
   [junit4]   2> 1331280 T3906 oasc.ZkController.createCollectionZkNode Check for collection zkNode:testOverseerQuit
   [junit4]   2> 1331281 T3935 oasc.ZkController.waitForShardId waiting to find shard id in clusterstate for testOverseerQuit_shard2_replica1
   [junit4]   2> 1331286 T3959 oasc.ZkController.waitForShardId waiting to find shard id in clusterstate for testOverseerQuit_shard2_replica2
   [junit4]   2> 1331288 T3935 oasc.ZkController.createCollectionZkNode Check for collection zkNode:testOverseerQuit
   [junit4]   2> 1331292 T3959 oasc.ZkController.createCollectionZkNode Check for collection zkNode:testOverseerQuit
   [junit4]   2> 1331294 T3949 oasc.ZkController.waitForShardId waiting to find shard id in clusterstate for testOverseerQuit_shard3_replica1
   [junit4]   2> 1331297 T3949 oasc.ZkController.createCollectionZkNode Check for collection zkNode:testOverseerQuit
   [junit4]   2> 1331300 T3906 oasc.ZkController.createCollectionZkNode Collection zkNode exists
   [junit4]   2> 1331301 T3906 oascc.ZkStateReader.readConfigName Load collection config from:/collections/testOverseerQuit
   [junit4]   2> 1331301 T3935 oasc.ZkController.createCollectionZkNode Collection zkNode exists
   [junit4]   2> 1331304 T3935 oascc.ZkStateReader.readConfigName Load collection config from:/collections/testOverseerQuit
   [junit4]   2> 1331307 T3919 oasc.ZkController.waitForShardId waiting to find shard id in clusterstate for testOverseerQuit_shard3_replica2
   [junit4]   2> 1331310 T3919 oasc.ZkController.createCollectionZkNode Check for collection zkNode:testOverseerQuit
   [junit4]   2> 1331313 T3949 oasc.ZkController.createCollectionZkNode Collection zkNode exists
   [junit4]   2> 1331314 T3949 oascc.ZkStateReader.readConfigName Load collection config from:/collections/testOverseerQuit
   [junit4]   2> 1331316 T3892 oasc.ZkController.waitForShardId waiting to find shard id in clusterstate for testOverseerQuit_shard4_replica1
   [junit4]   2> 1331321 T3892 oasc.ZkController.createCollectionZkNode Check for collection zkNode:testOverseerQuit
   [junit4]   2> 1331323 T3919 oasc.ZkController.createCollectionZkNode Collection zkNode exists
   [junit4]   2> 1331323 T3919 oascc.ZkStateReader.readConfigName Load collection config from:/collections/testOverseerQuit
   [junit4]   2> 1331321 T3906 oascc.ZkStateReader.readConfigName path=/collections/testOverseerQuit configName=conf1 specified config exists in ZooKeeper
   [junit4]   2> 1331324 T3906 oasc.SolrResourceLoader.<init> new SolrResourceLoader for directory: '../../../../../../../../../Users/jenkins/workspace/Lucene-Solr-trunk-MacOSX/solr/build/solr-core/test/J0/./solr.cloud.OverseerRolesTest-A511644ABE1B8AF0-001/tempDir-004/testOverseerQuit_shard1_replica2/'
   [junit4]   2> 1331327 T3959 oasc.ZkController.createCollectionZkNode Collection zkNode exists
   [junit4]   2> 1331328 T3959 oascc.ZkStateReader.readConfigName Load collection config from:/collections/testOverseerQuit
   [junit4]   2> 1331330 T3873 oasc.ZkController.waitForShardId waiting to find shard id in clusterstate for testOverseerQuit_shard4_replica2
   [junit4]   2> 1331335 T3873 oasc.ZkController.createCollectionZkNode Check for collection zkNode:testOverseerQuit
   [junit4]   2> 1331340 T3935 oascc.ZkStateReader.readConfigName path=/collections/testOverseerQuit configName=conf1 specified config exists in ZooKeeper
   [junit4]   2> 1331341 T3935 oasc.SolrResourceLoader.<init> new SolrResourceLoader for directory: '../../../../../../../../../Users/jenkins/workspace/Lucene-Solr-trunk-MacOSX/solr/build/solr-core/test/J0/./solr.cloud.OverseerRolesTest-A511644ABE1B8AF0-001/tempDir-006/testOverseerQuit_shard2_replica1/'
   [junit4]   2> 1331341 T3892 oasc.ZkController.createCollectionZkNode Collection zkNode exists
   [junit4]   2> 1331348 T3892 oascc.ZkStateReader.readConfigName Load collection config from:/collections/testOverseerQuit
   [junit4]   2> 1331360 T3919 oascc.ZkStateReader.readConfigName path=/collections/testOverseerQuit configName=conf1 specified config exists in ZooKeeper
   [junit4]   2> 1331360 T3919 oasc.SolrResourceLoader.<init> new SolrResourceLoader for directory: './solr.cloud.OverseerRolesTest-A511644ABE1B8AF0-001/tempDir-005/testOverseerQuit_shard3_replica2/'
   [junit4]   2> 1331364 T3892 oascc.ZkStateReader.readConfigName path=/collections/testOverseerQuit configName=conf1 specified config exists in ZooKeeper
   [junit4]   2> 1331365 T3892 oasc.SolrResourceLoader.<init> new SolrResourceLoader for directory: '../../../../../../../../../Users/jenkins/workspace/Lucene-Solr-trunk-MacOSX/solr/build/solr-core/test/J0/./solr.cloud.OverseerRolesTest-A511644ABE1B8AF0-001/tempDir-003/testOverseerQuit_shard4_replica1/'
   [junit4]   2> 1331374 T3873 oasc.ZkController.createCollectionZkNode Collection zkNode exists
   [junit4]   2> 1331375 T3873 oascc.ZkStateReader.readConfigName Load collection config from:/collections/testOverseerQuit
   [junit4]   2> 1331376 T3959 oascc.ZkStateReader.readConfigName path=/collections/testOverseerQuit configName=conf1 specified config exists in ZooKeeper
   [junit4]   2> 1331376 T3959 oasc.SolrResourceLoader.<init> new SolrResourceLoader for directory: '../../../../../../../../../Users/jenkins/workspace/Lucene-Solr-trunk-MacOSX/solr/build/solr-core/test/J0/./solr.cloud.OverseerRolesTest-A511644ABE1B8AF0-001/tempDir-008/testOverseerQuit_shard2_replica2/'
   [junit4]   2> 1331378 T3949 oascc.ZkStateReader.readConfigName path=/collections/testOverseerQuit configName=conf1 specified config exists in ZooKeeper
   [junit4]   2> 1331378 T3949 oasc.SolrResourceLoader.<init> new SolrResourceLoader for directory: '../../../../../../../../../Users/jenkins/workspace/Lucene-Solr-trunk-MacOSX/solr/build/solr-core/test/J0/./solr.cloud.OverseerRolesTest-A511644ABE1B8AF0-001/tempDir-007/testOverseerQuit_shard3_replica1/'
   [junit4]   2> 1331408 T3873 oascc.ZkStateReader.readConfigName path=/collections/testOverseerQuit configName=conf1 specified config exists in ZooKeeper
   [junit4]   2> 1331408 T3873 oasc.SolrResourceLoader.<init> new SolrResourceLoader for directory: './solr.cloud.OverseerRolesTest-A511644ABE1B8AF0-001/tempDir-002/testOverseerQuit_shard4_replica2/'
   [junit4]   2> 1331627 T3906 oasc.SolrConfig.<init> Using Lucene MatchVersion: LUCENE_5_0
   [junit4]   2> 1331722 T3959 oasc.SolrConfig.<init> Using Lucene MatchVersion: LUCENE_5_0
   [junit4]   2> 1331746 T3919 oasc.SolrConfig.<init> Using Lucene MatchVersion: LUCENE_5_0
   [junit4]   2> 1331751 T3892 oasc.SolrConfig.<init> Using Lucene MatchVersion: LUCENE_5_0
   [junit4]   2> 1331804 T3870 oasc.SolrConfig.<init> Using Lucene MatchVersion: LUCENE_5_0
   [junit4]   2> 1331941 T3873 oasc.SolrConfig.<init> Using Lucene MatchVersion: LUCENE_5_0
   [junit4]   2> 1331948 T3949 oasc.SolrConfig.<init> Using Lucene MatchVersion: LUCENE_5_0
   [junit4]   2> 1332096 T3935 oasc.SolrConfig.<init> Using Lucene MatchVersion: LUCENE_5_0
   [junit4]   2> 1332143 T3906 oasc.SolrConfig.<init> Loaded SolrConfig: solrconfig.xml
   [junit4]   2> 1332191 T3906 oass.IndexSchema.readSchema Reading Solr Schema from schema.xml
   [junit4]   2> 1332245 T3906 oass.IndexSchema.readSchema [testOverseerQuit_shard1_replica2] Schema name=test
   [junit4]   2> 1332260 T3959 oasc.SolrConfig.<init> Loaded SolrConfig: solrconfig.xml
   [junit4]   2> 1332276 T3959 oass.IndexSchema.readSchema Reading Solr Schema from schema.xml
   [junit4]   2> 1332314 T3959 oass.IndexSchema.readSchema [testOverseerQuit_shard2_replica2] Schema name=test
   [junit4]   2> 1332382 T3892 oasc.SolrConfig.<init> Loaded SolrConfig: solrconfig.xml
   [junit4]   2> 1332405 T3892 oass.IndexSchema.readSchema Reading Solr Schema from schema.xml
   [junit4]   2> 1332451 T3949 oasc.SolrConfig.<init> Loaded SolrConfig: solrconfig.xml
   [junit4]   2> 1332467 T3949 oass.IndexSchema.readSchema Reading Solr Schema from schema.xml
   [junit4]   2> 1332487 T3892 oass.IndexSchema.readSchema [testOverseerQuit_shard4_replica1] Schema name=test
   [junit4]   2> 1332498 T3949 oass.IndexSchema.readSchema [testOverseerQuit_shard3_replica1] Schema name=test
   [junit4]   2> 1332520 T3870 oasc.SolrConfig.<init> Loaded SolrConfig: solrconfig.xml
   [junit4]   2> 1332530 T3870 oass.IndexSchema.readSchema Reading Solr Schema from schema.xml
   [junit4]   2> 1332534 T3919 oasc.SolrConfig.<init> Loaded SolrConfig: solrconfig.xml
   [junit4]   2> 1332549 T3919 oass.IndexSchema.readSchema Reading Solr Schema from schema.xml
   [junit4]   2> 1332577 T3870 oass.IndexSchema.readSchema [testOverseerQuit_shard1_replica1] Schema name=test
   [junit4]   2> 1332632 T3919 oass.IndexSchema.readSchema [testOverseerQuit_shard3_replica2] Schema name=test
   [junit4]   2> 1332635 T3935 oasc.SolrConfig.<init> Loaded SolrConfig: solrconfig.xml
   [junit4]   2> 1332673 T3935 oass.IndexSchema.readSchema Reading Solr Schema from schema.xml
   [junit4]   2> 1332690 T3935 oass.IndexSchema.readSchema [testOverseerQuit_shard2_replica1] Schema name=test
   [junit4]   2> 1332724 T3873 oasc.SolrConfig.<init> Loaded SolrConfig: solrconfig.xml
   [junit4]   2> 1332737 T3873 oass.IndexSchema.readSchema Reading Solr Schema from schema.xml
   [junit4]   2> 1332758 T3873 oass.IndexSchema.readSchema [testOverseerQuit_shard4_replica2] Schema name=test
   [junit4]   2> 1335826 T3870 oass.OpenExchangeRatesOrgProvider.init Initialized with rates=open-exchange-rates.json, refreshInterval=1440.
   [junit4]   2> 1335843 T3870 oass.IndexSchema.readSchema default search field in schema is text
   [junit4]   2> 1335887 T3870 oass.IndexSchema.readSchema unique key field: id
   [junit4]   2> 1335971 T3906 oass.OpenExchangeRatesOrgProvider.init Initialized with rates=open-exchange-rates.json, refreshInterval=1440.
   [junit4]   2> 1336002 T3870 oass.FileExchangeRateProvider.reload Reloading exchange rates from file currency.xml
   [junit4]   2> 1336012 T3959 oass.OpenExchangeRatesOrgProvider.init Initialized with rates=open-exchange-rates.json, refreshInterval=1440.
   [junit4]   2> 1336040 T3959 oass.IndexSchema.readSchema default search field in schema is text
   [junit4]   2> 1336045 T3959 oass.IndexSchema.readSchema unique key field: id
   [junit4]   2> 1336066 T3906 oass.IndexSchema.readSchema default search field in schema is text
   [junit4]   2> 1336077 T3870 oass.FileExchangeRateProvider.reload Reloading exchange rates from file currency.xml
   [junit4]   2> 1336083 T3906 oass.IndexSchema.readSchema unique key field: id
   [junit4]   2> 1336092 T3870 oass.OpenExchangeRatesOrgProvider.reload Reloading exchange rates from open-exchange-rates.json
   [junit4]   2> 1336101 T3870 oass.OpenExchangeRatesOrgProvider$OpenExchangeRates.<init> WARN Unknown key IMPORTANT NOTE
   [junit4]   2> 1336108 T3870 oass.OpenExchangeRatesOrgProvider$OpenExchangeRates.<init> WARN Expected key, got STRING
   [junit4]   2> 1336108 T3870 oass.OpenExchangeRatesOrgProvider.reload Reloading exchange rates from open-exchange-rates.json
   [junit4]   2> 1336127 T3870 oass.OpenExchangeRatesOrgProvider$OpenExchangeRates.<init> WARN Unknown key IMPORTANT NOTE
   [junit4]   2> 1336128 T3870 oass.OpenExchangeRatesOrgProvider$OpenExchangeRates.<init> WARN Expected key, got STRING
   [junit4]   2> 1336128 T3870 oasc.CoreContainer.create Creating SolrCore 'testOverseerQuit_shard1_replica1' using configuration from collection testOverseerQuit
   [junit4]   2> 1336128 T3870 oasc.SolrCore.initDirectoryFactory org.apache.solr.core.MockDirectoryFactory
   [junit4]   2> 1336129 T3870 oasc.SolrCore.<init> [testOverseerQuit_shard1_replica1] Opening new SolrCore at ./solr.cloud.OverseerRolesTest-A511644ABE1B8AF0-001/tempDir-002/testOverseerQuit_shard1_replica1/, dataDir=./solr.cloud.OverseerRolesTest-A511644ABE1B8AF0-001/tempDir-002/testOverseerQuit_shard1_replica1/data/
   [junit4]   2> 1336130 T3870 oasc.JmxMonitoredMap.<init> JMX monitoring is enabled. Adding Solr mbeans to JMX Server: com.sun.jmx.mbeanserver.JmxMBeanServer@6377137e
   [junit4]   2> 1336134 T3870 oasc.CachingDirectoryFactory.get return new directory for ./solr.cloud.OverseerRolesTest-A511644ABE1B8AF0-001/tempDir-002/testOverseerQuit_shard1_replica1/data
   [junit4]   2> 1336139 T3870 oasc.SolrCore.getNewIndexDir New index directory detected: old=null new=./solr.cloud.OverseerRolesTest-A511644ABE1B8AF0-001/tempDir-002/testOverseerQuit_shard1_replica1/data/index/
   [junit4]   2> 1336140 T3870 oasc.SolrCore.initIndex WARN [testOverseerQuit_shard1_replica1] Solr index directory './solr.cloud.OverseerRolesTest-A511644ABE1B8AF0-001/tempDir-002/testOverseerQuit_shard1_replica1/data/index' doesn't exist. Creating new index...
   [junit4]   2> 1336140 T3870 oasc.CachingDirectoryFactory.get return new directory for ./solr.cloud.OverseerRolesTest-A511644ABE1B8AF0-001/tempDir-002/testOverseerQuit_shard1_replica1/data/index
   [junit4]   2> 1336141 T3870 oasu.RandomMergePolicy.<init> RandomMergePolicy wrapping class org.apache.lucene.index.TieredMergePolicy: [TieredMergePolicy: maxMergeAtOnce=14, maxMergeAtOnceExplicit=13, maxMergedSegmentMB=69.6240234375, floorSegmentMB=1.6318359375, forceMergeDeletesPctAllowed=1.048444855374382, segmentsPerTier=49.0, maxCFSSegmentSizeMB=8.796093022207999E12, noCFSRatio=0.8516901302272604
   [junit4]   2> 1336142 T3870 oasc.SolrDeletionPolicy.onCommit SolrDeletionPolicy.onCommit: commits: num=1
   [junit4]   2> 		commit{dir=MockDirectoryWrapper(RAMDirectory@d9b4e4c lockFactory=org.apache.lucene.store.SingleInstanceLockFactory@63dc6f8e),segFN=segments_1,generation=1}
   [junit4]   2> 1336142 T3870 oasc.SolrDeletionPolicy.updateCommits newest commit generation = 1
   [junit4]   2> 1336153 T3870 oasup.UpdateRequestProcessorChain.init creating updateRequestProcessorChain "nodistrib"
   [junit4]   2> 1336166 T3870 oasup.UpdateRequestProcessorChain.init creating updateRequestProcessorChain "dedupe"
   [junit4]   2> 1336168 T3870 oasup.UpdateRequestProcessorChain.init inserting DistributedUpdateProcessorFactory into updateRequestProcessorChain "dedupe"
   [junit4]   2> 1336169 T3870 oasup.UpdateRequestProcessorChain.init creating updateRequestProcessorChain "stored_sig"
   [junit4]   2> 1336170 T3870 oasup.UpdateRequestProcessorChain.init inserting DistributedUpdateProcessorFactory into updateRequestProcessorChain "stored_sig"
   [junit4]   2> 1336170 T3870 oasup.UpdateRequestProcessorChain.init creating updateRequestProcessorChain "distrib-dup-test-chain-explicit"
   [junit4]   2> 1336172 T3870 oasup.UpdateRequestProcessorChain.init creating updateRequestProcessorChain "distrib-dup-test-chain-implicit"
   [junit4]   2> 1336173 T3870 oasup.UpdateRequestProcessorChain.init inserting DistributedUpdateProcessorFactory into updateRequestProcessorChain "distrib-dup-test-chain-implicit"
   [junit4]   2> 1336173 T3870 oasc.SolrCore.loadUpdateProcessorChains no updateRequestProcessorChain defined as default, creating implicit default
   [junit4]   2> 1336175 T3870 oasc.RequestHandlers.initHandlersFromConfig created standard: solr.StandardRequestHandler
   [junit4]   2> 1336176 T3870 oasc.RequestHandlers.initHandlersFromConfig created /get: solr.RealTimeGetHandler
   [junit4]   2> 1336176 T3892 oass.OpenExchangeRatesOrgProvider.init Initialized with rates=open-exchange-rates.json, refreshInterval=1440.
   [junit4]   2> 1336176 T3870 oasc.RequestHandlers.initHandlersFromConfig adding lazy requestHandler: solr.ReplicationHandler
   [junit4]   2> 1336180 T3870 oasc.RequestHandlers.initHandlersFromConfig created /replication: solr.ReplicationHandler
   [junit4]   2> 1336198 T3870 oasc.RequestHandlers.initHandlersFromConfig created /update: solr.UpdateRequestHandler
   [junit4]   2> 1336199 T3870 oasc.RequestHandlers.initHandlersFromConfig created /admin/: org.apache.solr.handler.admin.AdminHandlers
   [junit4]   2> 1336200 T3870 oasc.RequestHandlers.initHandlersFromConfig created /admin/file: solr.admin.ShowFileRequestHandler
   [junit4]   2> 1336201 T3870 oasc.RequestHandlers.initHandlersFromConfig created /admin/fil

[...truncated too long message...]

shard3_replica1/data [CachedDir<<refCount=0;path=../../../../../../../../../Users/jenkins/workspace/Lucene-Solr-trunk-MacOSX/solr/build/solr-core/test/J0/./solr.cloud.OverseerRolesTest-A511644ABE1B8AF0-001/tempDir-007/testOverseerCol_shard3_replica1/data;done=false>>]
   [junit4]   2> 1373214 T3954 oasc.CachingDirectoryFactory.close Closing directory: ../../../../../../../../../Users/jenkins/workspace/Lucene-Solr-trunk-MacOSX/solr/build/solr-core/test/J0/./solr.cloud.OverseerRolesTest-A511644ABE1B8AF0-001/tempDir-007/testOverseerCol_shard3_replica1/data
   [junit4]   2> 1373214 T3954 oasc.CachingDirectoryFactory.closeCacheValue looking to close ../../../../../../../../../Users/jenkins/workspace/Lucene-Solr-trunk-MacOSX/solr/build/solr-core/test/J0/./solr.cloud.OverseerRolesTest-A511644ABE1B8AF0-001/tempDir-007/testOverseerCol_shard3_replica1/data/index [CachedDir<<refCount=0;path=../../../../../../../../../Users/jenkins/workspace/Lucene-Solr-trunk-MacOSX/solr/build/solr-core/test/J0/./solr.cloud.OverseerRolesTest-A511644ABE1B8AF0-001/tempDir-007/testOverseerCol_shard3_replica1/data/index;done=false>>]
   [junit4]   2> 1373214 T3954 oasc.CachingDirectoryFactory.close Closing directory: ../../../../../../../../../Users/jenkins/workspace/Lucene-Solr-trunk-MacOSX/solr/build/solr-core/test/J0/./solr.cloud.OverseerRolesTest-A511644ABE1B8AF0-001/tempDir-007/testOverseerCol_shard3_replica1/data/index
   [junit4]   2> 1373214 T3954 oascc.SolrZkClient.makePath makePath: /collections/testOverseerCol/leaders/shard3
   [junit4]   2> 1373215 T3954 oasc.SolrException.log ERROR There was a problem trying to register as the leader:org.apache.solr.common.SolrException: Could not register as the leader because creating the ephemeral registration node in ZooKeeper failed
   [junit4]   2> 		at org.apache.solr.cloud.ShardLeaderElectionContextBase.runLeaderProcess(ElectionContext.java:135)
   [junit4]   2> 		at org.apache.solr.cloud.ShardLeaderElectionContext.runLeaderProcess(ElectionContext.java:290)
   [junit4]   2> 		at org.apache.solr.cloud.LeaderElector.runIamLeaderProcess(LeaderElector.java:142)
   [junit4]   2> 		at org.apache.solr.cloud.LeaderElector.checkIfIamLeader(LeaderElector.java:110)
   [junit4]   2> 		at org.apache.solr.cloud.LeaderElector.access$200(LeaderElector.java:55)
   [junit4]   2> 		at org.apache.solr.cloud.LeaderElector$ElectionWatcher.process(LeaderElector.java:303)
   [junit4]   2> 		at org.apache.zookeeper.ClientCnxn$EventThread.processEvent(ClientCnxn.java:522)
   [junit4]   2> 		at org.apache.zookeeper.ClientCnxn$EventThread.run(ClientCnxn.java:498)
   [junit4]   2> 	Caused by: org.apache.zookeeper.KeeperException$SessionExpiredException: KeeperErrorCode = Session expired for /collections
   [junit4]   2> 		at org.apache.zookeeper.KeeperException.create(KeeperException.java:127)
   [junit4]   2> 		at org.apache.zookeeper.KeeperException.create(KeeperException.java:51)
   [junit4]   2> 		at org.apache.zookeeper.ZooKeeper.exists(ZooKeeper.java:1045)
   [junit4]   2> 		at org.apache.solr.common.cloud.SolrZkClient$3.execute(SolrZkClient.java:209)
   [junit4]   2> 		at org.apache.solr.common.cloud.SolrZkClient$3.execute(SolrZkClient.java:206)
   [junit4]   2> 		at org.apache.solr.common.cloud.ZkCmdExecutor.retryOperation(ZkCmdExecutor.java:73)
   [junit4]   2> 		at org.apache.solr.common.cloud.SolrZkClient.exists(SolrZkClient.java:206)
   [junit4]   2> 		at org.apache.solr.common.cloud.SolrZkClient.makePath(SolrZkClient.java:417)
   [junit4]   2> 		at org.apache.solr.common.cloud.SolrZkClient.makePath(SolrZkClient.java:386)
   [junit4]   2> 		at org.apache.solr.common.cloud.SolrZkClient.makePath(SolrZkClient.java:373)
   [junit4]   2> 		at org.apache.solr.cloud.ShardLeaderElectionContextBase$1.execute(ElectionContext.java:127)
   [junit4]   2> 		at org.apache.solr.common.util.RetryUtil.retryOnThrowable(RetryUtil.java:31)
   [junit4]   2> 		at org.apache.solr.cloud.ShardLeaderElectionContextBase.runLeaderProcess(ElectionContext.java:122)
   [junit4]   2> 		... 7 more
   [junit4]   2> 	
   [junit4]   2> 1373216 T3954 oascc.ZkStateReader$3.process WARN ZooKeeper watch triggered, but Solr cannot talk to ZK
   [junit4]   2> 1373217 T3954 oasc.LeaderElector$ElectionWatcher.process WARN  org.apache.zookeeper.KeeperException$SessionExpiredException: KeeperErrorCode = Session expired for /overseer_elect/election
   [junit4]   2> 	at org.apache.zookeeper.KeeperException.create(KeeperException.java:127)
   [junit4]   2> 	at org.apache.zookeeper.KeeperException.create(KeeperException.java:51)
   [junit4]   2> 	at org.apache.zookeeper.ZooKeeper.getChildren(ZooKeeper.java:1472)
   [junit4]   2> 	at org.apache.solr.common.cloud.SolrZkClient$6.execute(SolrZkClient.java:260)
   [junit4]   2> 	at org.apache.solr.common.cloud.SolrZkClient$6.execute(SolrZkClient.java:257)
   [junit4]   2> 	at org.apache.solr.common.cloud.ZkCmdExecutor.retryOperation(ZkCmdExecutor.java:73)
   [junit4]   2> 	at org.apache.solr.common.cloud.SolrZkClient.getChildren(SolrZkClient.java:257)
   [junit4]   2> 	at org.apache.solr.cloud.LeaderElector.checkIfIamLeader(LeaderElector.java:94)
   [junit4]   2> 	at org.apache.solr.cloud.LeaderElector.access$200(LeaderElector.java:55)
   [junit4]   2> 	at org.apache.solr.cloud.LeaderElector$ElectionWatcher.process(LeaderElector.java:303)
   [junit4]   2> 	at org.apache.zookeeper.ClientCnxn$EventThread.processEvent(ClientCnxn.java:522)
   [junit4]   2> 	at org.apache.zookeeper.ClientCnxn$EventThread.run(ClientCnxn.java:498)
   [junit4]   2> 
   [junit4]   2> NOTE: leaving temporary files on disk at: /Users/jenkins/workspace/Lucene-Solr-trunk-MacOSX/solr/build/solr-core/test/J0/./solr.cloud.OverseerRolesTest-A511644ABE1B8AF0-001
   [junit4]   2> NOTE: test params are: codec=Lucene46: {}, docValues:{}, sim=DefaultSimilarity, locale=es_PA, timezone=Greenwich
   [junit4]   2> NOTE: Mac OS X 10.8.5 x86_64/Oracle Corporation 1.7.0_55 (64-bit)/cpus=2,threads=1,free=119684432,total=239919104
   [junit4]   2> NOTE: All tests run in this JVM: [ExpressionTest, TestJoin, QueryElevationComponentTest, DistributedSuggestComponentTest, DirectSolrSpellCheckerTest, SyncSliceTest, TestCharFilters, SolrCmdDistributorTest, TestIndexingPerformance, SolrXmlInZkTest, SolrPluginUtilsTest, SliceStateTest, TestExpandComponent, TestArbitraryIndexDir, RecoveryZkTest, OverseerStatusTest, TestSuggestSpellingConverter, TestNonDefinedSimilarityFactory, TestRangeQuery, ChaosMonkeySafeLeaderTest, DocExpirationUpdateProcessorFactoryTest, AnalysisErrorHandlingTest, TestCodecSupport, TestHighlightDedupGrouping, DeleteReplicaTest, CoreMergeIndexesAdminHandlerTest, TestComponentsName, DistributedQueryElevationComponentTest, TestRandomMergePolicy, DocValuesMultiTest, BJQParserTest, BlockDirectoryTest, TestXIncludeConfig, TestCustomSort, TestSearchPerf, PathHierarchyTokenizerFactoryTest, SearchHandlerTest, ParsingFieldUpdateProcessorsTest, DOMUtilTest, TestManagedResource, ClusterStateUpdateTest, TestSolrIndexConfig, TestDistributedSearch, TestCloudManagedSchema, TestConfigSets, TestQuerySenderListener, TestCollationField, DistributedQueryComponentCustomSortTest, AsyncMigrateRouteKeyTest, CursorPagingTest, SoftAutoCommitTest, TestDocBasedVersionConstraints, DistributedQueryComponentOptimizationTest, MBeansHandlerTest, SolrTestCaseJ4Test, TestSolrXmlPersistence, TestMergePolicyConfig, TestHighFrequencyDictionaryFactory, TestSolrQueryParser, TestUpdate, HdfsDirectoryTest, ShardRoutingTest, AbstractAnalyticsFacetTest, ChaosMonkeyNothingIsSafeTest, CurrencyFieldOpenExchangeTest, TestFuzzyAnalyzedSuggestions, CircularListTest, TestBinaryResponseWriter, LukeRequestHandlerTest, TestAnalyzeInfixSuggestions, TestLMDirichletSimilarityFactory, TestConfig, TestMaxScoreQueryParser, IndexSchemaRuntimeFieldTest, TestLRUCache, BadComponentTest, EnumFieldTest, TriLevelCompositeIdRoutingTest, ExternalFileFieldSortTest, TestInfoStreamLogging, TestRealTimeGet, LeaderElectionTest, FieldFacetExtrasTest, TestQuerySenderNoQuery, ShardRoutingCustomTest, TestLuceneMatchVersion, TestCollapseQParserPlugin, TestElisionMultitermQuery, TestRecovery, TestReload, ResponseHeaderTest, TestSchemaVersionResource, TestNRTOpen, TestFreeTextSuggestions, TestFieldCollectionResource, TestCoreContainer, TestFunctionQuery, TestPHPSerializedResponseWriter, TestSolrQueryParserResource, TestStressRecovery, TestBlendedInfixSuggestions, HdfsBasicDistributedZkTest, TestSystemIdResolver, TestRTGBase, TestCSVResponseWriter, CoreAdminCreateDiscoverTest, SpellCheckCollatorTest, OverseerRolesTest]
   [junit4] Completed in 70.01s, 1 test, 1 failure <<< FAILURES!

[...truncated 904 lines...]
BUILD FAILED
/Users/jenkins/workspace/Lucene-Solr-trunk-MacOSX/build.xml:467: The following error occurred while executing this line:
/Users/jenkins/workspace/Lucene-Solr-trunk-MacOSX/build.xml:447: The following error occurred while executing this line:
/Users/jenkins/workspace/Lucene-Solr-trunk-MacOSX/build.xml:45: The following error occurred while executing this line:
/Users/jenkins/workspace/Lucene-Solr-trunk-MacOSX/extra-targets.xml:37: The following error occurred while executing this line:
/Users/jenkins/workspace/Lucene-Solr-trunk-MacOSX/solr/build.xml:189: The following error occurred while executing this line:
/Users/jenkins/workspace/Lucene-Solr-trunk-MacOSX/solr/common-build.xml:496: The following error occurred while executing this line:
/Users/jenkins/workspace/Lucene-Solr-trunk-MacOSX/lucene/common-build.xml:1296: The following error occurred while executing this line:
/Users/jenkins/workspace/Lucene-Solr-trunk-MacOSX/lucene/common-build.xml:920: There were test failures: 400 suites, 1679 tests, 1 failure, 42 ignored (15 assumptions)

Total time: 113 minutes 25 seconds
Build step 'Invoke Ant' marked build as failure
Description set: Java: 64bit/jdk1.7.0 -XX:+UseCompressedOops -XX:+UseSerialGC
Archiving artifacts
Recording test results
Email was triggered for: Failure
Sending email for trigger: Failure



Mime
View raw message