lucene-dev mailing list archives

Site index · List index
Message view « Date » · « Thread »
Top « Date » · « Thread »
From buil...@flonkings.com
Subject [JENKINS] Lucene-4x-Linux-Java7-64-test-only - Build # 21652 - Failure!
Date Fri, 16 May 2014 15:11:34 GMT
Build: builds.flonkings.com/job/Lucene-4x-Linux-Java7-64-test-only/21652/

5 tests failed.
REGRESSION:  org.apache.lucene.index.TestIndexWriterMerging.testForceMergeDeletes

Error Message:
background merge hit exception: _0(4.9):c2/1:delGen=1

Stack Trace:
java.io.IOException: background merge hit exception: _0(4.9):c2/1:delGen=1
	at __randomizedtesting.SeedInfo.seed([9D5B5E4655F102B:3BA5E5425AD59004]:0)
	at org.apache.lucene.index.IndexWriter.forceMergeDeletes(IndexWriter.java:1915)
	at org.apache.lucene.index.IndexWriter.forceMergeDeletes(IndexWriter.java:1955)
	at org.apache.lucene.index.TestIndexWriterMerging.testForceMergeDeletes(TestIndexWriterMerging.java:170)
	at sun.reflect.NativeMethodAccessorImpl.invoke0(Native Method)
	at sun.reflect.NativeMethodAccessorImpl.invoke(NativeMethodAccessorImpl.java:57)
	at sun.reflect.DelegatingMethodAccessorImpl.invoke(DelegatingMethodAccessorImpl.java:43)
	at java.lang.reflect.Method.invoke(Method.java:606)
	at com.carrotsearch.randomizedtesting.RandomizedRunner.invoke(RandomizedRunner.java:1618)
	at com.carrotsearch.randomizedtesting.RandomizedRunner$6.evaluate(RandomizedRunner.java:827)
	at com.carrotsearch.randomizedtesting.RandomizedRunner$7.evaluate(RandomizedRunner.java:863)
	at com.carrotsearch.randomizedtesting.RandomizedRunner$8.evaluate(RandomizedRunner.java:877)
	at org.apache.lucene.util.TestRuleSetupTeardownChained$1.evaluate(TestRuleSetupTeardownChained.java:50)
	at org.apache.lucene.util.TestRuleFieldCacheSanity$1.evaluate(TestRuleFieldCacheSanity.java:51)
	at org.apache.lucene.util.AbstractBeforeAfterRule$1.evaluate(AbstractBeforeAfterRule.java:46)
	at com.carrotsearch.randomizedtesting.rules.SystemPropertiesInvariantRule$1.evaluate(SystemPropertiesInvariantRule.java:55)
	at org.apache.lucene.util.TestRuleThreadAndTestName$1.evaluate(TestRuleThreadAndTestName.java:49)
	at org.apache.lucene.util.TestRuleIgnoreAfterMaxFailures$1.evaluate(TestRuleIgnoreAfterMaxFailures.java:65)
	at org.apache.lucene.util.TestRuleMarkFailure$1.evaluate(TestRuleMarkFailure.java:48)
	at com.carrotsearch.randomizedtesting.rules.StatementAdapter.evaluate(StatementAdapter.java:36)
	at com.carrotsearch.randomizedtesting.ThreadLeakControl$StatementRunner.run(ThreadLeakControl.java:360)
	at com.carrotsearch.randomizedtesting.ThreadLeakControl.forkTimeoutingTask(ThreadLeakControl.java:793)
	at com.carrotsearch.randomizedtesting.ThreadLeakControl$3.evaluate(ThreadLeakControl.java:453)
	at com.carrotsearch.randomizedtesting.RandomizedRunner.runSingleTest(RandomizedRunner.java:836)
	at com.carrotsearch.randomizedtesting.RandomizedRunner$3.evaluate(RandomizedRunner.java:738)
	at com.carrotsearch.randomizedtesting.RandomizedRunner$4.evaluate(RandomizedRunner.java:772)
	at com.carrotsearch.randomizedtesting.RandomizedRunner$5.evaluate(RandomizedRunner.java:783)
	at org.apache.lucene.util.AbstractBeforeAfterRule$1.evaluate(AbstractBeforeAfterRule.java:46)
	at org.apache.lucene.util.TestRuleStoreClassName$1.evaluate(TestRuleStoreClassName.java:42)
	at com.carrotsearch.randomizedtesting.rules.SystemPropertiesInvariantRule$1.evaluate(SystemPropertiesInvariantRule.java:55)
	at com.carrotsearch.randomizedtesting.rules.NoShadowingOrOverridesOnMethodsRule$1.evaluate(NoShadowingOrOverridesOnMethodsRule.java:39)
	at com.carrotsearch.randomizedtesting.rules.NoShadowingOrOverridesOnMethodsRule$1.evaluate(NoShadowingOrOverridesOnMethodsRule.java:39)
	at com.carrotsearch.randomizedtesting.rules.StatementAdapter.evaluate(StatementAdapter.java:36)
	at com.carrotsearch.randomizedtesting.rules.StatementAdapter.evaluate(StatementAdapter.java:36)
	at com.carrotsearch.randomizedtesting.rules.StatementAdapter.evaluate(StatementAdapter.java:36)
	at org.apache.lucene.util.TestRuleAssertionsRequired$1.evaluate(TestRuleAssertionsRequired.java:43)
	at org.apache.lucene.util.TestRuleMarkFailure$1.evaluate(TestRuleMarkFailure.java:48)
	at org.apache.lucene.util.TestRuleIgnoreAfterMaxFailures$1.evaluate(TestRuleIgnoreAfterMaxFailures.java:65)
	at org.apache.lucene.util.TestRuleIgnoreTestSuites$1.evaluate(TestRuleIgnoreTestSuites.java:55)
	at com.carrotsearch.randomizedtesting.rules.StatementAdapter.evaluate(StatementAdapter.java:36)
	at com.carrotsearch.randomizedtesting.ThreadLeakControl$StatementRunner.run(ThreadLeakControl.java:360)
	at java.lang.Thread.run(Thread.java:745)


REGRESSION:  org.apache.lucene.index.TestIndexWriterMerging.testForceMergeDeletes2

Error Message:
background merge hit exception: _0(4.9):C2/1:delGen=1 _1(4.9):C2/1:delGen=1 _2(4.9):C2/1:delGen=1
into _1d

Stack Trace:
java.io.IOException: background merge hit exception: _0(4.9):C2/1:delGen=1 _1(4.9):C2/1:delGen=1
_2(4.9):C2/1:delGen=1 into _1d
	at __randomizedtesting.SeedInfo.seed([9D5B5E4655F102B:AF50D2488B7D20E2]:0)
	at org.apache.lucene.index.IndexWriter.forceMergeDeletes(IndexWriter.java:1915)
	at org.apache.lucene.index.IndexWriter.forceMergeDeletes(IndexWriter.java:1955)
	at org.apache.lucene.index.TestIndexWriterMerging.testForceMergeDeletes2(TestIndexWriterMerging.java:237)
	at sun.reflect.NativeMethodAccessorImpl.invoke0(Native Method)
	at sun.reflect.NativeMethodAccessorImpl.invoke(NativeMethodAccessorImpl.java:57)
	at sun.reflect.DelegatingMethodAccessorImpl.invoke(DelegatingMethodAccessorImpl.java:43)
	at java.lang.reflect.Method.invoke(Method.java:606)
	at com.carrotsearch.randomizedtesting.RandomizedRunner.invoke(RandomizedRunner.java:1618)
	at com.carrotsearch.randomizedtesting.RandomizedRunner$6.evaluate(RandomizedRunner.java:827)
	at com.carrotsearch.randomizedtesting.RandomizedRunner$7.evaluate(RandomizedRunner.java:863)
	at com.carrotsearch.randomizedtesting.RandomizedRunner$8.evaluate(RandomizedRunner.java:877)
	at org.apache.lucene.util.TestRuleSetupTeardownChained$1.evaluate(TestRuleSetupTeardownChained.java:50)
	at org.apache.lucene.util.TestRuleFieldCacheSanity$1.evaluate(TestRuleFieldCacheSanity.java:51)
	at org.apache.lucene.util.AbstractBeforeAfterRule$1.evaluate(AbstractBeforeAfterRule.java:46)
	at com.carrotsearch.randomizedtesting.rules.SystemPropertiesInvariantRule$1.evaluate(SystemPropertiesInvariantRule.java:55)
	at org.apache.lucene.util.TestRuleThreadAndTestName$1.evaluate(TestRuleThreadAndTestName.java:49)
	at org.apache.lucene.util.TestRuleIgnoreAfterMaxFailures$1.evaluate(TestRuleIgnoreAfterMaxFailures.java:65)
	at org.apache.lucene.util.TestRuleMarkFailure$1.evaluate(TestRuleMarkFailure.java:48)
	at com.carrotsearch.randomizedtesting.rules.StatementAdapter.evaluate(StatementAdapter.java:36)
	at com.carrotsearch.randomizedtesting.ThreadLeakControl$StatementRunner.run(ThreadLeakControl.java:360)
	at com.carrotsearch.randomizedtesting.ThreadLeakControl.forkTimeoutingTask(ThreadLeakControl.java:793)
	at com.carrotsearch.randomizedtesting.ThreadLeakControl$3.evaluate(ThreadLeakControl.java:453)
	at com.carrotsearch.randomizedtesting.RandomizedRunner.runSingleTest(RandomizedRunner.java:836)
	at com.carrotsearch.randomizedtesting.RandomizedRunner$3.evaluate(RandomizedRunner.java:738)
	at com.carrotsearch.randomizedtesting.RandomizedRunner$4.evaluate(RandomizedRunner.java:772)
	at com.carrotsearch.randomizedtesting.RandomizedRunner$5.evaluate(RandomizedRunner.java:783)
	at org.apache.lucene.util.AbstractBeforeAfterRule$1.evaluate(AbstractBeforeAfterRule.java:46)
	at org.apache.lucene.util.TestRuleStoreClassName$1.evaluate(TestRuleStoreClassName.java:42)
	at com.carrotsearch.randomizedtesting.rules.SystemPropertiesInvariantRule$1.evaluate(SystemPropertiesInvariantRule.java:55)
	at com.carrotsearch.randomizedtesting.rules.NoShadowingOrOverridesOnMethodsRule$1.evaluate(NoShadowingOrOverridesOnMethodsRule.java:39)
	at com.carrotsearch.randomizedtesting.rules.NoShadowingOrOverridesOnMethodsRule$1.evaluate(NoShadowingOrOverridesOnMethodsRule.java:39)
	at com.carrotsearch.randomizedtesting.rules.StatementAdapter.evaluate(StatementAdapter.java:36)
	at com.carrotsearch.randomizedtesting.rules.StatementAdapter.evaluate(StatementAdapter.java:36)
	at com.carrotsearch.randomizedtesting.rules.StatementAdapter.evaluate(StatementAdapter.java:36)
	at org.apache.lucene.util.TestRuleAssertionsRequired$1.evaluate(TestRuleAssertionsRequired.java:43)
	at org.apache.lucene.util.TestRuleMarkFailure$1.evaluate(TestRuleMarkFailure.java:48)
	at org.apache.lucene.util.TestRuleIgnoreAfterMaxFailures$1.evaluate(TestRuleIgnoreAfterMaxFailures.java:65)
	at org.apache.lucene.util.TestRuleIgnoreTestSuites$1.evaluate(TestRuleIgnoreTestSuites.java:55)
	at com.carrotsearch.randomizedtesting.rules.StatementAdapter.evaluate(StatementAdapter.java:36)
	at com.carrotsearch.randomizedtesting.ThreadLeakControl$StatementRunner.run(ThreadLeakControl.java:360)
	at java.lang.Thread.run(Thread.java:745)


REGRESSION:  org.apache.lucene.index.TestIndexWriterReader.testForceMergeDeletes

Error Message:
background merge hit exception: _0(4.9):c2/1:delGen=1 into _1

Stack Trace:
java.io.IOException: background merge hit exception: _0(4.9):c2/1:delGen=1 into _1
	at __randomizedtesting.SeedInfo.seed([9D5B5E4655F102B:3BA5E5425AD59004]:0)
	at org.apache.lucene.index.IndexWriter.forceMergeDeletes(IndexWriter.java:1915)
	at org.apache.lucene.index.IndexWriter.forceMergeDeletes(IndexWriter.java:1955)
	at org.apache.lucene.index.TestIndexWriterReader.testForceMergeDeletes(TestIndexWriterReader.java:896)
	at sun.reflect.NativeMethodAccessorImpl.invoke0(Native Method)
	at sun.reflect.NativeMethodAccessorImpl.invoke(NativeMethodAccessorImpl.java:57)
	at sun.reflect.DelegatingMethodAccessorImpl.invoke(DelegatingMethodAccessorImpl.java:43)
	at java.lang.reflect.Method.invoke(Method.java:606)
	at com.carrotsearch.randomizedtesting.RandomizedRunner.invoke(RandomizedRunner.java:1618)
	at com.carrotsearch.randomizedtesting.RandomizedRunner$6.evaluate(RandomizedRunner.java:827)
	at com.carrotsearch.randomizedtesting.RandomizedRunner$7.evaluate(RandomizedRunner.java:863)
	at com.carrotsearch.randomizedtesting.RandomizedRunner$8.evaluate(RandomizedRunner.java:877)
	at org.apache.lucene.util.TestRuleSetupTeardownChained$1.evaluate(TestRuleSetupTeardownChained.java:50)
	at org.apache.lucene.util.TestRuleFieldCacheSanity$1.evaluate(TestRuleFieldCacheSanity.java:51)
	at org.apache.lucene.util.AbstractBeforeAfterRule$1.evaluate(AbstractBeforeAfterRule.java:46)
	at com.carrotsearch.randomizedtesting.rules.SystemPropertiesInvariantRule$1.evaluate(SystemPropertiesInvariantRule.java:55)
	at org.apache.lucene.util.TestRuleThreadAndTestName$1.evaluate(TestRuleThreadAndTestName.java:49)
	at org.apache.lucene.util.TestRuleIgnoreAfterMaxFailures$1.evaluate(TestRuleIgnoreAfterMaxFailures.java:65)
	at org.apache.lucene.util.TestRuleMarkFailure$1.evaluate(TestRuleMarkFailure.java:48)
	at com.carrotsearch.randomizedtesting.rules.StatementAdapter.evaluate(StatementAdapter.java:36)
	at com.carrotsearch.randomizedtesting.ThreadLeakControl$StatementRunner.run(ThreadLeakControl.java:360)
	at com.carrotsearch.randomizedtesting.ThreadLeakControl.forkTimeoutingTask(ThreadLeakControl.java:793)
	at com.carrotsearch.randomizedtesting.ThreadLeakControl$3.evaluate(ThreadLeakControl.java:453)
	at com.carrotsearch.randomizedtesting.RandomizedRunner.runSingleTest(RandomizedRunner.java:836)
	at com.carrotsearch.randomizedtesting.RandomizedRunner$3.evaluate(RandomizedRunner.java:738)
	at com.carrotsearch.randomizedtesting.RandomizedRunner$4.evaluate(RandomizedRunner.java:772)
	at com.carrotsearch.randomizedtesting.RandomizedRunner$5.evaluate(RandomizedRunner.java:783)
	at org.apache.lucene.util.AbstractBeforeAfterRule$1.evaluate(AbstractBeforeAfterRule.java:46)
	at org.apache.lucene.util.TestRuleStoreClassName$1.evaluate(TestRuleStoreClassName.java:42)
	at com.carrotsearch.randomizedtesting.rules.SystemPropertiesInvariantRule$1.evaluate(SystemPropertiesInvariantRule.java:55)
	at com.carrotsearch.randomizedtesting.rules.NoShadowingOrOverridesOnMethodsRule$1.evaluate(NoShadowingOrOverridesOnMethodsRule.java:39)
	at com.carrotsearch.randomizedtesting.rules.NoShadowingOrOverridesOnMethodsRule$1.evaluate(NoShadowingOrOverridesOnMethodsRule.java:39)
	at com.carrotsearch.randomizedtesting.rules.StatementAdapter.evaluate(StatementAdapter.java:36)
	at com.carrotsearch.randomizedtesting.rules.StatementAdapter.evaluate(StatementAdapter.java:36)
	at com.carrotsearch.randomizedtesting.rules.StatementAdapter.evaluate(StatementAdapter.java:36)
	at org.apache.lucene.util.TestRuleAssertionsRequired$1.evaluate(TestRuleAssertionsRequired.java:43)
	at org.apache.lucene.util.TestRuleMarkFailure$1.evaluate(TestRuleMarkFailure.java:48)
	at org.apache.lucene.util.TestRuleIgnoreAfterMaxFailures$1.evaluate(TestRuleIgnoreAfterMaxFailures.java:65)
	at org.apache.lucene.util.TestRuleIgnoreTestSuites$1.evaluate(TestRuleIgnoreTestSuites.java:55)
	at com.carrotsearch.randomizedtesting.rules.StatementAdapter.evaluate(StatementAdapter.java:36)
	at com.carrotsearch.randomizedtesting.ThreadLeakControl$StatementRunner.run(ThreadLeakControl.java:360)
	at java.lang.Thread.run(Thread.java:745)


REGRESSION:  org.apache.lucene.index.TestTieredMergePolicy.testForceMergeDeletesMaxSegSize

Error Message:
background merge hit exception: _3n(4.9):C219 into _3o [maxNumSegments=1]

Stack Trace:
java.io.IOException: background merge hit exception: _3n(4.9):C219 into _3o [maxNumSegments=1]
	at __randomizedtesting.SeedInfo.seed([9D5B5E4655F102B:6BD2DA143C56A595]:0)
	at org.apache.lucene.index.IndexWriter.forceMergeDeletes(IndexWriter.java:1915)
	at org.apache.lucene.index.IndexWriter.forceMergeDeletes(IndexWriter.java:1955)
	at org.apache.lucene.index.TestTieredMergePolicy.testForceMergeDeletesMaxSegSize(TestTieredMergePolicy.java:148)
	at sun.reflect.NativeMethodAccessorImpl.invoke0(Native Method)
	at sun.reflect.NativeMethodAccessorImpl.invoke(NativeMethodAccessorImpl.java:57)
	at sun.reflect.DelegatingMethodAccessorImpl.invoke(DelegatingMethodAccessorImpl.java:43)
	at java.lang.reflect.Method.invoke(Method.java:606)
	at com.carrotsearch.randomizedtesting.RandomizedRunner.invoke(RandomizedRunner.java:1618)
	at com.carrotsearch.randomizedtesting.RandomizedRunner$6.evaluate(RandomizedRunner.java:827)
	at com.carrotsearch.randomizedtesting.RandomizedRunner$7.evaluate(RandomizedRunner.java:863)
	at com.carrotsearch.randomizedtesting.RandomizedRunner$8.evaluate(RandomizedRunner.java:877)
	at org.apache.lucene.util.TestRuleSetupTeardownChained$1.evaluate(TestRuleSetupTeardownChained.java:50)
	at org.apache.lucene.util.TestRuleFieldCacheSanity$1.evaluate(TestRuleFieldCacheSanity.java:51)
	at org.apache.lucene.util.AbstractBeforeAfterRule$1.evaluate(AbstractBeforeAfterRule.java:46)
	at com.carrotsearch.randomizedtesting.rules.SystemPropertiesInvariantRule$1.evaluate(SystemPropertiesInvariantRule.java:55)
	at org.apache.lucene.util.TestRuleThreadAndTestName$1.evaluate(TestRuleThreadAndTestName.java:49)
	at org.apache.lucene.util.TestRuleIgnoreAfterMaxFailures$1.evaluate(TestRuleIgnoreAfterMaxFailures.java:65)
	at org.apache.lucene.util.TestRuleMarkFailure$1.evaluate(TestRuleMarkFailure.java:48)
	at com.carrotsearch.randomizedtesting.rules.StatementAdapter.evaluate(StatementAdapter.java:36)
	at com.carrotsearch.randomizedtesting.ThreadLeakControl$StatementRunner.run(ThreadLeakControl.java:360)
	at com.carrotsearch.randomizedtesting.ThreadLeakControl.forkTimeoutingTask(ThreadLeakControl.java:793)
	at com.carrotsearch.randomizedtesting.ThreadLeakControl$3.evaluate(ThreadLeakControl.java:453)
	at com.carrotsearch.randomizedtesting.RandomizedRunner.runSingleTest(RandomizedRunner.java:836)
	at com.carrotsearch.randomizedtesting.RandomizedRunner$3.evaluate(RandomizedRunner.java:738)
	at com.carrotsearch.randomizedtesting.RandomizedRunner$4.evaluate(RandomizedRunner.java:772)
	at com.carrotsearch.randomizedtesting.RandomizedRunner$5.evaluate(RandomizedRunner.java:783)
	at org.apache.lucene.util.AbstractBeforeAfterRule$1.evaluate(AbstractBeforeAfterRule.java:46)
	at org.apache.lucene.util.TestRuleStoreClassName$1.evaluate(TestRuleStoreClassName.java:42)
	at com.carrotsearch.randomizedtesting.rules.SystemPropertiesInvariantRule$1.evaluate(SystemPropertiesInvariantRule.java:55)
	at com.carrotsearch.randomizedtesting.rules.NoShadowingOrOverridesOnMethodsRule$1.evaluate(NoShadowingOrOverridesOnMethodsRule.java:39)
	at com.carrotsearch.randomizedtesting.rules.NoShadowingOrOverridesOnMethodsRule$1.evaluate(NoShadowingOrOverridesOnMethodsRule.java:39)
	at com.carrotsearch.randomizedtesting.rules.StatementAdapter.evaluate(StatementAdapter.java:36)
	at com.carrotsearch.randomizedtesting.rules.StatementAdapter.evaluate(StatementAdapter.java:36)
	at com.carrotsearch.randomizedtesting.rules.StatementAdapter.evaluate(StatementAdapter.java:36)
	at org.apache.lucene.util.TestRuleAssertionsRequired$1.evaluate(TestRuleAssertionsRequired.java:43)
	at org.apache.lucene.util.TestRuleMarkFailure$1.evaluate(TestRuleMarkFailure.java:48)
	at org.apache.lucene.util.TestRuleIgnoreAfterMaxFailures$1.evaluate(TestRuleIgnoreAfterMaxFailures.java:65)
	at org.apache.lucene.util.TestRuleIgnoreTestSuites$1.evaluate(TestRuleIgnoreTestSuites.java:55)
	at com.carrotsearch.randomizedtesting.rules.StatementAdapter.evaluate(StatementAdapter.java:36)
	at com.carrotsearch.randomizedtesting.ThreadLeakControl$StatementRunner.run(ThreadLeakControl.java:360)
	at java.lang.Thread.run(Thread.java:745)


REGRESSION:  org.apache.lucene.index.TestTieredMergePolicy.testForceMergeDeletes

Error Message:
background merge hit exception: _0(4.9):c4/1:delGen=1 _1(4.9):c4/1:delGen=1 _2(4.9):c4/1:delGen=1
_3(4.9):c4/1:delGen=1 _4(4.9):c4/1:delGen=1 _5(4.9):c4/1:delGen=1 _6(4.9):c4/1:delGen=1 _7(4.9):c4/1:delGen=1
_8(4.9):c4/1:delGen=1 _9(4.9):c4/1:delGen=1 _a(4.9):c4/1:delGen=1 _b(4.9):c4/1:delGen=1 _c(4.9):c4/1:delGen=1
_d(4.9):c4/1:delGen=1 _e(4.9):c4/1:delGen=1 _f(4.9):c4/1:delGen=1 _g(4.9):c4/1:delGen=1 _h(4.9):c4/1:delGen=1
_i(4.9):c4/1:delGen=1 _j(4.9):c4/1:delGen=1 into _k

Stack Trace:
java.io.IOException: background merge hit exception: _0(4.9):c4/1:delGen=1 _1(4.9):c4/1:delGen=1
_2(4.9):c4/1:delGen=1 _3(4.9):c4/1:delGen=1 _4(4.9):c4/1:delGen=1 _5(4.9):c4/1:delGen=1 _6(4.9):c4/1:delGen=1
_7(4.9):c4/1:delGen=1 _8(4.9):c4/1:delGen=1 _9(4.9):c4/1:delGen=1 _a(4.9):c4/1:delGen=1 _b(4.9):c4/1:delGen=1
_c(4.9):c4/1:delGen=1 _d(4.9):c4/1:delGen=1 _e(4.9):c4/1:delGen=1 _f(4.9):c4/1:delGen=1 _g(4.9):c4/1:delGen=1
_h(4.9):c4/1:delGen=1 _i(4.9):c4/1:delGen=1 _j(4.9):c4/1:delGen=1 into _k
	at __randomizedtesting.SeedInfo.seed([9D5B5E4655F102B:3BA5E5425AD59004]:0)
	at org.apache.lucene.index.IndexWriter.forceMergeDeletes(IndexWriter.java:1915)
	at org.apache.lucene.index.IndexWriter.forceMergeDeletes(IndexWriter.java:1955)
	at org.apache.lucene.index.TestTieredMergePolicy.testForceMergeDeletes(TestTieredMergePolicy.java:64)
	at sun.reflect.NativeMethodAccessorImpl.invoke0(Native Method)
	at sun.reflect.NativeMethodAccessorImpl.invoke(NativeMethodAccessorImpl.java:57)
	at sun.reflect.DelegatingMethodAccessorImpl.invoke(DelegatingMethodAccessorImpl.java:43)
	at java.lang.reflect.Method.invoke(Method.java:606)
	at com.carrotsearch.randomizedtesting.RandomizedRunner.invoke(RandomizedRunner.java:1618)
	at com.carrotsearch.randomizedtesting.RandomizedRunner$6.evaluate(RandomizedRunner.java:827)
	at com.carrotsearch.randomizedtesting.RandomizedRunner$7.evaluate(RandomizedRunner.java:863)
	at com.carrotsearch.randomizedtesting.RandomizedRunner$8.evaluate(RandomizedRunner.java:877)
	at org.apache.lucene.util.TestRuleSetupTeardownChained$1.evaluate(TestRuleSetupTeardownChained.java:50)
	at org.apache.lucene.util.TestRuleFieldCacheSanity$1.evaluate(TestRuleFieldCacheSanity.java:51)
	at org.apache.lucene.util.AbstractBeforeAfterRule$1.evaluate(AbstractBeforeAfterRule.java:46)
	at com.carrotsearch.randomizedtesting.rules.SystemPropertiesInvariantRule$1.evaluate(SystemPropertiesInvariantRule.java:55)
	at org.apache.lucene.util.TestRuleThreadAndTestName$1.evaluate(TestRuleThreadAndTestName.java:49)
	at org.apache.lucene.util.TestRuleIgnoreAfterMaxFailures$1.evaluate(TestRuleIgnoreAfterMaxFailures.java:65)
	at org.apache.lucene.util.TestRuleMarkFailure$1.evaluate(TestRuleMarkFailure.java:48)
	at com.carrotsearch.randomizedtesting.rules.StatementAdapter.evaluate(StatementAdapter.java:36)
	at com.carrotsearch.randomizedtesting.ThreadLeakControl$StatementRunner.run(ThreadLeakControl.java:360)
	at com.carrotsearch.randomizedtesting.ThreadLeakControl.forkTimeoutingTask(ThreadLeakControl.java:793)
	at com.carrotsearch.randomizedtesting.ThreadLeakControl$3.evaluate(ThreadLeakControl.java:453)
	at com.carrotsearch.randomizedtesting.RandomizedRunner.runSingleTest(RandomizedRunner.java:836)
	at com.carrotsearch.randomizedtesting.RandomizedRunner$3.evaluate(RandomizedRunner.java:738)
	at com.carrotsearch.randomizedtesting.RandomizedRunner$4.evaluate(RandomizedRunner.java:772)
	at com.carrotsearch.randomizedtesting.RandomizedRunner$5.evaluate(RandomizedRunner.java:783)
	at org.apache.lucene.util.AbstractBeforeAfterRule$1.evaluate(AbstractBeforeAfterRule.java:46)
	at org.apache.lucene.util.TestRuleStoreClassName$1.evaluate(TestRuleStoreClassName.java:42)
	at com.carrotsearch.randomizedtesting.rules.SystemPropertiesInvariantRule$1.evaluate(SystemPropertiesInvariantRule.java:55)
	at com.carrotsearch.randomizedtesting.rules.NoShadowingOrOverridesOnMethodsRule$1.evaluate(NoShadowingOrOverridesOnMethodsRule.java:39)
	at com.carrotsearch.randomizedtesting.rules.NoShadowingOrOverridesOnMethodsRule$1.evaluate(NoShadowingOrOverridesOnMethodsRule.java:39)
	at com.carrotsearch.randomizedtesting.rules.StatementAdapter.evaluate(StatementAdapter.java:36)
	at com.carrotsearch.randomizedtesting.rules.StatementAdapter.evaluate(StatementAdapter.java:36)
	at com.carrotsearch.randomizedtesting.rules.StatementAdapter.evaluate(StatementAdapter.java:36)
	at org.apache.lucene.util.TestRuleAssertionsRequired$1.evaluate(TestRuleAssertionsRequired.java:43)
	at org.apache.lucene.util.TestRuleMarkFailure$1.evaluate(TestRuleMarkFailure.java:48)
	at org.apache.lucene.util.TestRuleIgnoreAfterMaxFailures$1.evaluate(TestRuleIgnoreAfterMaxFailures.java:65)
	at org.apache.lucene.util.TestRuleIgnoreTestSuites$1.evaluate(TestRuleIgnoreTestSuites.java:55)
	at com.carrotsearch.randomizedtesting.rules.StatementAdapter.evaluate(StatementAdapter.java:36)
	at com.carrotsearch.randomizedtesting.ThreadLeakControl$StatementRunner.run(ThreadLeakControl.java:360)
	at java.lang.Thread.run(Thread.java:745)




Build Log:
[...truncated 464 lines...]
   [junit4] Suite: org.apache.lucene.index.TestIndexWriterReader
   [junit4]   2> NOTE: reproduce with: ant test  -Dtestcase=TestIndexWriterReader -Dtests.method=testForceMergeDeletes
-Dtests.seed=9D5B5E4655F102B -Dtests.slow=true -Dtests.locale=ar_LB -Dtests.timezone=America/Rosario
-Dtests.file.encoding=US-ASCII
   [junit4] ERROR   0.19s J3 | TestIndexWriterReader.testForceMergeDeletes <<<
   [junit4]    > Throwable #1: java.io.IOException: background merge hit exception: _0(4.9):c2/1:delGen=1
into _1
   [junit4]    > 	at __randomizedtesting.SeedInfo.seed([9D5B5E4655F102B:3BA5E5425AD59004]:0)
   [junit4]    > 	at org.apache.lucene.index.IndexWriter.forceMergeDeletes(IndexWriter.java:1915)
   [junit4]    > 	at org.apache.lucene.index.IndexWriter.forceMergeDeletes(IndexWriter.java:1955)
   [junit4]    > 	at org.apache.lucene.index.TestIndexWriterReader.testForceMergeDeletes(TestIndexWriterReader.java:896)
   [junit4]    > 	at java.lang.Thread.run(Thread.java:745)
   [junit4]   2> NOTE: test params are: codec=Lucene42, sim=RandomSimilarityProvider(queryNorm=false,coord=no):
{field5=IB SPL-LZ(0.3), f=DFR I(n)2, field4=DFR GB2, foo=DFR I(ne)B2, field=DFR I(ne)L1, field3=DFR
I(ne)BZ(0.3), indexname=DFR I(n)3(800.0), field1=DFR GL1, field2=DFR I(F)L2}, locale=ar_LB,
timezone=America/Rosario
   [junit4]   2> NOTE: Linux 3.2.0-26-generic amd64/Oracle Corporation 1.7.0_55 (64-bit)/cpus=8,threads=1,free=139657968,total=154664960
   [junit4]   2> NOTE: All tests run in this JVM: [TestFilteredSearch, TestFastCompressionMode,
TestParallelReaderEmptyIndex, TestSimilarity2, TestDocValuesWithThreads, TestPositiveScoresOnlyCollector,
TestIndexFileDeleter, TestForTooMuchCloning, TestPhraseQuery, TestGraphTokenizers, TestDocsAndPositions,
TestPayloadExplanations, TestNoMergePolicy, TestIndexInput, TestIndexWriterReader]
   [junit4] Completed on J3 in 39.98s, 23 tests, 1 error <<< FAILURES!

[...truncated 10 lines...]
   [junit4] Suite: org.apache.lucene.index.TestIndexWriterMerging
   [junit4]   2> NOTE: reproduce with: ant test  -Dtestcase=TestIndexWriterMerging -Dtests.method=testForceMergeDeletes
-Dtests.seed=9D5B5E4655F102B -Dtests.slow=true -Dtests.locale=ro_RO -Dtests.timezone=America/Shiprock
-Dtests.file.encoding=US-ASCII
   [junit4] ERROR   0.60s J7 | TestIndexWriterMerging.testForceMergeDeletes <<<
   [junit4]    > Throwable #1: java.io.IOException: background merge hit exception: _0(4.9):c2/1:delGen=1
   [junit4]    > 	at __randomizedtesting.SeedInfo.seed([9D5B5E4655F102B:3BA5E5425AD59004]:0)
   [junit4]    > 	at org.apache.lucene.index.IndexWriter.forceMergeDeletes(IndexWriter.java:1915)
   [junit4]    > 	at org.apache.lucene.index.IndexWriter.forceMergeDeletes(IndexWriter.java:1955)
   [junit4]    > 	at org.apache.lucene.index.TestIndexWriterMerging.testForceMergeDeletes(TestIndexWriterMerging.java:170)
   [junit4]    > 	at java.lang.Thread.run(Thread.java:745)
   [junit4]   2> NOTE: reproduce with: ant test  -Dtestcase=TestIndexWriterMerging -Dtests.method=testForceMergeDeletes2
-Dtests.seed=9D5B5E4655F102B -Dtests.slow=true -Dtests.locale=ro_RO -Dtests.timezone=America/Shiprock
-Dtests.file.encoding=US-ASCII
   [junit4] ERROR   2.10s J7 | TestIndexWriterMerging.testForceMergeDeletes2 <<<
   [junit4]    > Throwable #1: java.io.IOException: background merge hit exception: _0(4.9):C2/1:delGen=1
_1(4.9):C2/1:delGen=1 _2(4.9):C2/1:delGen=1 into _1d
   [junit4]    > 	at __randomizedtesting.SeedInfo.seed([9D5B5E4655F102B:AF50D2488B7D20E2]:0)
   [junit4]    > 	at org.apache.lucene.index.IndexWriter.forceMergeDeletes(IndexWriter.java:1915)
   [junit4]    > 	at org.apache.lucene.index.IndexWriter.forceMergeDeletes(IndexWriter.java:1955)
   [junit4]    > 	at org.apache.lucene.index.TestIndexWriterMerging.testForceMergeDeletes2(TestIndexWriterMerging.java:237)
   [junit4]    > 	at java.lang.Thread.run(Thread.java:745)
   [junit4]   2> May 16, 2014 5:07:19 PM com.carrotsearch.randomizedtesting.ThreadLeakControl
checkThreadLeaks
   [junit4]   2> WARNING: Will linger awaiting termination of 1 leaked thread(s).
   [junit4]   2> NOTE: test params are: codec=Lucene46: {termVector=MockFixedIntBlock(blockSize=560),
id=MockFixedIntBlock(blockSize=560), count=MockFixedIntBlock(blockSize=560), tvtest=PostingsFormat(name=FSTOrdPulsing41)},
docValues:{}, sim=DefaultSimilarity, locale=ro_RO, timezone=America/Shiprock
   [junit4]   2> NOTE: Linux 3.2.0-26-generic amd64/Oracle Corporation 1.7.0_55 (64-bit)/cpus=8,threads=1,free=86224640,total=207618048
   [junit4]   2> NOTE: All tests run in this JVM: [TestSimpleSearchEquivalence, TestBlockPostingsFormat3,
TestTermVectorsWriter, TestConstants, TestDocCount, TestTermVectors, TestIndexWriterMerging]
   [junit4] Completed on J7 in 31.70s, 6 tests, 2 errors <<< FAILURES!

[...truncated 663 lines...]
   [junit4] Suite: org.apache.lucene.index.TestTieredMergePolicy
   [junit4]   2> NOTE: reproduce with: ant test  -Dtestcase=TestTieredMergePolicy -Dtests.method=testForceMergeDeletesMaxSegSize
-Dtests.seed=9D5B5E4655F102B -Dtests.slow=true -Dtests.locale=el -Dtests.timezone=MET -Dtests.file.encoding=US-ASCII
   [junit4] ERROR   1.85s J1 | TestTieredMergePolicy.testForceMergeDeletesMaxSegSize <<<
   [junit4]    > Throwable #1: java.io.IOException: background merge hit exception: _3n(4.9):C219
into _3o [maxNumSegments=1]
   [junit4]    > 	at __randomizedtesting.SeedInfo.seed([9D5B5E4655F102B:6BD2DA143C56A595]:0)
   [junit4]    > 	at org.apache.lucene.index.IndexWriter.forceMergeDeletes(IndexWriter.java:1915)
   [junit4]    > 	at org.apache.lucene.index.IndexWriter.forceMergeDeletes(IndexWriter.java:1955)
   [junit4]    > 	at org.apache.lucene.index.TestTieredMergePolicy.testForceMergeDeletesMaxSegSize(TestTieredMergePolicy.java:148)
   [junit4]    > 	at java.lang.Thread.run(Thread.java:745)
   [junit4]   2> NOTE: reproduce with: ant test  -Dtestcase=TestTieredMergePolicy -Dtests.method=testForceMergeDeletes
-Dtests.seed=9D5B5E4655F102B -Dtests.slow=true -Dtests.locale=el -Dtests.timezone=MET -Dtests.file.encoding=US-ASCII
   [junit4] ERROR   0.25s J1 | TestTieredMergePolicy.testForceMergeDeletes <<<
   [junit4]    > Throwable #1: java.io.IOException: background merge hit exception: _0(4.9):c4/1:delGen=1
_1(4.9):c4/1:delGen=1 _2(4.9):c4/1:delGen=1 _3(4.9):c4/1:delGen=1 _4(4.9):c4/1:delGen=1 _5(4.9):c4/1:delGen=1
_6(4.9):c4/1:delGen=1 _7(4.9):c4/1:delGen=1 _8(4.9):c4/1:delGen=1 _9(4.9):c4/1:delGen=1 _a(4.9):c4/1:delGen=1
_b(4.9):c4/1:delGen=1 _c(4.9):c4/1:delGen=1 _d(4.9):c4/1:delGen=1 _e(4.9):c4/1:delGen=1 _f(4.9):c4/1:delGen=1
_g(4.9):c4/1:delGen=1 _h(4.9):c4/1:delGen=1 _i(4.9):c4/1:delGen=1 _j(4.9):c4/1:delGen=1 into
_k
   [junit4]    > 	at __randomizedtesting.SeedInfo.seed([9D5B5E4655F102B:3BA5E5425AD59004]:0)
   [junit4]    > 	at org.apache.lucene.index.IndexWriter.forceMergeDeletes(IndexWriter.java:1915)
   [junit4]    > 	at org.apache.lucene.index.IndexWriter.forceMergeDeletes(IndexWriter.java:1955)
   [junit4]    > 	at org.apache.lucene.index.TestTieredMergePolicy.testForceMergeDeletes(TestTieredMergePolicy.java:64)
   [junit4]    > 	at java.lang.Thread.run(Thread.java:745)
   [junit4]   2> NOTE: test params are: codec=Lucene42, sim=RandomSimilarityProvider(queryNorm=true,coord=crazy):
{content=IB LL-D2}, locale=el, timezone=MET
   [junit4]   2> NOTE: Linux 3.2.0-26-generic amd64/Oracle Corporation 1.7.0_55 (64-bit)/cpus=8,threads=1,free=155687944,total=247463936
   [junit4]   2> NOTE: All tests run in this JVM: [TestSortRescorer, TestCodecHoldsOpenFiles,
TestFieldCacheTermsFilter, TestCollectionUtil, TestIndexWriterOnDiskFull, TestByteArrayDataInput,
TestParallelCompositeReader, TestMultiFields, TestFieldMaskingSpanQuery, TestPerFieldDocValuesFormat,
TestLazyProxSkipping, TestNRTCachingDirectory, TestAllFilesHaveChecksumFooter, TestControlledRealTimeReopenThread,
TestRollback, TestSumDocFreq, TestPositionIncrement, TestIndexWriterCommit, TestMinimize,
InBeforeClass, InAfterClass, InTestMethod, NonStringProperties, TestStressIndexing2, TestDirectory,
TestIndexWriterMergePolicy, TestNumericRangeQuery32, TestCachingTokenFilter, TestLucene42DocValuesFormat,
TestBasics, TestOpenBitSet, TestSnapshotDeletionPolicy, TestTieredMergePolicy]
   [junit4] Completed on J1 in 32.80s, 6 tests, 2 errors <<< FAILURES!

[...truncated 448 lines...]
BUILD FAILED
/var/lib/jenkins/workspace/Lucene-4x-Linux-Java7-64-test-only/checkout/lucene/build.xml:49:
The following error occurred while executing this line:
/var/lib/jenkins/workspace/Lucene-4x-Linux-Java7-64-test-only/checkout/lucene/common-build.xml:1297:
The following error occurred while executing this line:
/var/lib/jenkins/workspace/Lucene-4x-Linux-Java7-64-test-only/checkout/lucene/common-build.xml:921:
There were test failures: 404 suites, 3143 tests, 5 errors, 123 ignored (113 assumptions)

Total time: 6 minutes 10 seconds
Build step 'Invoke Ant' marked build as failure
Recording test results
Email was triggered for: Failure
Sending email for trigger: Failure



Mime
View raw message