lucene-dev mailing list archives

Site index · List index
Message view « Date » · « Thread »
Top « Date » · « Thread »
From Apache Jenkins Server <jenk...@builds.apache.org>
Subject [JENKINS-MAVEN] Lucene-Solr-Maven-trunk #1146: POMs out of sync
Date Wed, 21 May 2014 16:31:24 GMT
Build: https://builds.apache.org/job/Lucene-Solr-Maven-trunk/1146/

1 tests failed.
FAILED:  org.apache.solr.cloud.HttpPartitionTest.testDistribSearch

Error Message:
No registered leader was found after waiting for 60000ms , collection: c8n_1x3_lf slice: shard1

Stack Trace:
org.apache.solr.common.SolrException: No registered leader was found after waiting for 60000ms
, collection: c8n_1x3_lf slice: shard1
	at __randomizedtesting.SeedInfo.seed([7A06522654ACE583:FBE0DC3E23F385BF]:0)
	at org.apache.solr.common.cloud.ZkStateReader.getLeaderRetry(ZkStateReader.java:567)
	at org.apache.solr.cloud.HttpPartitionTest.testRf3WithLeaderFailover(HttpPartitionTest.java:348)
	at org.apache.solr.cloud.HttpPartitionTest.doTest(HttpPartitionTest.java:148)




Build Log:
[...truncated 54769 lines...]
BUILD FAILED
/usr/home/hudson/hudson-slave/workspace/Lucene-Solr-Maven-trunk/build.xml:490: The following
error occurred while executing this line:
/usr/home/hudson/hudson-slave/workspace/Lucene-Solr-Maven-trunk/build.xml:182: The following
error occurred while executing this line:
/usr/home/hudson/hudson-slave/workspace/Lucene-Solr-Maven-trunk/extra-targets.xml:77: Java
returned: 1

Total time: 191 minutes 17 seconds
Build step 'Invoke Ant' marked build as failure
Recording test results
Email was triggered for: Failure
Sending email for trigger: Failure



Mime
View raw message