lucene-dev mailing list archives

Site index · List index
Message view « Date » · « Thread »
Top « Date » · « Thread »
From buil...@flonkings.com
Subject [JENKINS] Lucene-trunk-Linux-Java7-64-test-only - Build # 83995 - Failure!
Date Thu, 01 May 2014 16:13:20 GMT
Build: builds.flonkings.com/job/Lucene-trunk-Linux-Java7-64-test-only/83995/

1 tests failed.
REGRESSION:  org.apache.lucene.index.TestDocumentWriter.testMixedTermVectorSettingsSameField

Error Message:
MockDirectoryWrapper: cannot close: there are still open files: {_0.fdt=1, _0.fdx=1}

Stack Trace:
java.lang.RuntimeException: MockDirectoryWrapper: cannot close: there are still open files:
{_0.fdt=1, _0.fdx=1}
	at org.apache.lucene.store.MockDirectoryWrapper.close(MockDirectoryWrapper.java:663)
	at org.apache.lucene.index.TestDocumentWriter.tearDown(TestDocumentWriter.java:50)
	at sun.reflect.GeneratedMethodAccessor3.invoke(Unknown Source)
	at sun.reflect.DelegatingMethodAccessorImpl.invoke(DelegatingMethodAccessorImpl.java:43)
	at java.lang.reflect.Method.invoke(Method.java:606)
	at com.carrotsearch.randomizedtesting.RandomizedRunner.invoke(RandomizedRunner.java:1618)
	at com.carrotsearch.randomizedtesting.RandomizedRunner$8.evaluate(RandomizedRunner.java:885)
	at org.apache.lucene.util.TestRuleSetupTeardownChained$1.evaluate(TestRuleSetupTeardownChained.java:50)
	at org.apache.lucene.util.TestRuleFieldCacheSanity$1.evaluate(TestRuleFieldCacheSanity.java:51)
	at org.apache.lucene.util.AbstractBeforeAfterRule$1.evaluate(AbstractBeforeAfterRule.java:46)
	at com.carrotsearch.randomizedtesting.rules.SystemPropertiesInvariantRule$1.evaluate(SystemPropertiesInvariantRule.java:55)
	at org.apache.lucene.util.TestRuleThreadAndTestName$1.evaluate(TestRuleThreadAndTestName.java:49)
	at org.apache.lucene.util.TestRuleIgnoreAfterMaxFailures$1.evaluate(TestRuleIgnoreAfterMaxFailures.java:65)
	at org.apache.lucene.util.TestRuleMarkFailure$1.evaluate(TestRuleMarkFailure.java:48)
	at com.carrotsearch.randomizedtesting.rules.StatementAdapter.evaluate(StatementAdapter.java:36)
	at com.carrotsearch.randomizedtesting.ThreadLeakControl$StatementRunner.run(ThreadLeakControl.java:360)
	at com.carrotsearch.randomizedtesting.ThreadLeakControl.forkTimeoutingTask(ThreadLeakControl.java:793)
	at com.carrotsearch.randomizedtesting.ThreadLeakControl$3.evaluate(ThreadLeakControl.java:453)
	at com.carrotsearch.randomizedtesting.RandomizedRunner.runSingleTest(RandomizedRunner.java:836)
	at com.carrotsearch.randomizedtesting.RandomizedRunner$3.evaluate(RandomizedRunner.java:738)
	at com.carrotsearch.randomizedtesting.RandomizedRunner$4.evaluate(RandomizedRunner.java:772)
	at com.carrotsearch.randomizedtesting.RandomizedRunner$5.evaluate(RandomizedRunner.java:783)
	at org.apache.lucene.util.AbstractBeforeAfterRule$1.evaluate(AbstractBeforeAfterRule.java:46)
	at org.apache.lucene.util.TestRuleStoreClassName$1.evaluate(TestRuleStoreClassName.java:42)
	at com.carrotsearch.randomizedtesting.rules.SystemPropertiesInvariantRule$1.evaluate(SystemPropertiesInvariantRule.java:55)
	at com.carrotsearch.randomizedtesting.rules.NoShadowingOrOverridesOnMethodsRule$1.evaluate(NoShadowingOrOverridesOnMethodsRule.java:39)
	at com.carrotsearch.randomizedtesting.rules.NoShadowingOrOverridesOnMethodsRule$1.evaluate(NoShadowingOrOverridesOnMethodsRule.java:39)
	at com.carrotsearch.randomizedtesting.rules.StatementAdapter.evaluate(StatementAdapter.java:36)
	at com.carrotsearch.randomizedtesting.rules.StatementAdapter.evaluate(StatementAdapter.java:36)
	at com.carrotsearch.randomizedtesting.rules.StatementAdapter.evaluate(StatementAdapter.java:36)
	at org.apache.lucene.util.TestRuleAssertionsRequired$1.evaluate(TestRuleAssertionsRequired.java:43)
	at org.apache.lucene.util.TestRuleMarkFailure$1.evaluate(TestRuleMarkFailure.java:48)
	at org.apache.lucene.util.TestRuleIgnoreAfterMaxFailures$1.evaluate(TestRuleIgnoreAfterMaxFailures.java:65)
	at org.apache.lucene.util.TestRuleIgnoreTestSuites$1.evaluate(TestRuleIgnoreTestSuites.java:55)
	at com.carrotsearch.randomizedtesting.rules.StatementAdapter.evaluate(StatementAdapter.java:36)
	at com.carrotsearch.randomizedtesting.ThreadLeakControl$StatementRunner.run(ThreadLeakControl.java:360)
	at java.lang.Thread.run(Thread.java:724)
Caused by: java.lang.RuntimeException: unclosed IndexOutput: _0.fdx
	at org.apache.lucene.store.MockDirectoryWrapper.addFileHandle(MockDirectoryWrapper.java:550)
	at org.apache.lucene.store.MockDirectoryWrapper.createOutput(MockDirectoryWrapper.java:522)
	at org.apache.lucene.store.TrackingDirectoryWrapper.createOutput(TrackingDirectoryWrapper.java:44)
	at org.apache.lucene.codecs.compressing.CompressingStoredFieldsWriter.<init>(CompressingStoredFieldsWriter.java:110)
	at org.apache.lucene.codecs.compressing.CompressingStoredFieldsFormat.fieldsWriter(CompressingStoredFieldsFormat.java:120)
	at org.apache.lucene.index.DefaultIndexingChain.<init>(DefaultIndexingChain.java:79)
	at org.apache.lucene.index.DocumentsWriterPerThread$1.getChain(DocumentsWriterPerThread.java:62)
	at org.apache.lucene.index.DocumentsWriterPerThread.<init>(DocumentsWriterPerThread.java:186)
	at org.apache.lucene.index.DocumentsWriter.ensureInitialized(DocumentsWriter.java:399)
	at org.apache.lucene.index.DocumentsWriter.updateDocument(DocumentsWriter.java:457)
	at org.apache.lucene.index.IndexWriter.updateDocument(IndexWriter.java:1434)
	at org.apache.lucene.index.IndexWriter.addDocument(IndexWriter.java:1104)
	at org.apache.lucene.index.IndexWriter.addDocument(IndexWriter.java:1085)
	at org.apache.lucene.index.TestDocumentWriter.testMixedTermVectorSettingsSameField(TestDocumentWriter.java:283)
	at sun.reflect.NativeMethodAccessorImpl.invoke0(Native Method)
	at sun.reflect.NativeMethodAccessorImpl.invoke(NativeMethodAccessorImpl.java:57)
	at sun.reflect.DelegatingMethodAccessorImpl.invoke(DelegatingMethodAccessorImpl.java:43)
	at java.lang.reflect.Method.invoke(Method.java:606)
	at com.carrotsearch.randomizedtesting.RandomizedRunner.invoke(RandomizedRunner.java:1618)
	at com.carrotsearch.randomizedtesting.RandomizedRunner$6.evaluate(RandomizedRunner.java:827)
	at com.carrotsearch.randomizedtesting.RandomizedRunner$7.evaluate(RandomizedRunner.java:863)
	at com.carrotsearch.randomizedtesting.RandomizedRunner$8.evaluate(RandomizedRunner.java:877)
	... 30 more




Build Log:
[...truncated 323 lines...]
   [junit4] Suite: org.apache.lucene.index.TestDocumentWriter
   [junit4]   2> NOTE: reproduce with: ant test  -Dtestcase=TestDocumentWriter -Dtests.method=testMixedTermVectorSettingsSameField
-Dtests.seed=E223CBC849DB03B5 -Dtests.slow=true -Dtests.locale=sr__#Latn -Dtests.timezone=Universal
-Dtests.file.encoding=ISO-8859-1
   [junit4] ERROR   0.33s J4 | TestDocumentWriter.testMixedTermVectorSettingsSameField <<<
   [junit4]    > Throwable #1: org.junit.ComparisonFailure: expected:<...ngs (storeTermVector[]s
changed for field=...> but was:<...ngs (storeTermVector[Position]s changed for field=...>
   [junit4]    > 	at org.apache.lucene.index.TestDocumentWriter.testMixedTermVectorSettingsSameField(TestDocumentWriter.java:286)
   [junit4]    > 	at java.lang.Thread.run(Thread.java:724)Throwable #2: java.lang.RuntimeException:
MockDirectoryWrapper: cannot close: there are still open files: {_0.fdt=1, _0.fdx=1}
   [junit4]    > 	at org.apache.lucene.store.MockDirectoryWrapper.close(MockDirectoryWrapper.java:663)
   [junit4]    > 	at org.apache.lucene.index.TestDocumentWriter.tearDown(TestDocumentWriter.java:50)
   [junit4]    > 	at java.lang.Thread.run(Thread.java:724)
   [junit4]    > Caused by: java.lang.RuntimeException: unclosed IndexOutput: _0.fdx
   [junit4]    > 	at org.apache.lucene.store.MockDirectoryWrapper.addFileHandle(MockDirectoryWrapper.java:550)
   [junit4]    > 	at org.apache.lucene.store.MockDirectoryWrapper.createOutput(MockDirectoryWrapper.java:522)
   [junit4]    > 	at org.apache.lucene.store.TrackingDirectoryWrapper.createOutput(TrackingDirectoryWrapper.java:44)
   [junit4]    > 	at org.apache.lucene.codecs.compressing.CompressingStoredFieldsWriter.<init>(CompressingStoredFieldsWriter.java:110)
   [junit4]    > 	at org.apache.lucene.codecs.compressing.CompressingStoredFieldsFormat.fieldsWriter(CompressingStoredFieldsFormat.java:120)
   [junit4]    > 	at org.apache.lucene.index.DefaultIndexingChain.<init>(DefaultIndexingChain.java:79)
   [junit4]    > 	at org.apache.lucene.index.DocumentsWriterPerThread$1.getChain(DocumentsWriterPerThread.java:62)
   [junit4]    > 	at org.apache.lucene.index.DocumentsWriterPerThread.<init>(DocumentsWriterPerThread.java:186)
   [junit4]    > 	at org.apache.lucene.index.DocumentsWriter.ensureInitialized(DocumentsWriter.java:399)
   [junit4]    > 	at org.apache.lucene.index.DocumentsWriter.updateDocument(DocumentsWriter.java:457)
   [junit4]    > 	at org.apache.lucene.index.IndexWriter.updateDocument(IndexWriter.java:1434)
   [junit4]    > 	at org.apache.lucene.index.IndexWriter.addDocument(IndexWriter.java:1104)
   [junit4]    > 	at org.apache.lucene.index.IndexWriter.addDocument(IndexWriter.java:1085)
   [junit4]    > 	at org.apache.lucene.index.TestDocumentWriter.testMixedTermVectorSettingsSameField(TestDocumentWriter.java:283)
   [junit4]    > 	... 30 more
   [junit4]   2> NOTE: leaving temporary files on disk at: /var/lib/jenkins/workspace/Lucene-trunk-Linux-Java7-64-test-only/checkout/lucene/build/core/test/J4/./lucene.index.TestDocumentWriter-E223CBC849DB03B5-001
   [junit4]   2> NOTE: test params are: codec=Lucene41, sim=RandomSimilarityProvider(queryNorm=true,coord=no):
{repeated=DFR I(F)BZ(0.3), lazyField=DFR I(n)3(800.0), textField2=DFR I(ne)2, omitTermFreqAndPositions=IB
SPL-LZ(0.3), textField1=DFR I(ne)Z(0.3), textField2Utf8=DFR GBZ(0.3), largeLazyField=DFR I(ne)L1,
preanalyzed=DefaultSimilarity, textField1Utf8=IB SPL-D1, f1=DFR I(n)L3(800.0), f2=IB LL-D1,
unStoredField2=DFR I(n)B2, unStoredField1=DFR I(n)L3(800.0)}, locale=sr__#Latn, timezone=Universal
   [junit4]   2> NOTE: Linux 3.2.0-26-generic amd64/Oracle Corporation 1.7.0_25 (64-bit)/cpus=8,threads=1,free=157365600,total=185139200
   [junit4]   2> NOTE: All tests run in this JVM: [TestMixedCodecs, TestAssertions, TestDocTermOrdsRewriteMethod,
TestPrefixInBooleanQuery, TestNoDeletionPolicy, TestToken, TestTopScoreDocCollector, ThrowInUncaught,
TestDocumentWriter]
   [junit4] Completed on J4 in 5.07s, 7 tests, 1 error <<< FAILURES!

[...truncated 1167 lines...]
BUILD FAILED
/var/lib/jenkins/workspace/Lucene-trunk-Linux-Java7-64-test-only/checkout/lucene/build.xml:49:
The following error occurred while executing this line:
/var/lib/jenkins/workspace/Lucene-trunk-Linux-Java7-64-test-only/checkout/lucene/common-build.xml:1296:
The following error occurred while executing this line:
/var/lib/jenkins/workspace/Lucene-trunk-Linux-Java7-64-test-only/checkout/lucene/common-build.xml:920:
There were test failures: 393 suites, 3060 tests, 1 error, 97 ignored (87 assumptions)

Total time: 5 minutes 45 seconds
Build step 'Invoke Ant' marked build as failure
Archiving artifacts
Recording test results
Email was triggered for: Failure
Sending email for trigger: Failure



Mime
View raw message