lucene-dev mailing list archives

Site index · List index
Message view « Date » · « Thread »
Top « Date » · « Thread »
From Policeman Jenkins Server <jenk...@thetaphi.de>
Subject [JENKINS] Lucene-Solr-trunk-Linux (64bit/jdk1.8.0_05) - Build # 10361 - Failure!
Date Fri, 23 May 2014 13:27:28 GMT
Build: http://jenkins.thetaphi.de/job/Lucene-Solr-trunk-Linux/10361/
Java: 64bit/jdk1.8.0_05 -XX:-UseCompressedOops -XX:+UseConcMarkSweepGC

4 tests failed.
FAILED:  junit.framework.TestSuite.org.apache.solr.cloud.CollectionsAPIDistributedZkTest

Error Message:
ERROR: SolrZkClient opens=21 closes=20

Stack Trace:
java.lang.AssertionError: ERROR: SolrZkClient opens=21 closes=20
	at __randomizedtesting.SeedInfo.seed([836554BD8ACF5AE7]:0)
	at org.junit.Assert.fail(Assert.java:93)
	at org.apache.solr.SolrTestCaseJ4.endTrackingZkClients(SolrTestCaseJ4.java:451)
	at org.apache.solr.SolrTestCaseJ4.afterClass(SolrTestCaseJ4.java:185)
	at sun.reflect.GeneratedMethodAccessor30.invoke(Unknown Source)
	at sun.reflect.DelegatingMethodAccessorImpl.invoke(DelegatingMethodAccessorImpl.java:43)
	at java.lang.reflect.Method.invoke(Method.java:483)
	at com.carrotsearch.randomizedtesting.RandomizedRunner.invoke(RandomizedRunner.java:1618)
	at com.carrotsearch.randomizedtesting.RandomizedRunner$5.evaluate(RandomizedRunner.java:790)
	at com.carrotsearch.randomizedtesting.rules.StatementAdapter.evaluate(StatementAdapter.java:36)
	at com.carrotsearch.randomizedtesting.rules.SystemPropertiesRestoreRule$1.evaluate(SystemPropertiesRestoreRule.java:53)
	at org.apache.lucene.util.AbstractBeforeAfterRule$1.evaluate(AbstractBeforeAfterRule.java:46)
	at org.apache.lucene.util.TestRuleStoreClassName$1.evaluate(TestRuleStoreClassName.java:42)
	at com.carrotsearch.randomizedtesting.rules.SystemPropertiesInvariantRule$1.evaluate(SystemPropertiesInvariantRule.java:55)
	at com.carrotsearch.randomizedtesting.rules.NoShadowingOrOverridesOnMethodsRule$1.evaluate(NoShadowingOrOverridesOnMethodsRule.java:39)
	at com.carrotsearch.randomizedtesting.rules.NoShadowingOrOverridesOnMethodsRule$1.evaluate(NoShadowingOrOverridesOnMethodsRule.java:39)
	at com.carrotsearch.randomizedtesting.rules.StatementAdapter.evaluate(StatementAdapter.java:36)
	at com.carrotsearch.randomizedtesting.rules.StatementAdapter.evaluate(StatementAdapter.java:36)
	at com.carrotsearch.randomizedtesting.rules.StatementAdapter.evaluate(StatementAdapter.java:36)
	at org.apache.lucene.util.TestRuleAssertionsRequired$1.evaluate(TestRuleAssertionsRequired.java:43)
	at org.apache.lucene.util.TestRuleMarkFailure$1.evaluate(TestRuleMarkFailure.java:48)
	at org.apache.lucene.util.TestRuleIgnoreAfterMaxFailures$1.evaluate(TestRuleIgnoreAfterMaxFailures.java:65)
	at org.apache.lucene.util.TestRuleIgnoreTestSuites$1.evaluate(TestRuleIgnoreTestSuites.java:55)
	at com.carrotsearch.randomizedtesting.rules.StatementAdapter.evaluate(StatementAdapter.java:36)
	at com.carrotsearch.randomizedtesting.ThreadLeakControl$StatementRunner.run(ThreadLeakControl.java:360)
	at java.lang.Thread.run(Thread.java:745)


FAILED:  junit.framework.TestSuite.org.apache.solr.cloud.CollectionsAPIDistributedZkTest

Error Message:
2 threads leaked from SUITE scope at org.apache.solr.cloud.CollectionsAPIDistributedZkTest:     1) Thread[id=2532, name=TEST-CollectionsAPIDistributedZkTest.testDistribSearch-seed#[836554BD8ACF5AE7]-SendThread(127.0.0.1:35788), state=TIMED_WAITING, group=TGRP-CollectionsAPIDistributedZkTest]         at java.lang.Thread.sleep(Native Method)         at org.apache.zookeeper.client.StaticHostProvider.next(StaticHostProvider.java:101)         at org.apache.zookeeper.ClientCnxn$SendThread.startConnect(ClientCnxn.java:940)         at org.apache.zookeeper.ClientCnxn$SendThread.run(ClientCnxn.java:1003)    2) Thread[id=2533, name=TEST-CollectionsAPIDistributedZkTest.testDistribSearch-seed#[836554BD8ACF5AE7]-EventThread, state=WAITING, group=TGRP-CollectionsAPIDistributedZkTest]         at sun.misc.Unsafe.park(Native Method)         at java.util.concurrent.locks.LockSupport.park(LockSupport.java:175)         at java.util.concurrent.locks.AbstractQueuedSynchronizer$ConditionObject.await(AbstractQueuedSynchronizer.java:2039)         at java.util.concurrent.LinkedBlockingQueue.take(LinkedBlockingQueue.java:442)         at org.apache.zookeeper.ClientCnxn$EventThread.run(ClientCnxn.java:494)

Stack Trace:
com.carrotsearch.randomizedtesting.ThreadLeakError: 2 threads leaked from SUITE scope at org.apache.solr.cloud.CollectionsAPIDistributedZkTest: 
   1) Thread[id=2532, name=TEST-CollectionsAPIDistributedZkTest.testDistribSearch-seed#[836554BD8ACF5AE7]-SendThread(127.0.0.1:35788), state=TIMED_WAITING, group=TGRP-CollectionsAPIDistributedZkTest]
        at java.lang.Thread.sleep(Native Method)
        at org.apache.zookeeper.client.StaticHostProvider.next(StaticHostProvider.java:101)
        at org.apache.zookeeper.ClientCnxn$SendThread.startConnect(ClientCnxn.java:940)
        at org.apache.zookeeper.ClientCnxn$SendThread.run(ClientCnxn.java:1003)
   2) Thread[id=2533, name=TEST-CollectionsAPIDistributedZkTest.testDistribSearch-seed#[836554BD8ACF5AE7]-EventThread, state=WAITING, group=TGRP-CollectionsAPIDistributedZkTest]
        at sun.misc.Unsafe.park(Native Method)
        at java.util.concurrent.locks.LockSupport.park(LockSupport.java:175)
        at java.util.concurrent.locks.AbstractQueuedSynchronizer$ConditionObject.await(AbstractQueuedSynchronizer.java:2039)
        at java.util.concurrent.LinkedBlockingQueue.take(LinkedBlockingQueue.java:442)
        at org.apache.zookeeper.ClientCnxn$EventThread.run(ClientCnxn.java:494)
	at __randomizedtesting.SeedInfo.seed([836554BD8ACF5AE7]:0)


FAILED:  junit.framework.TestSuite.org.apache.solr.cloud.CollectionsAPIDistributedZkTest

Error Message:
There are still zombie threads that couldn't be terminated:    1) Thread[id=2532, name=TEST-CollectionsAPIDistributedZkTest.testDistribSearch-seed#[836554BD8ACF5AE7]-SendThread(127.0.0.1:35788), state=TIMED_WAITING, group=TGRP-CollectionsAPIDistributedZkTest]         at java.lang.Thread.sleep(Native Method)         at org.apache.zookeeper.client.StaticHostProvider.next(StaticHostProvider.java:101)         at org.apache.zookeeper.ClientCnxn$SendThread.startConnect(ClientCnxn.java:940)         at org.apache.zookeeper.ClientCnxn$SendThread.run(ClientCnxn.java:1003)

Stack Trace:
com.carrotsearch.randomizedtesting.ThreadLeakError: There are still zombie threads that couldn't be terminated:
   1) Thread[id=2532, name=TEST-CollectionsAPIDistributedZkTest.testDistribSearch-seed#[836554BD8ACF5AE7]-SendThread(127.0.0.1:35788), state=TIMED_WAITING, group=TGRP-CollectionsAPIDistributedZkTest]
        at java.lang.Thread.sleep(Native Method)
        at org.apache.zookeeper.client.StaticHostProvider.next(StaticHostProvider.java:101)
        at org.apache.zookeeper.ClientCnxn$SendThread.startConnect(ClientCnxn.java:940)
        at org.apache.zookeeper.ClientCnxn$SendThread.run(ClientCnxn.java:1003)
	at __randomizedtesting.SeedInfo.seed([836554BD8ACF5AE7]:0)


REGRESSION:  org.apache.solr.cloud.CollectionsAPIDistributedZkTest.testDistribSearch

Error Message:
some core start times did not change on reload

Stack Trace:
java.lang.AssertionError: some core start times did not change on reload
	at __randomizedtesting.SeedInfo.seed([836554BD8ACF5AE7:283DAA5FD903ADB]:0)
	at org.junit.Assert.fail(Assert.java:93)
	at org.junit.Assert.assertTrue(Assert.java:43)
	at org.apache.solr.cloud.CollectionsAPIDistributedZkTest.testCollectionsAPI(CollectionsAPIDistributedZkTest.java:836)
	at org.apache.solr.cloud.CollectionsAPIDistributedZkTest.doTest(CollectionsAPIDistributedZkTest.java:203)
	at org.apache.solr.BaseDistributedSearchTestCase.testDistribSearch(BaseDistributedSearchTestCase.java:863)
	at sun.reflect.NativeMethodAccessorImpl.invoke0(Native Method)
	at sun.reflect.NativeMethodAccessorImpl.invoke(NativeMethodAccessorImpl.java:62)
	at sun.reflect.DelegatingMethodAccessorImpl.invoke(DelegatingMethodAccessorImpl.java:43)
	at java.lang.reflect.Method.invoke(Method.java:483)
	at com.carrotsearch.randomizedtesting.RandomizedRunner.invoke(RandomizedRunner.java:1618)
	at com.carrotsearch.randomizedtesting.RandomizedRunner$6.evaluate(RandomizedRunner.java:827)
	at com.carrotsearch.randomizedtesting.RandomizedRunner$7.evaluate(RandomizedRunner.java:863)
	at com.carrotsearch.randomizedtesting.RandomizedRunner$8.evaluate(RandomizedRunner.java:877)
	at com.carrotsearch.randomizedtesting.rules.SystemPropertiesRestoreRule$1.evaluate(SystemPropertiesRestoreRule.java:53)
	at org.apache.lucene.util.TestRuleSetupTeardownChained$1.evaluate(TestRuleSetupTeardownChained.java:50)
	at org.apache.lucene.util.AbstractBeforeAfterRule$1.evaluate(AbstractBeforeAfterRule.java:46)
	at com.carrotsearch.randomizedtesting.rules.SystemPropertiesInvariantRule$1.evaluate(SystemPropertiesInvariantRule.java:55)
	at org.apache.lucene.util.TestRuleThreadAndTestName$1.evaluate(TestRuleThreadAndTestName.java:49)
	at org.apache.lucene.util.TestRuleIgnoreAfterMaxFailures$1.evaluate(TestRuleIgnoreAfterMaxFailures.java:65)
	at org.apache.lucene.util.TestRuleMarkFailure$1.evaluate(TestRuleMarkFailure.java:48)
	at com.carrotsearch.randomizedtesting.rules.StatementAdapter.evaluate(StatementAdapter.java:36)
	at com.carrotsearch.randomizedtesting.ThreadLeakControl$StatementRunner.run(ThreadLeakControl.java:360)
	at com.carrotsearch.randomizedtesting.ThreadLeakControl.forkTimeoutingTask(ThreadLeakControl.java:793)
	at com.carrotsearch.randomizedtesting.ThreadLeakControl$3.evaluate(ThreadLeakControl.java:453)
	at com.carrotsearch.randomizedtesting.RandomizedRunner.runSingleTest(RandomizedRunner.java:836)
	at com.carrotsearch.randomizedtesting.RandomizedRunner$3.evaluate(RandomizedRunner.java:738)
	at com.carrotsearch.randomizedtesting.RandomizedRunner$4.evaluate(RandomizedRunner.java:772)
	at com.carrotsearch.randomizedtesting.RandomizedRunner$5.evaluate(RandomizedRunner.java:783)
	at com.carrotsearch.randomizedtesting.rules.StatementAdapter.evaluate(StatementAdapter.java:36)
	at com.carrotsearch.randomizedtesting.rules.SystemPropertiesRestoreRule$1.evaluate(SystemPropertiesRestoreRule.java:53)
	at org.apache.lucene.util.AbstractBeforeAfterRule$1.evaluate(AbstractBeforeAfterRule.java:46)
	at org.apache.lucene.util.TestRuleStoreClassName$1.evaluate(TestRuleStoreClassName.java:42)
	at com.carrotsearch.randomizedtesting.rules.SystemPropertiesInvariantRule$1.evaluate(SystemPropertiesInvariantRule.java:55)
	at com.carrotsearch.randomizedtesting.rules.NoShadowingOrOverridesOnMethodsRule$1.evaluate(NoShadowingOrOverridesOnMethodsRule.java:39)
	at com.carrotsearch.randomizedtesting.rules.NoShadowingOrOverridesOnMethodsRule$1.evaluate(NoShadowingOrOverridesOnMethodsRule.java:39)
	at com.carrotsearch.randomizedtesting.rules.StatementAdapter.evaluate(StatementAdapter.java:36)
	at com.carrotsearch.randomizedtesting.rules.StatementAdapter.evaluate(StatementAdapter.java:36)
	at com.carrotsearch.randomizedtesting.rules.StatementAdapter.evaluate(StatementAdapter.java:36)
	at org.apache.lucene.util.TestRuleAssertionsRequired$1.evaluate(TestRuleAssertionsRequired.java:43)
	at org.apache.lucene.util.TestRuleMarkFailure$1.evaluate(TestRuleMarkFailure.java:48)
	at org.apache.lucene.util.TestRuleIgnoreAfterMaxFailures$1.evaluate(TestRuleIgnoreAfterMaxFailures.java:65)
	at org.apache.lucene.util.TestRuleIgnoreTestSuites$1.evaluate(TestRuleIgnoreTestSuites.java:55)
	at com.carrotsearch.randomizedtesting.rules.StatementAdapter.evaluate(StatementAdapter.java:36)
	at com.carrotsearch.randomizedtesting.ThreadLeakControl$StatementRunner.run(ThreadLeakControl.java:360)
	at java.lang.Thread.run(Thread.java:745)




Build Log:
[...truncated 11269 lines...]
   [junit4] Suite: org.apache.solr.cloud.CollectionsAPIDistributedZkTest
   [junit4]   2> Creating dataDir: /mnt/ssd/jenkins/workspace/Lucene-Solr-trunk-Linux/solr/build/solr-core/test/J1/./temp/solr.cloud.CollectionsAPIDistributedZkTest-836554BD8ACF5AE7-001/init-core-data-001
   [junit4]   2> 627447 T2372 oas.SolrTestCaseJ4.buildSSLConfig Randomized ssl (true) and clientAuth (true)
   [junit4]   2> 627447 T2372 oas.BaseDistributedSearchTestCase.initHostContext Setting hostContext system property: /_nn/
   [junit4]   2> 627451 T2372 oas.SolrTestCaseJ4.setUp ###Starting testDistribSearch
   [junit4]   2> 627452 T2372 oasc.ZkTestServer.run STARTING ZK TEST SERVER
   [junit4]   1> client port:0.0.0.0/0.0.0.0:0
   [junit4]   2> 627452 T2373 oasc.ZkTestServer$ZKServerMain.runFromConfig Starting server
   [junit4]   2> 627552 T2372 oasc.ZkTestServer.run start zk server on port:35788
   [junit4]   2> 627553 T2372 oascc.ConnectionManager.waitForConnected Waiting for client to connect to ZooKeeper
   [junit4]   2> 627775 T2379 oascc.ConnectionManager.process Watcher org.apache.solr.common.cloud.ConnectionManager@355ecf57 name:ZooKeeperConnection Watcher:127.0.0.1:35788 got event WatchedEvent state:SyncConnected type:None path:null path:null type:None
   [junit4]   2> 627775 T2372 oascc.ConnectionManager.waitForConnected Client is connected to ZooKeeper
   [junit4]   2> 627776 T2372 oascc.SolrZkClient.makePath makePath: /solr
   [junit4]   2> 627782 T2372 oascc.ConnectionManager.waitForConnected Waiting for client to connect to ZooKeeper
   [junit4]   2> 627784 T2381 oascc.ConnectionManager.process Watcher org.apache.solr.common.cloud.ConnectionManager@5d73ee42 name:ZooKeeperConnection Watcher:127.0.0.1:35788/solr got event WatchedEvent state:SyncConnected type:None path:null path:null type:None
   [junit4]   2> 627784 T2372 oascc.ConnectionManager.waitForConnected Client is connected to ZooKeeper
   [junit4]   2> 627785 T2372 oascc.SolrZkClient.makePath makePath: /collections/collection1
   [junit4]   2> 627789 T2372 oascc.SolrZkClient.makePath makePath: /collections/collection1/shards
   [junit4]   2> 627791 T2372 oascc.SolrZkClient.makePath makePath: /collections/control_collection
   [junit4]   2> 627793 T2372 oascc.SolrZkClient.makePath makePath: /collections/control_collection/shards
   [junit4]   2> 627796 T2372 oasc.AbstractZkTestCase.putConfig put /mnt/ssd/jenkins/workspace/Lucene-Solr-trunk-Linux/solr/core/src/test-files/solr/collection1/conf/solrconfig-tlog.xml to /configs/conf1/solrconfig.xml
   [junit4]   2> 627796 T2372 oascc.SolrZkClient.makePath makePath: /configs/conf1/solrconfig.xml
   [junit4]   2> 627800 T2372 oasc.AbstractZkTestCase.putConfig put /mnt/ssd/jenkins/workspace/Lucene-Solr-trunk-Linux/solr/core/src/test-files/solr/collection1/conf/schema.xml to /configs/conf1/schema.xml
   [junit4]   2> 627801 T2372 oascc.SolrZkClient.makePath makePath: /configs/conf1/schema.xml
   [junit4]   2> 627806 T2372 oasc.AbstractZkTestCase.putConfig put /mnt/ssd/jenkins/workspace/Lucene-Solr-trunk-Linux/solr/core/src/test-files/solr/collection1/conf/solrconfig.snippet.randomindexconfig.xml to /configs/conf1/solrconfig.snippet.randomindexconfig.xml
   [junit4]   2> 627807 T2372 oascc.SolrZkClient.makePath makePath: /configs/conf1/solrconfig.snippet.randomindexconfig.xml
   [junit4]   2> 627810 T2372 oasc.AbstractZkTestCase.putConfig put /mnt/ssd/jenkins/workspace/Lucene-Solr-trunk-Linux/solr/core/src/test-files/solr/collection1/conf/stopwords.txt to /configs/conf1/stopwords.txt
   [junit4]   2> 627811 T2372 oascc.SolrZkClient.makePath makePath: /configs/conf1/stopwords.txt
   [junit4]   2> 627815 T2372 oasc.AbstractZkTestCase.putConfig put /mnt/ssd/jenkins/workspace/Lucene-Solr-trunk-Linux/solr/core/src/test-files/solr/collection1/conf/protwords.txt to /configs/conf1/protwords.txt
   [junit4]   2> 627816 T2372 oascc.SolrZkClient.makePath makePath: /configs/conf1/protwords.txt
   [junit4]   2> 627819 T2372 oasc.AbstractZkTestCase.putConfig put /mnt/ssd/jenkins/workspace/Lucene-Solr-trunk-Linux/solr/core/src/test-files/solr/collection1/conf/currency.xml to /configs/conf1/currency.xml
   [junit4]   2> 627819 T2372 oascc.SolrZkClient.makePath makePath: /configs/conf1/currency.xml
   [junit4]   2> 627822 T2372 oasc.AbstractZkTestCase.putConfig put /mnt/ssd/jenkins/workspace/Lucene-Solr-trunk-Linux/solr/core/src/test-files/solr/collection1/conf/enumsConfig.xml to /configs/conf1/enumsConfig.xml
   [junit4]   2> 627823 T2372 oascc.SolrZkClient.makePath makePath: /configs/conf1/enumsConfig.xml
   [junit4]   2> 627825 T2372 oasc.AbstractZkTestCase.putConfig put /mnt/ssd/jenkins/workspace/Lucene-Solr-trunk-Linux/solr/core/src/test-files/solr/collection1/conf/open-exchange-rates.json to /configs/conf1/open-exchange-rates.json
   [junit4]   2> 627826 T2372 oascc.SolrZkClient.makePath makePath: /configs/conf1/open-exchange-rates.json
   [junit4]   2> 627828 T2372 oasc.AbstractZkTestCase.putConfig put /mnt/ssd/jenkins/workspace/Lucene-Solr-trunk-Linux/solr/core/src/test-files/solr/collection1/conf/mapping-ISOLatin1Accent.txt to /configs/conf1/mapping-ISOLatin1Accent.txt
   [junit4]   2> 627829 T2372 oascc.SolrZkClient.makePath makePath: /configs/conf1/mapping-ISOLatin1Accent.txt
   [junit4]   2> 627832 T2372 oasc.AbstractZkTestCase.putConfig put /mnt/ssd/jenkins/workspace/Lucene-Solr-trunk-Linux/solr/core/src/test-files/solr/collection1/conf/old_synonyms.txt to /configs/conf1/old_synonyms.txt
   [junit4]   2> 627833 T2372 oascc.SolrZkClient.makePath makePath: /configs/conf1/old_synonyms.txt
   [junit4]   2> 627836 T2372 oasc.AbstractZkTestCase.putConfig put /mnt/ssd/jenkins/workspace/Lucene-Solr-trunk-Linux/solr/core/src/test-files/solr/collection1/conf/synonyms.txt to /configs/conf1/synonyms.txt
   [junit4]   2> 627836 T2372 oascc.SolrZkClient.makePath makePath: /configs/conf1/synonyms.txt
   [junit4]   2> 627841 T2372 oascc.ConnectionManager.waitForConnected Waiting for client to connect to ZooKeeper
   [junit4]   2> 627843 T2383 oascc.ConnectionManager.process Watcher org.apache.solr.common.cloud.ConnectionManager@6f36753 name:ZooKeeperConnection Watcher:127.0.0.1:35788/solr got event WatchedEvent state:SyncConnected type:None path:null path:null type:None
   [junit4]   2> 627843 T2372 oascc.ConnectionManager.waitForConnected Client is connected to ZooKeeper
   [junit4]   2> Using old style solr.xml
   [junit4]   2> 627846 T2372 oascc.ConnectionManager.waitForConnected Waiting for client to connect to ZooKeeper
   [junit4]   2> 627849 T2385 oascc.ConnectionManager.process Watcher org.apache.solr.common.cloud.ConnectionManager@60fa15ac name:ZooKeeperConnection Watcher:127.0.0.1:35788 got event WatchedEvent state:SyncConnected type:None path:null path:null type:None
   [junit4]   2> 627849 T2372 oascc.ConnectionManager.waitForConnected Client is connected to ZooKeeper
   [junit4]   2> 627849 T2372 oascc.SolrZkClient.makePath makePath: /solr
   [junit4]   2> 627853 T2372 oascc.ConnectionManager.waitForConnected Waiting for client to connect to ZooKeeper
   [junit4]   2> 627857 T2387 oascc.ConnectionManager.process Watcher org.apache.solr.common.cloud.ConnectionManager@231d4a93 name:ZooKeeperConnection Watcher:127.0.0.1:35788/solr got event WatchedEvent state:SyncConnected type:None path:null path:null type:None
   [junit4]   2> 627857 T2372 oascc.ConnectionManager.waitForConnected Client is connected to ZooKeeper
   [junit4]   2> 627858 T2372 oasc.AbstractZkTestCase.putConfig put /mnt/ssd/jenkins/workspace/Lucene-Solr-trunk-Linux/solr/core/src/test-files/solr/collection1/conf/solrconfig.xml to /configs/conf2/solrconfig.xml
   [junit4]   2> 627859 T2372 oascc.SolrZkClient.makePath makePath: /configs/conf2/solrconfig.xml
   [junit4]   2> 627864 T2372 oasc.AbstractZkTestCase.putConfig put /mnt/ssd/jenkins/workspace/Lucene-Solr-trunk-Linux/solr/core/src/test-files/solr/collection1/conf/schema.xml to /configs/conf2/schema.xml
   [junit4]   2> 627864 T2372 oascc.SolrZkClient.makePath makePath: /configs/conf2/schema.xml
   [junit4]   2> 627867 T2372 oasc.AbstractZkTestCase.putConfig put /mnt/ssd/jenkins/workspace/Lucene-Solr-trunk-Linux/solr/core/src/test-files/solr/collection1/conf/solrconfig.snippet.randomindexconfig.xml to /configs/conf2/solrconfig.snippet.randomindexconfig.xml
   [junit4]   2> 627867 T2372 oascc.SolrZkClient.makePath makePath: /configs/conf2/solrconfig.snippet.randomindexconfig.xml
   [junit4]   2> 627869 T2372 oasc.AbstractZkTestCase.putConfig put /mnt/ssd/jenkins/workspace/Lucene-Solr-trunk-Linux/solr/core/src/test-files/solr/collection1/conf/stopwords.txt to /configs/conf2/stopwords.txt
   [junit4]   2> 627869 T2372 oascc.SolrZkClient.makePath makePath: /configs/conf2/stopwords.txt
   [junit4]   2> 627870 T2372 oasc.AbstractZkTestCase.putConfig put /mnt/ssd/jenkins/workspace/Lucene-Solr-trunk-Linux/solr/core/src/test-files/solr/collection1/conf/protwords.txt to /configs/conf2/protwords.txt
   [junit4]   2> 627871 T2372 oascc.SolrZkClient.makePath makePath: /configs/conf2/protwords.txt
   [junit4]   2> 627872 T2372 oasc.AbstractZkTestCase.putConfig put /mnt/ssd/jenkins/workspace/Lucene-Solr-trunk-Linux/solr/core/src/test-files/solr/collection1/conf/currency.xml to /configs/conf2/currency.xml
   [junit4]   2> 627873 T2372 oascc.SolrZkClient.makePath makePath: /configs/conf2/currency.xml
   [junit4]   2> 627875 T2372 oasc.AbstractZkTestCase.putConfig put /mnt/ssd/jenkins/workspace/Lucene-Solr-trunk-Linux/solr/core/src/test-files/solr/collection1/conf/open-exchange-rates.json to /configs/conf2/open-exchange-rates.json
   [junit4]   2> 627875 T2372 oascc.SolrZkClient.makePath makePath: /configs/conf2/open-exchange-rates.json
   [junit4]   2> 627877 T2372 oasc.AbstractZkTestCase.putConfig put /mnt/ssd/jenkins/workspace/Lucene-Solr-trunk-Linux/solr/core/src/test-files/solr/collection1/conf/mapping-ISOLatin1Accent.txt to /configs/conf2/mapping-ISOLatin1Accent.txt
   [junit4]   2> 627877 T2372 oascc.SolrZkClient.makePath makePath: /configs/conf2/mapping-ISOLatin1Accent.txt
   [junit4]   2> 627879 T2372 oasc.AbstractZkTestCase.putConfig put /mnt/ssd/jenkins/workspace/Lucene-Solr-trunk-Linux/solr/core/src/test-files/solr/collection1/conf/old_synonyms.txt to /configs/conf2/old_synonyms.txt
   [junit4]   2> 627880 T2372 oascc.SolrZkClient.makePath makePath: /configs/conf2/old_synonyms.txt
   [junit4]   2> 627881 T2372 oasc.AbstractZkTestCase.putConfig put /mnt/ssd/jenkins/workspace/Lucene-Solr-trunk-Linux/solr/core/src/test-files/solr/collection1/conf/synonyms.txt to /configs/conf2/synonyms.txt
   [junit4]   2> 627882 T2372 oascc.SolrZkClient.makePath makePath: /configs/conf2/synonyms.txt
   [junit4]   2> 627883 T2372 oasc.AbstractZkTestCase.putConfig put /mnt/ssd/jenkins/workspace/Lucene-Solr-trunk-Linux/solr/core/src/test-files/solr/collection1/conf/elevate.xml to /configs/conf2/elevate.xml
   [junit4]   2> 627883 T2372 oascc.SolrZkClient.makePath makePath: /configs/conf2/elevate.xml
   [junit4]   2> 628124 T2372 oejs.Server.doStart jetty-8.1.10.v20130312
   [junit4]   2> 628132 T2372 oejus.SslContextFactory.doStart Enabled Protocols [SSLv2Hello, SSLv3, TLSv1, TLSv1.1, TLSv1.2] of [SSLv2Hello, SSLv3, TLSv1, TLSv1.1, TLSv1.2]
   [junit4]   2> 628136 T2372 oejs.AbstractConnector.doStart Started SslSelectChannelConnector@127.0.0.1:57743
   [junit4]   2> 628138 T2372 oass.SolrDispatchFilter.init SolrDispatchFilter.init()
   [junit4]   2> 628139 T2372 oasc.SolrResourceLoader.locateSolrHome JNDI not configured for solr (NoInitialContextEx)
   [junit4]   2> 628139 T2372 oasc.SolrResourceLoader.locateSolrHome using system property solr.solr.home: /mnt/ssd/jenkins/workspace/Lucene-Solr-trunk-Linux/solr/build/solr-core/test/J1/./temp/solr.cloud.CollectionsAPIDistributedZkTest-836554BD8ACF5AE7-001/tempDir-002
   [junit4]   2> 628139 T2372 oasc.SolrResourceLoader.<init> new SolrResourceLoader for directory: '/mnt/ssd/jenkins/workspace/Lucene-Solr-trunk-Linux/solr/build/solr-core/test/J1/./temp/solr.cloud.CollectionsAPIDistributedZkTest-836554BD8ACF5AE7-001/tempDir-002/'
   [junit4]   2> 628150 T2372 oasc.ConfigSolr.fromFile Loading container configuration from /mnt/ssd/jenkins/workspace/Lucene-Solr-trunk-Linux/solr/build/solr-core/test/J1/./temp/solr.cloud.CollectionsAPIDistributedZkTest-836554BD8ACF5AE7-001/tempDir-002/solr.xml
   [junit4]   2> 628174 T2372 oasc.CoreContainer.<init> New CoreContainer 720917188
   [junit4]   2> 628174 T2372 oasc.CoreContainer.load Loading cores into CoreContainer [instanceDir=/mnt/ssd/jenkins/workspace/Lucene-Solr-trunk-Linux/solr/build/solr-core/test/J1/./temp/solr.cloud.CollectionsAPIDistributedZkTest-836554BD8ACF5AE7-001/tempDir-002/]
   [junit4]   2> 628175 T2372 oashc.HttpShardHandlerFactory.getParameter Setting socketTimeout to: 120000
   [junit4]   2> 628176 T2372 oashc.HttpShardHandlerFactory.getParameter Setting urlScheme to: null
   [junit4]   2> 628176 T2372 oashc.HttpShardHandlerFactory.getParameter Setting connTimeout to: 15000
   [junit4]   2> 628177 T2372 oashc.HttpShardHandlerFactory.getParameter Setting maxConnectionsPerHost to: 20
   [junit4]   2> 628177 T2372 oashc.HttpShardHandlerFactory.getParameter Setting corePoolSize to: 0
   [junit4]   2> 628177 T2372 oashc.HttpShardHandlerFactory.getParameter Setting maximumPoolSize to: 2147483647
   [junit4]   2> 628178 T2372 oashc.HttpShardHandlerFactory.getParameter Setting maxThreadIdleTime to: 5
   [junit4]   2> 628178 T2372 oashc.HttpShardHandlerFactory.getParameter Setting sizeOfQueue to: -1
   [junit4]   2> 628178 T2372 oashc.HttpShardHandlerFactory.getParameter Setting fairnessPolicy to: false
   [junit4]   2> 628181 T2372 oasl.LogWatcher.createWatcher SLF4J impl is org.slf4j.impl.Log4jLoggerFactory
   [junit4]   2> 628182 T2372 oasl.LogWatcher.newRegisteredLogWatcher Registering Log Listener [Log4j (org.slf4j.impl.Log4jLoggerFactory)]
   [junit4]   2> 628182 T2372 oasc.CoreContainer.load Host Name: 127.0.0.1
   [junit4]   2> 628183 T2372 oasc.ZkContainer.initZooKeeper Zookeeper client=127.0.0.1:35788/solr
   [junit4]   2> 628183 T2372 oasc.ZkController.checkChrootPath zkHost includes chroot
   [junit4]   2> 628184 T2372 oascc.ConnectionManager.waitForConnected Waiting for client to connect to ZooKeeper
   [junit4]   2> 628186 T2398 oascc.ConnectionManager.process Watcher org.apache.solr.common.cloud.ConnectionManager@67cbb3b8 name:ZooKeeperConnection Watcher:127.0.0.1:35788 got event WatchedEvent state:SyncConnected type:None path:null path:null type:None
   [junit4]   2> 628186 T2372 oascc.ConnectionManager.waitForConnected Client is connected to ZooKeeper
   [junit4]   2> 628188 T2372 oascc.ConnectionManager.waitForConnected Waiting for client to connect to ZooKeeper
   [junit4]   2> 628190 T2400 oascc.ConnectionManager.process Watcher org.apache.solr.common.cloud.ConnectionManager@587843d name:ZooKeeperConnection Watcher:127.0.0.1:35788/solr got event WatchedEvent state:SyncConnected type:None path:null path:null type:None
   [junit4]   2> 628190 T2372 oascc.ConnectionManager.waitForConnected Client is connected to ZooKeeper
   [junit4]   2> 628192 T2372 oascc.SolrZkClient.makePath makePath: /overseer/queue
   [junit4]   2> 628194 T2372 oascc.SolrZkClient.makePath makePath: /overseer/collection-queue-work
   [junit4]   2> 628195 T2372 oascc.SolrZkClient.makePath makePath: /overseer/collection-map-running
   [junit4]   2> 628197 T2372 oascc.SolrZkClient.makePath makePath: /overseer/collection-map-completed
   [junit4]   2> 628199 T2372 oascc.SolrZkClient.makePath makePath: /overseer/collection-map-failure
   [junit4]   2> 628201 T2372 oascc.SolrZkClient.makePath makePath: /live_nodes
   [junit4]   2> 628202 T2372 oasc.ZkController.createEphemeralLiveNode Register node as live in ZooKeeper:/live_nodes/127.0.0.1:57743__nn
   [junit4]   2> 628202 T2372 oascc.SolrZkClient.makePath makePath: /live_nodes/127.0.0.1:57743__nn
   [junit4]   2> 628204 T2372 oascc.SolrZkClient.makePath makePath: /overseer_elect
   [junit4]   2> 628205 T2372 oascc.SolrZkClient.makePath makePath: /overseer_elect/election
   [junit4]   2> 628207 T2372 oasc.OverseerElectionContext.runLeaderProcess I am going to be the leader 127.0.0.1:57743__nn
   [junit4]   2> 628207 T2372 oascc.SolrZkClient.makePath makePath: /overseer_elect/leader
   [junit4]   2> 628214 T2372 oasc.Overseer.start Overseer (id=91806195021512710-127.0.0.1:57743__nn-n_0000000000) starting
   [junit4]   2> 628217 T2372 oascc.SolrZkClient.makePath makePath: /overseer/queue-work
   [junit4]   2> 628223 T2372 oascc.SolrZkClient.makePath makePath: /clusterstate.json
   [junit4]   2> 628223 T2402 oasc.OverseerCollectionProcessor.run Process current queue of collection creations
   [junit4]   2> 628225 T2372 oascc.SolrZkClient.makePath makePath: /aliases.json
   [junit4]   2> 628227 T2372 oascc.ZkStateReader.createClusterStateWatchersAndUpdate Updating cluster state from ZooKeeper... 
   [junit4]   2> 628228 T2401 oasc.Overseer$ClusterStateUpdater.run Starting to work on the main queue
   [junit4]   2> 628230 T2372 oass.SolrDispatchFilter.init user.dir=/mnt/ssd/jenkins/workspace/Lucene-Solr-trunk-Linux/solr/build/solr-core/test/J1
   [junit4]   2> 628230 T2372 oass.SolrDispatchFilter.init SolrDispatchFilter.init() done
   [junit4]   2> 628234 T2372 oascc.ConnectionManager.waitForConnected Waiting for client to connect to ZooKeeper
   [junit4]   2> 628236 T2405 oascc.ConnectionManager.process Watcher org.apache.solr.common.cloud.ConnectionManager@6efc63de name:ZooKeeperConnection Watcher:127.0.0.1:35788/solr got event WatchedEvent state:SyncConnected type:None path:null path:null type:None
   [junit4]   2> 628236 T2372 oascc.ConnectionManager.waitForConnected Client is connected to ZooKeeper
   [junit4]   2> 628238 T2372 oascc.ZkStateReader.createClusterStateWatchersAndUpdate Updating cluster state from ZooKeeper... 
   [junit4]   2> 628239 T2372 oasc.ChaosMonkey.monkeyLog monkey: init - expire sessions:false cause connection loss:false
   [junit4]   2> 628487 T2372 oasc.AbstractFullDistribZkTestBase.createJettys create jetty 1
   [junit4]   2> 628488 T2372 oejs.Server.doStart jetty-8.1.10.v20130312
   [junit4]   2> 628497 T2372 oejus.SslContextFactory.doStart Enabled Protocols [SSLv2Hello, SSLv3, TLSv1, TLSv1.1, TLSv1.2] of [SSLv2Hello, SSLv3, TLSv1, TLSv1.1, TLSv1.2]
   [junit4]   2> 628498 T2372 oejs.AbstractConnector.doStart Started SslSelectChannelConnector@127.0.0.1:50315
   [junit4]   2> 628500 T2372 oass.SolrDispatchFilter.init SolrDispatchFilter.init()
   [junit4]   2> 628500 T2372 oasc.SolrResourceLoader.locateSolrHome JNDI not configured for solr (NoInitialContextEx)
   [junit4]   2> 628500 T2372 oasc.SolrResourceLoader.locateSolrHome using system property solr.solr.home: /mnt/ssd/jenkins/workspace/Lucene-Solr-trunk-Linux/solr/build/solr-core/test/J1/./temp/solr.cloud.CollectionsAPIDistributedZkTest-836554BD8ACF5AE7-001/tempDir-003
   [junit4]   2> 628501 T2372 oasc.SolrResourceLoader.<init> new SolrResourceLoader for directory: '/mnt/ssd/jenkins/workspace/Lucene-Solr-trunk-Linux/solr/build/solr-core/test/J1/./temp/solr.cloud.CollectionsAPIDistributedZkTest-836554BD8ACF5AE7-001/tempDir-003/'
   [junit4]   2> 628511 T2372 oasc.ConfigSolr.fromFile Loading container configuration from /mnt/ssd/jenkins/workspace/Lucene-Solr-trunk-Linux/solr/build/solr-core/test/J1/./temp/solr.cloud.CollectionsAPIDistributedZkTest-836554BD8ACF5AE7-001/tempDir-003/solr.xml
   [junit4]   2> 628522 T2372 oasc.CoreContainer.<init> New CoreContainer 1711561724
   [junit4]   2> 628522 T2372 oasc.CoreContainer.load Loading cores into CoreContainer [instanceDir=/mnt/ssd/jenkins/workspace/Lucene-Solr-trunk-Linux/solr/build/solr-core/test/J1/./temp/solr.cloud.CollectionsAPIDistributedZkTest-836554BD8ACF5AE7-001/tempDir-003/]
   [junit4]   2> 628523 T2372 oashc.HttpShardHandlerFactory.getParameter Setting socketTimeout to: 120000
   [junit4]   2> 628523 T2372 oashc.HttpShardHandlerFactory.getParameter Setting urlScheme to: null
   [junit4]   2> 628523 T2372 oashc.HttpShardHandlerFactory.getParameter Setting connTimeout to: 15000
   [junit4]   2> 628524 T2372 oashc.HttpShardHandlerFactory.getParameter Setting maxConnectionsPerHost to: 20
   [junit4]   2> 628524 T2372 oashc.HttpShardHandlerFactory.getParameter Setting corePoolSize to: 0
   [junit4]   2> 628524 T2372 oashc.HttpShardHandlerFactory.getParameter Setting maximumPoolSize to: 2147483647
   [junit4]   2> 628525 T2372 oashc.HttpShardHandlerFactory.getParameter Setting maxThreadIdleTime to: 5
   [junit4]   2> 628525 T2372 oashc.HttpShardHandlerFactory.getParameter Setting sizeOfQueue to: -1
   [junit4]   2> 628525 T2372 oashc.HttpShardHandlerFactory.getParameter Setting fairnessPolicy to: false
   [junit4]   2> 628528 T2372 oasl.LogWatcher.createWatcher SLF4J impl is org.slf4j.impl.Log4jLoggerFactory
   [junit4]   2> 628528 T2372 oasl.LogWatcher.newRegisteredLogWatcher Registering Log Listener [Log4j (org.slf4j.impl.Log4jLoggerFactory)]
   [junit4]   2> 628529 T2372 oasc.CoreContainer.load Host Name: 127.0.0.1
   [junit4]   2> 628529 T2372 oasc.ZkContainer.initZooKeeper Zookeeper client=127.0.0.1:35788/solr
   [junit4]   2> 628529 T2372 oasc.ZkController.checkChrootPath zkHost includes chroot
   [junit4]   2> 628530 T2372 oascc.ConnectionManager.waitForConnected Waiting for client to connect to ZooKeeper
   [junit4]   2> 628533 T2416 oascc.ConnectionManager.process Watcher org.apache.solr.common.cloud.ConnectionManager@6b65d357 name:ZooKeeperConnection Watcher:127.0.0.1:35788 got event WatchedEvent state:SyncConnected type:None path:null path:null type:None
   [junit4]   2> 628533 T2372 oascc.ConnectionManager.waitForConnected Client is connected to ZooKeeper
   [junit4]   2> 628535 T2372 oascc.ConnectionManager.waitForConnected Waiting for client to connect to ZooKeeper
   [junit4]   2> 628536 T2418 oascc.ConnectionManager.process Watcher org.apache.solr.common.cloud.ConnectionManager@130b24c0 name:ZooKeeperConnection Watcher:127.0.0.1:35788/solr got event WatchedEvent state:SyncConnected type:None path:null path:null type:None
   [junit4]   2> 628537 T2372 oascc.ConnectionManager.waitForConnected Client is connected to ZooKeeper
   [junit4]   2> 628540 T2372 oascc.ZkStateReader.createClusterStateWatchersAndUpdate Updating cluster state from ZooKeeper... 
   [junit4]   2> 629542 T2372 oasc.ZkController.createEphemeralLiveNode Register node as live in ZooKeeper:/live_nodes/127.0.0.1:50315__nn
   [junit4]   2> 629544 T2372 oascc.SolrZkClient.makePath makePath: /live_nodes/127.0.0.1:50315__nn
   [junit4]   2> 629554 T2372 oass.SolrDispatchFilter.init user.dir=/mnt/ssd/jenkins/workspace/Lucene-Solr-trunk-Linux/solr/build/solr-core/test/J1
   [junit4]   2> 629555 T2372 oass.SolrDispatchFilter.init SolrDispatchFilter.init() done
   [junit4]   2> 629788 T2372 oasc.AbstractFullDistribZkTestBase.createJettys create jetty 2
   [junit4]   2> 629788 T2372 oejs.Server.doStart jetty-8.1.10.v20130312
   [junit4]   2> 629791 T2372 oejus.SslContextFactory.doStart Enabled Protocols [SSLv2Hello, SSLv3, TLSv1, TLSv1.1, TLSv1.2] of [SSLv2Hello, SSLv3, TLSv1, TLSv1.1, TLSv1.2]
   [junit4]   2> 629792 T2372 oejs.AbstractConnector.doStart Started SslSelectChannelConnector@127.0.0.1:36378
   [junit4]   2> 629793 T2372 oass.SolrDispatchFilter.init SolrDispatchFilter.init()
   [junit4]   2> 629794 T2372 oasc.SolrResourceLoader.locateSolrHome JNDI not configured for solr (NoInitialContextEx)
   [junit4]   2> 629794 T2372 oasc.SolrResourceLoader.locateSolrHome using system property solr.solr.home: /mnt/ssd/jenkins/workspace/Lucene-Solr-trunk-Linux/solr/build/solr-core/test/J1/./temp/solr.cloud.CollectionsAPIDistributedZkTest-836554BD8ACF5AE7-001/tempDir-004
   [junit4]   2> 629794 T2372 oasc.SolrResourceLoader.<init> new SolrResourceLoader for directory: '/mnt/ssd/jenkins/workspace/Lucene-Solr-trunk-Linux/solr/build/solr-core/test/J1/./temp/solr.cloud.CollectionsAPIDistributedZkTest-836554BD8ACF5AE7-001/tempDir-004/'
   [junit4]   2> 629810 T2372 oasc.ConfigSolr.fromFile Loading container configuration from /mnt/ssd/jenkins/workspace/Lucene-Solr-trunk-Linux/solr/build/solr-core/test/J1/./temp/solr.cloud.CollectionsAPIDistributedZkTest-836554BD8ACF5AE7-001/tempDir-004/solr.xml
   [junit4]   2> 629818 T2372 oasc.CoreContainer.<init> New CoreContainer 960346198
   [junit4]   2> 629819 T2372 oasc.CoreContainer.load Loading cores into CoreContainer [instanceDir=/mnt/ssd/jenkins/workspace/Lucene-Solr-trunk-Linux/solr/build/solr-core/test/J1/./temp/solr.cloud.CollectionsAPIDistributedZkTest-836554BD8ACF5AE7-001/tempDir-004/]
   [junit4]   2> 629819 T2372 oashc.HttpShardHandlerFactory.getParameter Setting socketTimeout to: 120000
   [junit4]   2> 629819 T2372 oashc.HttpShardHandlerFactory.getParameter Setting urlScheme to: null
   [junit4]   2> 629820 T2372 oashc.HttpShardHandlerFactory.getParameter Setting connTimeout to: 15000
   [junit4]   2> 629820 T2372 oashc.HttpShardHandlerFactory.getParameter Setting maxConnectionsPerHost to: 20
   [junit4]   2> 629820 T2372 oashc.HttpShardHandlerFactory.getParameter Setting corePoolSize to: 0
   [junit4]   2> 629820 T2372 oashc.HttpShardHandlerFactory.getParameter Setting maximumPoolSize to: 2147483647
   [junit4]   2> 629821 T2372 oashc.HttpShardHandlerFactory.getParameter Setting maxThreadIdleTime to: 5
   [junit4]   2> 629821 T2372 oashc.HttpShardHandlerFactory.getParameter Setting sizeOfQueue to: -1
   [junit4]   2> 629821 T2372 oashc.HttpShardHandlerFactory.getParameter Setting fairnessPolicy to: false
   [junit4]   2> 629823 T2372 oasl.LogWatcher.createWatcher SLF4J impl is org.slf4j.impl.Log4jLoggerFactory
   [junit4]   2> 629823 T2372 oasl.LogWatcher.newRegisteredLogWatcher Registering Log Listener [Log4j (org.slf4j.impl.Log4jLoggerFactory)]
   [junit4]   2> 629823 T2372 oasc.CoreContainer.load Host Name: 127.0.0.1
   [junit4]   2> 629823 T2372 oasc.ZkContainer.initZooKeeper Zookeeper client=127.0.0.1:35788/solr
   [junit4]   2> 629824 T2372 oasc.ZkController.checkChrootPath zkHost includes chroot
   [junit4]   2> 629824 T2372 oascc.ConnectionManager.waitForConnected Waiting for client to connect to ZooKeeper
   [junit4]   2> 629826 T2430 oascc.ConnectionManager.process Watcher org.apache.solr.common.cloud.ConnectionManager@1336fde6 name:ZooKeeperConnection Watcher:127.0.0.1:35788 got event WatchedEvent state:SyncConnected type:None path:null path:null type:None
   [junit4]   2> 629826 T2372 oascc.ConnectionManager.waitForConnected Client is connected to ZooKeeper
   [junit4]   2> 629828 T2372 oascc.ConnectionManager.waitForConnected Waiting for client to connect to ZooKeeper
   [junit4]   2> 629830 T2432 oascc.ConnectionManager.process Watcher org.apache.solr.common.cloud.ConnectionManager@12e0adfe name:ZooKeeperConnection Watcher:127.0.0.1:35788/solr got event WatchedEvent state:SyncConnected type:None path:null path:null type:None
   [junit4]   2> 629830 T2372 oascc.ConnectionManager.waitForConnected Client is connected to ZooKeeper
   [junit4]   2> 629835 T2372 oascc.ZkStateReader.createClusterStateWatchersAndUpdate Updating cluster state from ZooKeeper... 
   [junit4]   2> 630837 T2372 oasc.ZkController.createEphemeralLiveNode Register node as live in ZooKeeper:/live_nodes/127.0.0.1:36378__nn
   [junit4]   2> 630839 T2372 oascc.SolrZkClient.makePath makePath: /live_nodes/127.0.0.1:36378__nn
   [junit4]   2> 630849 T2372 oass.SolrDispatchFilter.init user.dir=/mnt/ssd/jenkins/workspace/Lucene-Solr-trunk-Linux/solr/build/solr-core/test/J1
   [junit4]   2> 630849 T2372 oass.SolrDispatchFilter.init SolrDispatchFilter.init() done
   [junit4]   2> 631071 T2372 oasc.AbstractFullDistribZkTestBase.createJettys create jetty 3
   [junit4]   2> 631071 T2372 oejs.Server.doStart jetty-8.1.10.v20130312
   [junit4]   2> 631075 T2372 oejus.SslContextFactory.doStart Enabled Protocols [SSLv2Hello, SSLv3, TLSv1, TLSv1.1, TLSv1.2] of [SSLv2Hello, SSLv3, TLSv1, TLSv1.1, TLSv1.2]
   [junit4]   2> 631076 T2372 oejs.AbstractConnector.doStart Started SslSelectChannelConnector@127.0.0.1:34154
   [junit4]   2> 631078 T2372 oass.SolrDispatchFilter.init SolrDispatchFilter.init()
   [junit4]   2> 631079 T2372 oasc.SolrResourceLoader.locateSolrHome JNDI not configured for solr (NoInitialContextEx)
   [junit4]   2> 631079 T2372 oasc.SolrResourceLoader.locateSolrHome using system property solr.solr.home: /mnt/ssd/jenkins/workspace/Lucene-Solr-trunk-Linux/solr/build/solr-core/test/J1/./temp/solr.cloud.CollectionsAPIDistributedZkTest-836554BD8ACF5AE7-001/tempDir-005
   [junit4]   2> 631080 T2372 oasc.SolrResourceLoader.<init> new SolrResourceLoader for directory: '/mnt/ssd/jenkins/workspace/Lucene-Solr-trunk-Linux/solr/build/solr-core/test/J1/./temp/solr.cloud.CollectionsAPIDistributedZkTest-836554BD8ACF5AE7-001/tempDir-005/'
   [junit4]   2> 631089 T2372 oasc.ConfigSolr.fromFile Loading container configuration from /mnt/ssd/jenkins/workspace/Lucene-Solr-trunk-Linux/solr/build/solr-core/test/J1/./temp/solr.cloud.CollectionsAPIDistributedZkTest-836554BD8ACF5AE7-001/tempDir-005/solr.xml
   [junit4]   2> 631103 T2372 oasc.CoreContainer.<init> New CoreContainer 1999364221
   [junit4]   2> 631103 T2372 oasc.CoreContainer.load Loading cores into CoreContainer [instanceDir=/mnt/ssd/jenkins/workspace/Lucene-Solr-trunk-Linux/solr/build/solr-core/test/J1/./temp/solr.cloud.CollectionsAPIDistributedZkTest-836554BD8ACF5AE7-001/tempDir-005/]
   [junit4]   2> 631104 T2372 oashc.HttpShardHandlerFactory.getParameter Setting socketTimeout to: 120000
   [junit4]   2> 631104 T2372 oashc.HttpShardHandlerFactory.getParameter Setting urlScheme to: null
   [junit4]   2> 631104 T2372 oashc.HttpShardHandlerFactory.getParameter Setting connTimeout to: 15000
   [junit4]   2> 631104 T2372 oashc.HttpShardHandlerFactory.getParameter Setting maxConnectionsPerHost to: 20
   [junit4]   2> 631104 T2372 oashc.HttpShardHandlerFactory.getParameter Setting corePoolSize to: 0
   [junit4]   2> 631105 T2372 oashc.HttpShardHandlerFactory.getParameter Setting maximumPoolSize to: 2147483647
   [junit4]   2> 631105 T2372 oashc.HttpShardHandlerFactory.getParameter Setting maxThreadIdleTime to: 5
   [junit4]   2> 631105 T2372 oashc.HttpShardHandlerFactory.getParameter Setting sizeOfQueue to: -1
   [junit4]   2> 631105 T2372 oashc.HttpShardHandlerFactory.getParameter Setting fairnessPolicy to: false
   [junit4]   2> 631107 T2372 oasl.LogWatcher.createWatcher SLF4J impl is org.slf4j.impl.Log4jLoggerFactory
   [junit4]   2> 631107 T2372 oasl.LogWatcher.newRegisteredLogWatcher Registering Log Listener [Log4j (org.slf4j.impl.Log4jLoggerFactory)]
   [junit4]   2> 631107 T2372 oasc.CoreContainer.load Host Name: 127.0.0.1
   [junit4]   2> 631108 T2372 oasc.ZkContainer.initZooKeeper Zookeeper client=127.0.0.1:35788/solr
   [junit4]   2> 631108 T2372 oasc.ZkController.checkChrootPath zkHost includes chroot
   [junit4]   2> 631109 T2372 oascc.ConnectionManager.waitForConnected Waiting for client to connect to ZooKeeper
   [junit4]   2> 631111 T2444 oascc.ConnectionManager.process Watcher org.apache.solr.common.cloud.ConnectionManager@1517c9be name:ZooKeeperConnection Watcher:127.0.0.1:35788 got event WatchedEvent state:SyncConnected type:None path:null path:null type:None
   [junit4]   2> 631111 T2372 oascc.ConnectionManager.waitForConnected Client is connected to ZooKeeper
   [junit4]   2> 631113 T2372 oascc.ConnectionManager.waitForConnected Waiting for client to connect to ZooKeeper
   [junit4]   2> 631114 T2446 oascc.ConnectionManager.process Watcher org.apache.solr.common.cloud.ConnectionManager@25a03098 name:ZooKeeperConnection Watcher:127.0.0.1:35788/solr got event WatchedEvent state:SyncConnected type:None path:null path:null type:None
   [junit4]   2> 631114 T2372 oascc.ConnectionManager.waitForConnected Client is connected to ZooKeeper
   [junit4]   2> 631118 T2372 oascc.ZkStateReader.createClusterStateWatchersAndUpdate Updating cluster state from ZooKeeper... 
   [junit4]   2> 632120 T2372 oasc.ZkController.createEphemeralLiveNode Register node as live in ZooKeeper:/live_nodes/127.0.0.1:34154__nn
   [junit4]   2> 632121 T2372 oascc.SolrZkClient.makePath makePath: /live_nodes/127.0.0.1:34154__nn
   [junit4]   2> 632133 T2372 oass.SolrDispatchFilter.init user.dir=/mnt/ssd/jenkins/workspace/Lucene-Solr-trunk-Linux/solr/build/solr-core/test/J1
   [junit4]   2> 632133 T2372 oass.SolrDispatchFilter.init SolrDispatchFilter.init() done
   [junit4]   2> 632358 T2372 oasc.AbstractFullDistribZkTestBase.createJettys create jetty 4
   [junit4]   2> 632359 T2372 oejs.Server.doStart jetty-8.1.10.v20130312
   [junit4]   2> 632362 T2372 oejus.SslContextFactory.doStart Enabled Protocols [SSLv2Hello, SSLv3, TLSv1, TLSv1.1, TLSv1.2] of [SSLv2Hello, SSLv3, TLSv1, TLSv1.1, TLSv1.2]
   [junit4]   2> 632363 T2372 oejs.AbstractConnector.doStart Started SslSelectChannelConnector@127.0.0.1:48687
   [junit4]   2> 632366 T2372 oass.SolrDispatchFilter.init SolrDispatchFilter.init()
   [junit4]   2> 632366 T2372 oasc.SolrResourceLoader.locateSolrHome JNDI not configured for solr (NoInitialContextEx)
   [junit4]   2> 632367 T2372 oasc.SolrResourceLoader.locateSolrHome using system property solr.solr.home: /mnt/ssd/jenkins/workspace/Lucene-Solr-trunk-Linux/solr/build/solr-core/test/J1/./temp/solr.cloud.CollectionsAPIDistributedZkTest-836554BD8ACF5AE7-001/tempDir-006
   [junit4]   2> 632368 T2372 oasc.SolrResourceLoader.<init> new SolrResourceLoader for directory: '/mnt/ssd/jenkins/workspace/Lucene-Solr-trunk-Linux/solr/build/solr-core/test/J1/./temp/solr.cloud.CollectionsAPIDistributedZkTest-836554BD8ACF5AE7-001/tempDir-006/'
   [junit4]   2> 632383 T2372 oasc.ConfigSolr.fromFile Loading container configuration from /mnt/ssd/jenkins/workspace/Lucene-Solr-trunk-Linux/solr/build/solr-core/test/J1/./temp/solr.cloud.CollectionsAPIDistributedZkTest-836554BD8ACF5AE7-001/tempDir-006/solr.xml
   [junit4]   2> 632403 T2372 oasc.CoreContainer.<init> New CoreContainer 599043849
   [junit4]   2> 632403 T2372 oasc.CoreContainer.load Loading cores into CoreContainer [instanceDir=/mnt/ssd/jenkins/workspace/Lucene-Solr-trunk-Linux/solr/build/solr-core/test/J1/./temp/solr.cloud.CollectionsAPIDistributedZkTest-836554BD8ACF5AE7-001/tempDir-006/]
   [junit4]   2> 632404 T2372 oashc.HttpShardHandlerFactory.getParameter Setting socketTimeout to: 120000
   [junit4]   2> 632404 T2372 oashc.HttpShardHandlerFactory.getParameter Setting urlScheme to: null
   [junit4]   2> 632404 T2372 oashc.HttpShardHandlerFactory.getParameter Setting connTimeout to: 15000
   [junit4]   2> 632405 T2372 oashc.HttpShardHandlerFactory.getParameter Setting maxConnectionsPerHost to: 20
   [junit4]   2> 632405 T2372 oashc.HttpShardHandlerFactory.getParameter Setting corePoolSize to: 0
   [junit4]   2> 632405 T2372 oashc.HttpShardHandlerFactory.getParameter Setting maximumPoolSize to: 2147483647
   [junit4]   2> 632406 T2372 oashc.HttpShardHandlerFactory.getParameter Setting maxThreadIdleTime to: 5
   [junit4]   2> 632406 T2372 oashc.HttpShardHandlerFactory.getParameter Setting sizeOfQueue to: -1
   [junit4]   2> 632406 T2372 oashc.HttpShardHandlerFactory.getParameter Setting fairnessPolicy to: false
   [junit4]   2> 632409 T2372 oasl.LogWatcher.createWatcher SLF4J impl is org.slf4j.impl.Log4jLoggerFactory
   [junit4]   2> 632409 T2372 oasl.LogWatcher.newRegisteredLogWatcher Registering Log Listener [Log4j (org.slf4j.impl.Log4jLoggerFactory)]
   [junit4]   2> 632410 T2372 oasc.CoreContainer.load Host Name: 127.0.0.1
   [junit4]   2> 632410 T2372 oasc.ZkContainer.initZooKeeper Zookeeper client=127.0.0.1:35788/solr
   [junit4]   2> 632411 T2372 oasc.ZkController.checkChrootPath zkHost includes chroot
   [junit4]   2> 632411 T2372 oascc.ConnectionManager.waitForConnected Waiting for client to connect to ZooKeeper
   [junit4]   2> 632414 T2458 oascc.ConnectionManager.process Watcher org.apache.solr.common.cloud.ConnectionManager@4e18f179 name:ZooKeeperConnection Watcher:127.0.0.1:35788 got event WatchedEvent state:SyncConnected type:None path:null path:null type:None
   [junit4]   2> 632414 T2372 oascc.ConnectionManager.waitForConnected Client is connected to ZooKeeper
   [junit4]   2> 632420 T2372 oascc.ConnectionManager.waitForConnected Waiting for client to connect to ZooKeeper
   [junit4]   2> 632422 T2460 oascc.ConnectionManager.process Watcher org.apache.solr.common.cloud.ConnectionManager@75b0a714 name:ZooKeeperConnection Watcher:127.0.0.1:35788/solr got event WatchedEvent state:SyncConnected type:None path:null path:null type:None
   [junit4]   2> 632422 T2372 oascc.ConnectionManager.waitForConnected Client is connected to ZooKeeper
   [junit4]   2> 632426 T2372 oascc.ZkStateReader.createClusterStateWatchersAndUpdate Updating cluster state from ZooKeeper... 
   [junit4]   2> 633428 T2372 oasc.ZkController.createEphemeralLiveNode Register node as live in ZooKeeper:/live_nodes/127.0.0.1:48687__nn
   [junit4]   2> 633430 T2372 oascc.SolrZkClient.makePath makePath: /live_nodes/127.0.0.1:48687__nn
   [junit4]   2> 633474 T2372 oass.SolrDispatchFilter.init user.dir=/mnt/ssd/jenkins/workspace/Lucene-Solr-trunk-Linux/solr/build/solr-core/test/J1
   [junit4]   2> 633475 T2372 oass.SolrDispatchFilter.init SolrDispatchFilter.init() done
   [junit4]   2> 633551 T2412 oasha.CollectionsHandler.handleCreateAction Creating Collection : replicationFactor=2&collection.configName=conf1&router.field=myOwnField&name=solrj_collection&router.name=compositeId&action=CREATE&numShards=2&wt=javabin&version=2
   [junit4]   2> 633553 T2400 oasc.DistributedQueue$LatchChildWatcher.process LatchChildWatcher fired on path: /overseer/collection-queue-work state: SyncConnected type NodeChildrenChanged
   [junit4]   2> 633553 T2400 oasc.DistributedQueue$LatchChildWatcher.process LatchChildWatcher fired on path: /overseer/collection-queue-work state: SyncConnected type NodeChildrenChanged
   [junit4]   2> 633553 T2400 oasc.DistributedQueue$LatchChildWatcher.process LatchChildWatcher fired on path: /overseer/collection-queue-work state: SyncConnected type NodeChildrenChanged
   [junit4]   2> 633553 T2400 oasc.DistributedQueue$LatchChildWatcher.process LatchChildWatcher fired on path: /overseer/collection-queue-work state: SyncConnected type NodeChildrenChanged
   [junit4]   2> 633554 T2400 oasc.DistributedQueue$LatchChildWatcher.process LatchChildWatcher fired on path: /overseer/collection-queue-work state: SyncConnected type NodeChildrenChanged
   [junit4]   2> 633555 T2402 oasc.OverseerCollectionProcessor.run Overseer Collection Processor: Get the message id:/overseer/collection-queue-work/qn-0000000000 message:{
   [junit4]   2> 	  "operation":"createcollection",
   [junit4]   2> 	  "fromApi":"true",
   [junit4]   2> 	  "name":"solrj_collection",
   [junit4]   2> 	  "replicationFactor":"2",
   [junit4]   2> 	  "collection.configName":"conf1",
   [junit4]   2> 	  "numShards":"2",
   [junit4]   2> 	  "router.field":"myOwnField",
   [junit4]   2> 	  "router.name":"compositeId"}
   [junit4]   2> 633556 T2462 oasc.OverseerCollectionProcessor.processMessage WARN OverseerCollectionProcessor.processMessage : createcollection , {
   [junit4]   2> 	  "operation":"createcollection",
   [junit4]   2> 	  "fromApi":"true",
   [junit4]   2> 	  "name":"solrj_collection",
   [junit4]   2> 	  "replicationFactor":"2",
   [junit4]   2> 	  "collection.configName":"conf1",
   [junit4]   2> 	  "numShards":"2",
   [junit4]   2> 	  "router.field":"myOwnField",
   [junit4]   2> 	  "router.name":"compositeId"}
   [junit4]   2> 633558 T2462 oasc.OverseerCollectionProcessor.createConfNode creating collections conf node /collections/solrj_collection 
   [junit4]   2> 633558 T2462 oascc.SolrZkClient.makePath makePath: /collections/solrj_collection
   [junit4]   2> 633562 T2400 oasc.DistributedQueue$LatchChildWatcher.process LatchChildWatcher fired on path: /overseer/queue state: SyncConnected type NodeChildrenChanged
   [junit4]   2> 633564 T2401 oascc.ZkStateReader.updateClusterState Updating cloud state from ZooKeeper... 
   [junit4]   2> 633565 T2401 oasc.Overseer$ClusterStateUpdater.buildCollection building a new collection: solrj_collection
   [junit4]   2> 633566 T2401 oasc.Overseer$ClusterStateUpdater.createCollection Create collection solrj_collection with shards [shard1, shard2]
   [junit4]   2> 633571 T2400 oasc.DistributedQueue$LatchChildWatcher.process LatchChildWatcher fired on path: /overseer/queue state: SyncConnected type NodeChildrenChanged
   [junit4]   2> 633572 T2418 oascc.ZkStateReader$2.process A cluster state change: WatchedEvent state:SyncConnected type:NodeDataChanged path:/clusterstate.json, has occurred - updating... (live nodes size: 5)
   [junit4]   2> 633572 T2446 oascc.ZkStateReader$2.process A cluster state change: WatchedEvent state:SyncConnected type:NodeDataChanged path:/clusterstate.json, has occurred - updating... (live nodes size: 5)
   [junit4]   2> 633572 T2405 oascc.ZkStateReader$2.process A cluster state change: WatchedEvent state:SyncConnected type:NodeDataChanged path:/clusterstate.json, has occurred - updating... (live nodes size: 5)
   [junit4]   2> 633572 T2460 oascc.ZkStateReader$2.process A cluster state change: WatchedEvent state:SyncConnected type:NodeDataChanged path:/clusterstate.json, has occurred - updating... (live nodes size: 5)
   [junit4]   2> 633572 T2432 oascc.ZkStateReader$2.process A cluster state change: WatchedEvent state:SyncConnected type:NodeDataChanged path:/clusterstate.json, has occurred - updating... (live nodes size: 5)
   [junit4]   2> 633572 T2400 oascc.ZkStateReader$2.process A cluster state change: WatchedEvent state:SyncConnected type:NodeDataChanged path:/clusterstate.json, has occurred - updating... (live nodes size: 5)
   [junit4]   2> 633662 T2462 oasc.OverseerCollectionProcessor.createCollection Creating SolrCores for new collection solrj_collection, shardNames [shard1, shard2] , replicationFactor : 2
   [junit4]   2> 633663 T2462 oasc.OverseerCollectionProcessor.createCollection Creating shard solrj_collection_shard1_replica1 as part of slice shard1 of collection solrj_collection on 127.0.0.1:36378__nn
   [junit4]   2> 633664 T2462 oasc.OverseerCollectionProcessor.createCollection Creating shard solrj_collection_shard1_replica2 as part of slice shard1 of collection solrj_collection on 127.0.0.1:57743__nn
   [junit4]   2> 633667 T2462 oasc.OverseerCollectionProcessor.createCollection Creating shard solrj_collection_shard2_replica1 as part of slice shard2 of collection solrj_collection on 127.0.0.1:50315__nn
   [junit4]   2> 633672 T2462 oasc.OverseerCollectionProcessor.createCollection Creating shard solrj_collection_shard2_replica2 as part of slice shard2 of collection solrj_collection on 127.0.0.1:48687__nn
   [junit4]   2> 633743 T2425 oasha.CoreAdminHandler.handleCreateAction core create command qt=/admin/cores&collection.configName=conf1&name=solrj_collection_shard1_replica1&action=CREATE&numShards=2&collection=solrj_collection&shard=shard1&wt=javabin&version=2
   [junit4]   2> 633746 T2425 oasc.ZkController.publish publishing core=solrj_collection_shard1_replica1 state=down collection=solrj_collection
   [junit4]   2> 633747 T2411 oasha.CoreAdminHandler.handleCreateAction core create command qt=/admin/cores&collection.configName=conf1&name=solrj_collection_shard2_replica1&action=CREATE&numShards=2&collection=solrj_collection&shard=shard2&wt=javabin&version=2
   [junit4]   2> 633747 T2393 oasha.CoreAdminHandler.handleCreateAction core create command qt=/admin/cores&collection.configName=conf1&name=solrj_collection_shard1_replica2&action=CREATE&numShards=2&collection=solrj_collection&shard=shard1&wt=javabin&version=2
   [junit4]   2> 633748 T2400 oasc.DistributedQueue$LatchChildWatcher.process LatchChildWatcher fired on path: /overseer/queue state: SyncConnected type NodeChildrenChanged
   [junit4]   2> 633748 T2425 oasc.ZkController.waitForCoreNodeName look for our core node name
   [junit4]   2> 633751 T2411 oasc.ZkController.publish publishing core=solrj_collection_shard2_replica1 state=down collection=solrj_collection
   [junit4]   2> 633751 T2393 oasc.ZkController.publish publishing core=solrj_collection_shard1_replica2 state=down collection=solrj_collection
   [junit4]   2> 633752 T2401 oascc.ZkStateReader.updateClusterState Updating cloud state from ZooKeeper... 
   [junit4]   2> 633752 T2411 oasc.ZkController.waitForCoreNodeName look for our core node name
   [junit4]   2> 633752 T2400 oasc.DistributedQueue$LatchChildWatcher.process LatchChildWatcher fired on path: /overseer/queue state: SyncConnected type NodeChildrenChanged
   [junit4]   2> 633753 T2393 oasc.ZkController.waitForCoreNodeName look for our core node name
   [junit4]   2> 633752 T2456 oasha.CoreAdminHandler.handleCreateAction core create command qt=/admin/cores&collection.configName=conf1&name=solrj_collection_shard2_replica2&action=CREATE&numShards=2&collection=solrj_collection&shard=shard2&wt=javabin&version=2
   [junit4]   2> 633753 T2401 oasc.Overseer$ClusterStateUpdater.updateState Update state numShards=2 message={
   [junit4]   2> 	  "operation":"state",
   [junit4]   2> 	  "state":"down",
   [junit4]   2> 	  "base_url":"https://127.0.0.1:36378/_nn",
   [junit4]   2> 	  "core":"solrj_collection_shard1_replica1",
   [junit4]   2> 	  "roles":null,
   [junit4]   2> 	  "node_name":"127.0.0.1:36378__nn",
   [junit4]   2> 	  "shard":"shard1",
   [junit4]   2> 	  "collection":"solrj_collection",
   [junit4]   2> 	  "numShards":"2",
   [junit4]   2> 	  "core_node_name":null}
   [junit4]   2> 633756 T2456 oasc.ZkController.publish publishing core=solrj_collection_shard2_replica2 state=down collection=solrj_collection
   [junit4]   2> 633757 T2400 oasc.DistributedQueue$LatchChildWatcher.process LatchChildWatcher fired on path: /overseer/queue state: SyncConnected type NodeChildrenChanged
   [junit4]   2> 633757 T2401 oasc.Overseer$ClusterStateUpdater.updateState Update state numShards=2 message={
   [junit4]   2> 	  "operation":"state",
   [junit4]   2> 	  "state":"down",
   [junit4]   2> 	  "base_url":"https://127.0.0.1:50315/_nn",
   [junit4]   2> 	  "core":"solrj_collection_shard2_replica1",
   [junit4]   2> 	  "roles":null,
   [junit4]   2> 	  "node_name":"127.0.0.1:50315__nn",
   [junit4]   2> 	  "shard":"shard2",
   [junit4]   2> 	  "collection":"solrj_collection",
   [junit4]   2> 	  "numShards":"2",
   [junit4]   2> 	  "core_node_name":null}
   [junit4]   2> 633758 T2456 oasc.ZkController.waitForCoreNodeName look for our core node name
   [junit4]   2> 633761 T2401 oasc.Overseer$ClusterStateUpdater.updateState Update state numShards=2 message={
   [junit4]   2> 	  "operation":"state",
   [junit4]   2> 	  "state":"down",
   [junit4]   2> 	  "base_url":"https://127.0.0.1:57743/_nn",
   [junit4]   2> 	  "core":"solrj_collection_shard1_replica2",
   [junit4]   2> 	  "roles":null,
   [junit4]   2> 	  "node_name":"127.0.0.1:57743__nn",
   [junit4]   2> 	  "shard":"shard1",
   [junit4]   2> 	  "collection":"solrj_collection",
   [junit4]   2> 	  "numShards":"2",
   [junit4]   2> 	  "core_node_name":null}
   [junit4]   2> 633764 T2400 oasc.DistributedQueue$LatchChildWatcher.process LatchChildWatcher fired on path: /overseer/queue state: SyncConnected type NodeChildrenChanged
   [junit4]   2> 633764 T2401 oasc.Overseer$ClusterStateUpdater.updateState Update state numShards=2 message={
   [junit4]   2> 	  "operation":"state",
   [junit4]   2> 	  "state":"down",
   [junit4]   2> 	  "base_url":"https://127.0.0.1:48687/_nn",
   [junit4]   2> 	  "core":"solrj_collection_shard2_replica2",
   [junit4]   2> 	  "roles":null,
   [junit4]   2> 	  "node_name":"127.0.0.1:48687__nn",
   [junit4]   2> 	  "shard":"shard2",
   [junit4]   2> 	  "collection":"solrj_collection",
   [junit4]   2> 	  "numShards":"2",
   [junit4]   2> 	  "core_node_name":null}
   [junit4]   2> 633767 T2400 oasc.DistributedQueue$LatchChildWatcher.process LatchChildWatcher fired on path: /overseer/queue state: SyncConnected type NodeChildrenChanged
   [junit4]   2> 633870 T2418 oascc.ZkStateReader$2.process A cluster state change: WatchedEvent state:SyncConnected type:NodeDataChanged path:/clusterstate.json, has occurred - updating... (live nodes size: 5)
   [junit4]   2> 633870 T2432 oascc.ZkStateReader$2.process A cluster state change: WatchedEvent state:SyncConnected type:NodeDataChanged path:/clusterstate.json, has occurred - updating... (live nodes size: 5)
   [junit4]   2> 633870 T2446 oascc.ZkStateReader$2.process A cluster state change: WatchedEvent state:SyncConnected type:NodeDataChanged path:/clusterstate.json, has occurred - updating... (live nodes size: 5)
   [junit4]   2> 633870 T2460 oascc.ZkStateReader$2.process A cluster state change: WatchedEvent state:SyncConnected type:NodeDataChanged path:/clusterstate.json, has occurred - updating... (live nodes size: 5)
   [junit4]   2> 633870 T2405 oascc.ZkStateReader$2.process A cluster state change: WatchedEvent state:SyncConnected type:NodeDataChanged path:/clusterstate.json, has occurred - updating... (live nodes size: 5)
   [junit4]   2> 633871 T2400 oascc.ZkStateReader$2.process A cluster state change: WatchedEvent state:SyncConnected type:NodeDataChanged path:/clusterstate.json, has occurred - updating... (live nodes size: 5)
   [junit4]   2> 634749 T2425 oasc.ZkController.waitForShardId waiting to find shard id in clusterstate for solrj_collection_shard1_replica1
   [junit4]   2> 634750 T2425 oasc.SolrXMLCoresLocator.doPersist Persisted core descriptions to /mnt/ssd/jenkins/workspace/Lucene-Solr-trunk-Linux/solr/build/solr-core/test/J1/./temp/solr.cloud.CollectionsAPIDistributedZkTest-836554BD8ACF5AE7-001/tempDir-004/solr.xml
   [junit4]   2> 634750 T2425 oasc.ZkController.createCollectionZkNode Check for collection zkNode:solrj_collection
   [junit4]   2> 634752 T2425 oasc.ZkController.createCollectionZkNode Collection zkNode exists
   [junit4]   2> 634752 T2425 oascc.ZkStateReader.readConfigName Load collection config from:/collections/solrj_collection
   [junit4]   2> 634753 T2411 oasc.ZkController.waitForShardId waiting to find shard id in clusterstate for solrj_collection_shard2_replica1
   [junit4]   2> 634754 T2425 oascc.ZkStateReader.readConfigName path=/collections/solrj_collection configName=conf1 specified config exists in ZooKeeper
   [junit4]   2> 634754 T2411 oasc.SolrXMLCoresLocator.doPersist Persisted core descriptions to /mnt/ssd/jenkins/workspace/Lucene-Solr-trunk-Linux/solr/build/solr-core/test/J1/./temp/solr.cloud.CollectionsAPIDistributedZkTest-836554BD8ACF5AE7-001/tempDir-003/solr.xml
   [junit4]   2> 634755 T2411 oasc.ZkController.createCollectionZkNode Check for collection zkNode:solrj_collection
   [junit4]   2> 634754 T2393 oasc.ZkController.waitForShardId waiting to find shard id in clusterstate for solrj_collection_shard1_replica2
   [junit4]   2> 634754 T2425 oasc.SolrResourceLoader.<init> new SolrResourceLoader for directory: '/mnt/ssd/jenkins/workspace/Lucene-Solr-trunk-Linux/solr/build/solr-core/test/J1/./temp/solr.cloud.CollectionsAPIDistributedZkTest-836554BD8ACF5AE7-001/tempDir-004/solrj_collection_shard1_replica1/'
   [junit4]   2> 634756 T2393 oasc.SolrXMLCoresLocator.doPersist Persisted core descriptions to /mnt/ssd/jenkins/workspace/Lucene-Solr-trunk-Linux/solr/build/solr-core/test/J1/./temp/solr.cloud.CollectionsAPIDistributedZkTest-836554BD8ACF5AE7-001/tempDir-002/solr.xml
   [junit4]   2> 634757 T2393 oasc.ZkController.createCollectionZkNode Check for collection zkNode:solrj_collection
   [junit4]   2> 634756 T2411 oasc.ZkController.createCollectionZkNode Collection zkNode exists
   [junit4]   2> 634758 T2393 oasc.ZkController.createCollectionZkNode Collection zkNode exists
   [junit4]   2> 634759 T2456 oasc.ZkController.waitForShardId waiting to find shard id in clusterstate for solrj_collection_shard2_replica2
   [junit4]   2> 634758 T2411 oascc.ZkStateReader.readConfigName Load collection config from:/collections/solrj_collection
   [junit4]   2> 634760 T2456 oasc.SolrXMLCoresLocator.doPersist Persisted core descriptions to /mnt/ssd/jenkins/workspace/Lucene-Solr-trunk-Linux/solr/build/solr-core/test/J1/./temp/solr.cloud.CollectionsAPIDistributedZkTest-836554BD8ACF5AE7-001/tempDir-006/solr.xml
   [junit4]   2> 634760 T2456 oasc.ZkController.createCollectionZkNode Check for collection zkNode:solrj_collection
   [junit4]   2> 634759 T2393 oascc.ZkStateReader.readConfigName Load collection config from:/collections/solrj_collection
   [junit4]   2> 634761 T2456 oasc.ZkController.createCollectionZkNode Collection zkNode exists
   [junit4]   2> 634760 T2411 oascc.ZkStateReader.readConfigName path=/collections/solrj_collection configName=conf1 specified config exists in ZooKeeper
   [junit4]   2> 634762 T2393 oascc.ZkStateReader.readConfigName path=/collections/solrj_collection configName=conf1 specified config exists in ZooKeeper
   [junit4]   2> 634762 T2456 oascc.ZkStateReader.readConfigName Load collection config from:/collections/solrj_collection
   [junit4]   2> 634763 T2393 oasc.SolrResourceLoader.<init> new SolrResourceLoader for directory: '/mnt/ssd/jenkins/workspace/Lucene-Solr-trunk-Linux/solr/build/solr-core/test/J1/./temp/solr.cloud.CollectionsAPIDistributedZkTest-836554BD8ACF5AE7-001/tempDir-002/solrj_collection_shard1_replica2/'
   [junit4]   2> 634764 T2456 oascc.ZkStateReader.readConfigName path=/collections/solrj_collection configName=conf1 specified config exists in ZooKeeper
   [junit4]   2> 634765 T2456 oasc.SolrResourceLoader.<init> new SolrResourceLoader for directory: '/mnt/ssd/jenkins/workspace/Lucene-Solr-trunk-Linux/solr/build/solr-core/test/J1/./temp/solr.cloud.CollectionsAPIDistributedZkTest-836554BD8ACF5AE7-001/tempDir-006/solrj_collection_shard2_replica2/'
   [junit4]   2> 634762 T2411 oasc.SolrResourceLoader.<init> new SolrResourceLoader for directory: '/mnt/ssd/jenkins/workspace/Lucene-Solr-trunk-Linux/solr/build/solr-core/test/J1/./temp/solr.cloud.CollectionsAPIDistributedZkTest-836554BD8ACF5AE7-001/tempDir-003/solrj_collection_shard2_replica1/'
   [junit4]   2> 634805 T2425 oasc.SolrConfig.<init> Using Lucene MatchVersion: LUCENE_5_0
   [junit4]   2> 634808 T2393 oasc.SolrConfig.<init> Using Lucene MatchVersion: LUCENE_5_0
   [junit4]   2> 634831 T2456 oasc.SolrConfig.<init> Using Lucene MatchVersion: LUCENE_5_0
   [junit4]   2> 634839 T2425 oasc.SolrConfig.<init> Loaded SolrConfig: solrconfig.xml
   [junit4]   2> 634848 T2425 oass.IndexSchema.readSchema Reading Solr Schema from schema.xml
   [junit4]   2> 634854 T2393 oasc.SolrConfig.<init> Loaded SolrConfig: solrconfig.xml
   [junit4]   2> 634854 T2411 oasc.SolrConfig.<init> Using Lucene MatchVersion: LUCENE_5_0
   [junit4]   2> 634855 T2456 oasc.SolrConfig.<init> Loaded SolrConfig: solrconfig.xml
   [junit4]   2> 634856 T2393 oass.IndexSchema.readSchema Reading Solr Schema from schema.xml
   [junit4]   2> 634857 T2456 oass.IndexSchema.readSchema Reading Solr Schema from schema.xml
   [junit4]   2> 634858 T2425 oass.IndexSchema.readSchema [solrj_collection_shard1_replica1] Schema name=test
   [junit4]   2> 634871 T2411 oasc.SolrConfig.<init> Loaded SolrConfig: solrconfig.xml
   [junit4]   2> 634872 T2411 oass.IndexSchema.readSchema Reading Solr Schema from schema.xml
   [junit4]   2> 634875 T2456 oass.IndexSchema.readSchema [solrj_collection_shard2_replica2] Schema name=test
   [junit4]   2> 634876 T2393 oass.IndexSchema.readSchema [solrj_collection_shard1_replica2] Schema name=test
   [junit4]   2> 634881 T2411 oass.IndexSchema.readSchema [solrj_collection_shard2_replica1] Schema name=test
   [junit4]   2> 635320 T2456 oass.OpenExchangeRatesOrgProvider.init Initialized with rates=open-exchange-rates.json, refreshInterval=1440.
   [junit4]   2> 635326 T2456 oass.IndexSchema.readSchema default search field in schema is text
   [junit4]   2> 635327 T2425 oass.OpenExchangeRatesOrgProvider.init Initialized with rates=open-exchange-rates.json, refreshInterval=1440.
   [junit4]   2> 635329 T2456 oass.IndexSchema.readSchema unique key field: id
   [junit4]   2> 635338 T2425 oass.IndexSchema.readSchema default search field in schema is text
   [junit4]   2> 635343 T2456 oass.FileExchangeRateProvider.reload Reloading exchange rates from file currency.xml
   [junit4]   2> 635344 T2425 oass.IndexSchema.readSchema unique key field: id
   [junit4]   2> 635347 T2456 oass.FileExchangeRateProvider.reload Reloading exchange rates from file currency.xml
   [junit4]   2> 635350 T2456 oass.OpenExchangeRatesOrgProvider.reload Reloading exchange rates from open-exchange-rates.json
   [junit4]   2> 635351 T2456 oass.OpenExchangeRatesOrgProvider$OpenExchangeRates.<init> WARN Unknown key IMPORTANT NOTE
   [junit4]   2> 635352 T2456 oass.OpenExchangeRatesOrgProvider$OpenExchangeRates.<init> WARN Expected key, got STRING
   [junit4]   2> 635353 T2456 oass.OpenExchangeRatesOrgProvider.reload Reloading exchange rates from open-exchange-rates.json
   [junit4]   2> 635353 T2456 oass.OpenExchangeRatesOrgProvider$OpenExchangeRates.<init> WARN Unknown key IMPORTANT NOTE
   [junit4]   2> 635354 T2456 oass.OpenExchangeRatesOrgProvider$OpenExchangeRates.<init> WARN Expected key, got STRING
   [junit4]   2> 635354 T2456 oasc.CoreContainer.create Creating SolrCore 'solrj_collection_shard2_replica2' using configuration from collection solrj_collection
   [junit4]   2> 635355 T2456 oasc.SolrCore.initDirectoryFactory org.apache.solr.core.MockDirectoryFactory
   [junit4]   2> 635355 T2456 oasc.SolrCore.<init> [solrj_collection_shard2_replica2] Opening new SolrCore at /mnt/ssd/jenkins/workspace/Lucene-Solr-trunk-Linux/solr/build/solr-core/test/J1/./temp/solr.cloud.CollectionsAPIDistributedZkTest-836554BD8ACF5AE7-001/tempDir-006/solrj_collection_shard2_replica2/, dataDir=/mnt/ssd/jenkins/workspace/Lucene-Solr-trunk-Linux/solr/build/solr-core/test/J1/./temp/solr.cloud.CollectionsAPIDistributedZkTest-836554BD8ACF5AE7-001/tempDir-006/solrj_collection_shard2_replica2/data/
   [junit4]   2> 635355 T2456 oasc.JmxMonitoredMap.<init> JMX monitoring is enabled. Adding Solr mbeans to JMX Server: com.sun.jmx.mbeanserver.JmxMBeanServer@74582caf
   [junit4]   2> 635357 T2456 oasc.CachingDirectoryFactory.get return new directory for /mnt/ssd/jenkins/workspace/Lucene-Solr-trunk-Linux/solr/build/solr-core/test/J1/./temp/solr.cloud.CollectionsAPIDistributedZkTest-836554BD8ACF5AE7-001/tempDir-006/solrj_collection_shard2_replica2/data
   [junit4]   2> 635357 T2456 oasc.SolrCore.getNewIndexDir New index directory detected: old=null new=/mnt/ssd/jenkins/workspace/Lucene-Solr-trunk-Linux/solr/build/solr-core/test/J1/./temp/solr.cloud.CollectionsAPIDistributedZkTest-836554BD8ACF5AE7-001/tempDir-006/solrj_collection_shard2_replica2/data/index/
   [junit4]   2> 635357 T2456 oasc.SolrCore.initIndex WARN [solrj_collection_shard2_replica2] Solr index directory '/mnt/ssd/jenkins/workspace/Lucene-Solr-trunk-Linux/solr/build/solr-core/test/J1/./temp/solr.cloud.CollectionsAPIDistributedZkTest-836554BD8ACF5AE7-001/tempDir-006/solrj_collection_shard2_replica2/data/index' doesn't exist. Creating new index...
   [junit4]   2> 635358 T2456 oasc.CachingDirectoryFactory.get return new directory for /mnt/ssd/jenkins/workspace/Lucene-Solr-trunk-Linux/solr/build/solr-core/test/J1/./temp/solr.cloud.CollectionsAPIDistributedZkTest-836554BD8ACF5AE7-001/tempDir-006/solrj_collection_shard2_replica2/data/index
   [junit4]   2> 635358 T2425 oass.FileExchangeRateProvider.reload Reloading exchange rates from file currency.xml
   [junit4]   2> 635358 T2456 oasu.RandomMergePolicy.<init> RandomMergePolicy wrapping class org.apache.lucene.index.TieredMergePolicy: [TieredMergePolicy: maxMergeAtOnce=29, maxMergeAtOnceExplicit=17, maxMergedSegmentMB=7.37890625, floorSegmentMB=0.80078125, forceMergeDeletesPctAllowed=18.19352496383055, segmentsPerTier=39.0, maxCFSSegmentSizeMB=8.796093022207999E12, noCFSRatio=0.0
   [junit4]   2> 635360 T2411 oass.OpenExchangeRatesOrgProvider.init Initialized with rates=open-exchange-rates.json, refreshInterval=1440.
   [junit4]   2> 635360 T2456 oasc.SolrDeletionPolicy.onCommit SolrDeletionPolicy.onCommit: commits: num=1
   [junit4]   2> 		commit{dir=MockDirectoryWrapper(RAMDirectory@2fd540c lockFactory=org.apache.lucene.store.SingleInstanceLockFactory@3fe84a),segFN=segments_1,generation=1}
   [junit4]   2> 635361 T2456 oasc.SolrDeletionPolicy.updateCommits newest commit generation = 1
   [junit4]   2> 635364 T2456 oasup.UpdateRequestProcessorChain.init creating updateRequestProcessorChain "nodistrib"
   [junit4]   2> 635364 T2456 oasup.UpdateRequestProcessorChain.init creating updateRequestProcessorChain "dedupe"
   [junit4]   2> 635364 T2456 oasup.UpdateRequestProcessorChain.init inserting DistributedUpdateProcessorFactory into updateRequestProcessorChain "dedupe"
   [junit4]   2> 635365 T2456 oasup.UpdateRequestProcessorChain.init creating updateRequestProcessorChain "stored_sig"
   [junit4]   2> 635365 T2456 oasup.UpdateRequestProcessorChain.init inserting DistributedUpdateProcessorFactory into updateRequestProcessorChain "stored_sig"
   [junit4]   2> 635365 T2456 oasup.UpdateRequestProcessorChain.init creating updateRequestProcessorChain "distrib-dup-test-chain-explicit"
   [junit4]   2> 635365 T2456 oasup.UpdateRequestProcessorChain.init creating updateRequestProcessorChain "distrib-dup-test-chain-implicit"
   [junit4]   2> 635366 T2456 oasup.UpdateRequestProcessorChain.init inserting DistributedUpdateProcessorFactory into updateRequestProcessorChain "distrib-dup-test-chain-implicit"
   [junit4]   2> 635366 T2411 oass.IndexSchema.readSchema default search field in schema is text
   [junit4]   2> 635366 T2456 oasc.SolrCore.loadUpdateProcessorChains no updateRequestProcessorChain defined as default, creating implicit default
   [junit4]   2> 635367 T2456 oasc.RequestHandlers.initHandlersFromConfig created standard: solr.StandardRequestHandler
   [junit4]   2> 635367 T2456 oasc.RequestHandlers.initHandlersFromConfig created /get: solr.RealTimeGetHandler
   [junit4]   2> 635367 T2456 oasc.RequestHandlers.initHandlersFromConfig adding lazy requestHandler: solr.ReplicationHandler
   [junit4]   2> 635368 T2456 oasc.RequestHandlers.initHandlersFromConfig created /replication: solr.ReplicationHandler
   [junit4]   2> 635368 T2456 oasc.RequestHandlers.initHandlersFromConfig created /update: solr.UpdateRequestHandler
   [junit4]   2> 635368 T2456 oasc.RequestHandlers.initHandlersFromConfig created /admin/: org.apache.solr.handler.admin.AdminHandlers
   [junit4]   2> 635369 T2456 oasc.RequestHandlers.initHandlersFromConfig created /admin/file: solr.admin.ShowFileRequestHandler
   [junit4]   2> 635369 T2456 oasc.RequestHandlers.initHandlersFromConfig created /admin/fileedit: solr.admin.EditFileRequestHandler
   [junit4]   2> 635370 T2425 oass.FileExchangeRateProvider.reload Reloading exchange rates from file currency.xml
   [junit4]   2> 635368 T2411 oass.IndexSchema.readSchema unique key field: id
   [junit4]   2> 635376 T2393 oass.OpenExchangeRatesOrgProvider.init Initialized with rates=open-exchange-rates.json, refreshInterval=1440.
   [junit4]   2> 635377 T2425 oass.OpenExchangeRatesOrgProvider.reload Reloading exchange rates from open-exchange-rates.json
   [junit4]   2> 635378 T2456 oashl.XMLLoader.init xsltCacheLifetimeSeconds=60
   [junit4]   2> 635378 T2425 oass.OpenExchangeRatesOrgProvider$OpenExchangeRates.<init> WARN Unknown key IMPORTANT NOTE
   [junit4]   2> 635379 T2425 oass.OpenExchangeRatesOrgProvider$OpenExchangeRates.<init> WARN Expected key, got STRING
   [junit4]   2> 635379 T2425 oass.OpenExchangeRatesOrgProvider.reload Reloading exchange rates from open-exchange-rates.json
   [junit4]   2> 635380 T2425 oass.OpenExchangeRatesOrgProvider$OpenExchangeRates.<init> WARN Unknown key IMPORTANT NOTE
   [junit4]   2> 635380 T2425 oass.OpenExchangeRatesOrgProvider$OpenExchangeRates.<init> WARN Expected key, got STRING
   [junit4]   2> 635380 T2456 oasu.CommitTracker.<init> Hard AutoCommit: disabled
   [junit4]   2> 635381 T2425 oasc.CoreContainer.create Creating SolrCore 'solrj_collection_shard1_replica1' using configuration from collection solrj_collection
   [junit4]   2> 635381 T2456 oasu.CommitTracker.<init> Soft AutoCommit: disabled
   [junit4]   2> 635381 T2393 oass.IndexSchema.readSchema default search field in schema is text
   [junit4]   2> 635381 T2425 oasc.SolrCore.initDirectoryFactory org.apache.solr.core.MockDirectoryFactory
   [junit4]   2> 635382 T2425 oasc.SolrCore.<init> [solrj_collection_shard1_replica1] Opening new SolrCore at /mnt/ssd/jenkins/workspace/Lucene-Solr-trunk-Linux/solr/build/solr-core/test/J1/./temp/solr.cloud.CollectionsAPIDistributedZkTest-836554BD8ACF5AE7-001/tempDir-004/solrj_collection_shard1_replica1/, dataDir=/mnt/ssd/jenkins/workspace/Lucene-Solr-trunk-Linux/solr/build/solr-core/test/J1/./temp/solr.cloud.CollectionsAPIDistributedZkTest-836554BD8ACF5AE7-001/tempDir-004/solrj_collection_shard1_replica1/data/
   [junit4]   2> 635382 T2425 oasc.JmxMonitoredMap.<init> JMX monitoring is enabled. Adding Solr mbeans to JMX Server: com.sun.jmx.mbeanserver.JmxMBeanServer@74582caf
   [junit4]   2> 635382 T2456 oasu.RandomMergePolicy.<init> RandomMergePolicy wrapping class org.apache.lucene.index.TieredMergePolicy: [TieredMergePolicy: maxMergeAtOnce=32, maxMergeAtOnceExplicit=10, maxMergedSegmentMB=87.080078125, floorSegmentMB=2.0185546875, forceMergeDeletesPctAllowed=28.253189386805325, segmentsPerTier=47.0, maxCFSSegmentSizeMB=8.796093022207999E12, noCFSRatio=0.8686149343378382
   [junit4]   2> 635383 T2393 oass.IndexSchema.readSchema unique key field: id
   [junit4]   2> 635384 T2425 oasc.CachingDirectoryFactory.get return new directory for /mnt/ssd/jenkins/workspace/Lucene-Solr-trunk-Linux/solr/build/solr-core/test/J1/./temp/solr.cloud.CollectionsAPIDistributedZkTest-836554BD8ACF5AE7-001/tempDir-004/solrj_collection_shard1_replica1/data
   [junit4]   2> 635384 T2425 oasc.SolrCore.getNewIndexDir New index directory detected: old=null new=/mnt/ssd/jenkins/workspace/Lucene-Solr-trunk-Linux/solr/build/solr-core/test/J1/./temp/solr.cloud.CollectionsAPIDistributedZkTest-836554BD8ACF5AE7-001/tempDir-004/solrj_collection_shard1_replica1/data/index/
   [junit4]   2> 635385 T2425 oasc.SolrCore.initIndex WARN [solrj_collection_shard1_replica1] Solr index directory '/mnt/ssd/jenkins/workspace/Lucene-Solr-trunk-Linux/solr/build/solr-core/test/J1/./temp/solr.cloud.CollectionsAPIDistributedZkTest-836554BD8ACF5AE7-001/tempDir-004/solrj_collection_shard1_replica1/data/index' doesn't exist. Creating new index...
   [junit4]   2> 635385 T2425 oasc.CachingDirectoryFactory.get return new directory for /mnt/ssd/jenkins/workspace/Lucene-Solr-trunk-Linux/solr/build/solr-core/test/J1/./temp/solr.cloud.CollectionsAPIDistributedZkTest-836554BD8ACF5AE7-001/tempDir-004/solrj_collection_shard1_replica1/data/index
   [junit4]   2> 635385 T2425 oasu.RandomMergePolicy.<init> RandomMergePolicy wrapping class org.apache.lucene.index.TieredMergePolicy: [TieredMergePolicy: maxMergeAtOnce=29, maxMergeAtOnceExplicit=17, maxMergedSegmentMB=7.37890625, floorSegmentMB=0.80078125, forceMergeDeletesPctAllowed=18.19352496383055, segmentsPerTier=39.0, maxCFSSegmentSizeMB=8.796093022207999E12, noCFSRatio=0.0
   [junit4]   2> 635386 T2456 oasc.SolrDeletionPolicy.onInit SolrDeletionPolicy.onInit: commits: num=1
   [junit4]   2> 		commit{dir=MockDirectoryWrapper(RAMDirectory@2fd540c lockFactory=org.apache.lucene.store.SingleInstanceLockFactory@3fe84a),segFN=segments_1,generation=1}
   [junit4]   2> 635386 T2456 oasc.SolrDeletionPolicy.updateCommits newest commit generation = 1
   [junit4]   2> 635386 T2456 oass.SolrIndexSearcher.<init> Opening Searcher@4f49685[solrj_collection_shard2_replica2] main
   [junit4]   2> 635387 T2456 oascc.ZkStateReader.readConfigName Load collection config from:/collections/solrj_collection
   [junit4]   2> 635387 T2411 oass.FileExchangeRateProvider.reload Reloading exchange rates from file currency.xml
   [junit4]   2> 635387 T2456 oascc.ZkStateReader.readConfigName path=/collections/solrj_collection configName=conf1 specified config exists in ZooKeeper
   [junit4]   2> 635387 T2425 oasc.SolrDeletionPolicy.onCommit SolrDeletionPolicy.onCommit: commits: num=1
   [junit4]   2> 		commit{dir=MockDirectoryWrapper(RAMDirectory@e993e36 lockFactory=org.apache.lucene.store.SingleInstanceLockFactory@323d141b),segFN=segments_1,generation=1}
   [junit4]   2> 635388 T2425 oasc.SolrDeletionPolicy.updateCommits newest commit generation = 1
   [junit4]   2> 635388 T2456 oasr.ManagedResourceStorage.newStorageIO Setting up ZooKeeper-based storage for the RestManager with znodeBase: /configs/conf1
   [junit4]   2> 635389 T2456 oasr.ManagedResourceStorage$ZooKeeperStorageIO.configure Configured ZooKeeperStorageIO with znodeBase: /configs/conf1
   [junit4]   2> 635389 T2456 oasr.RestManager.init Initializing RestManager with initArgs: {}
   [junit4]   2> 635390 T2456 oasr.ManagedResourceStorage.load Reading _rest_managed.json using ZooKeeperStorageIO:path=/configs/conf1
   [junit4]   2> 635391 T2456 oasr.ManagedResourceStorage$ZooKeeperStorageIO.openInputStream No data found for znode /configs/conf1/_rest_managed.json
   [junit4]   2> 635392 T2456 oasr.ManagedResourceStorage.load Loaded null at path _rest_managed.json using ZooKeeperStorageIO:path=/configs/conf1
   [junit4]   2> 635392 T2456 oasr.ManagedResource.notifyObserversDuringInit WARN No registered observers for /rest/managed
   [junit4]   2> 635392 T2456 oasr.RestManager.init Initializing 0 registered ManagedResources
   [junit4]   2> 635394 T2467 oasc.SolrCore.registerSearcher [solrj_collection_shard2_replica2] Registered new searcher Searcher@4f49685[solrj_collection_shard2_replica2] main{UninvertingDirectoryReader()}
   [junit4]   2> 635395 T2393 oass.FileExchangeRateProvider.reload Reloading exchange rates from file currency.xml
   [junit4]   2> 635390 T2411 oass.FileExchangeRateProvider.reload Reloading exchange rates from file currency.xml
   [junit4]   2> 635395 T2456 oasc.CoreContainer.registerCore registering core: solrj_collection_shard2_replica2
   [junit4]   2> 635392 T2425 oasup.UpdateRequestProcessorChain.init creating updateRequestProcessorChain "nodistrib"
   [junit4]   2> 635396 T2456 oasc.ZkController.register Register replica - core:solrj_collection_shard2_replica2 address:https://127.0.0.1:48687/_nn collection:solrj_collection shard:shard2
   [junit4]   2> 635397 T2425 oasup.UpdateRequestProcessorChain.init creating updateRequestProcessorChain "dedupe"
   [junit4]   2> 635397 T2425 oasup.UpdateRequestProcessorChain.init inserting DistributedUpdateProcessorFactory into updateRequestProcessorChain "dedupe"
   [junit4]   2> 635398 T2425 oasup.UpdateRequestProcessorChain.init creating updateRequestProcessorChain "stored_sig"
   [junit4]   2> 635398 T2456 oascc.SolrZkClient.makePath makePath: /collections/solrj_collection/leader_elect/shard2/election
   [junit4]   2> 635398 T2411 oass.OpenExchangeRatesOrgProvider.reload Reloading exchange rates from open-exchange-rates.json
   [junit4]   2> 635398 T2393 oass.FileExchangeRateProvider.reload Reloading exchange rates from file currency.xml
   [junit4]   2> 635398 T2425 oasup.UpdateRequestProcessorChain.init inserting DistributedUpdateProcessorFactory into updateRequestProcessorChain "stored_sig"
   [junit4]   2> 635399 T2425 oasup.UpdateRequestProcessorChain.init creating updateRequestProcessorChain "distrib-dup-test-chain-explicit"
   [junit4]   2> 635400 T2425 oasup.UpdateRequestProcessorChain.init creating updateRequestProcessorChain "distrib-dup-test-chain-implicit"
   [junit4]   2> 635400 T2425 oasup.UpdateRequestProcessorChain.init inserting DistributedUpdateProcessorFactory into updateRequestProcessorChain "distrib-dup-test-chain-implicit"
   [junit4]   2> 635400 T2425 oasc.SolrCore.loadUpdateProcessorChains no updateRequestProcessorChain defined as default, creating implicit default
   [junit4]   2> 635401 T2425 oasc.RequestHandlers.initHandlersFromConfig created standard: solr.StandardRequestHandler
   [junit4]   2> 635401 T2425 oasc.RequestHandlers.initHandlersFromConfig created /get: solr.RealTimeGetHandler
   [junit4]   2> 635401 T2425 oasc.RequestHandlers.initHandlersFromConfig adding lazy requestHandler: solr.ReplicationHandler
   [junit4]   2> 635402 T2425 oasc.RequestHandlers.initHandlersFromConfig created /replication: solr.ReplicationHandler
   [junit4]   2> 635402 T2425 oasc.RequestHandlers.initHandlersFromConfig created /update: solr.UpdateRequestHandler
   [junit4]   2> 635402 T2425 oasc.RequestHandlers.initHandlersFromConfig created /admin/: org.apache.solr.handler.admin.AdminHandlers
   [junit4]   2> 635401 T2411 oass.OpenExchangeRatesOrgProvider$OpenExchangeRates.<init> WARN Unknown key IMPORTANT NOTE
   [junit4]   2> 635403 T2411 oass.OpenExchangeRatesOrgProvider$OpenExchangeRates.<init> WARN Expected key, got STRING
   [junit4]   2> 635403 T2425 oasc.RequestHandlers.initHandlersFromConfig created /admin/file: solr.admin.ShowFileRequestHandler
   [junit4]   2> 635404 T2425 oasc.RequestHandlers.initHandlersFromConfig created /admin/fileedit: solr.admin.EditFileRequestHandler
   [junit4]   2> 635404 T2393 oass.OpenExchangeRatesOrgProvider.reload Reloading exchange rates from open-exchange-rates.json
   [junit4]   2> 635403 T2411 oass.OpenExchangeRatesOrgProvider.reload Reloading exchange rates from open-exchange-rates.json
   [junit4]   2> 635405 T2425 oashl.XMLLoader.init xsltCacheLifetimeSeconds=60
   [junit4]   2> 635405 T2393 oass.OpenExchangeRatesOrgProvider$OpenExchangeRates.<init> WARN Unknown key IMPORTANT NOTE
   [junit4]   2> 635406 T2393 oass.OpenExchangeRatesOrgProvider$OpenExchangeRates.<init> WARN Expected key, got STRING
   [junit4]   2> 635406 T2393 oass.OpenExchangeRatesOrgProvider.reload Reloading exchange rates from open-exchange-rates.json
   [junit4]   2> 635405 T2456 oasc.ShardLeaderElectionContext.runLeaderProcess Running the leader process for shard shard2
   [junit4]   2> 635406 T2411 oass.OpenExchangeRatesOrgProvider$OpenExchangeRates.<init> WARN Unknown key IMPORTANT NOTE
   [junit4]   2> 635407 T2393 oass.OpenExchangeRatesOrgProvider$OpenExchangeRates.<init> WARN Unknown key IMPORTANT NOTE
   [junit4]   2> 635408 T2393 oass.OpenExchangeRatesOrgProvider$OpenExchangeRates.<init> WARN Expected key, got STRING
   [junit4]   2> 635407 T2411 oass.OpenExchangeRatesOrgProvider$OpenExchangeRates.<init> WARN Expected key, got STRING
   [junit4]   2> 635407 T2425 oasu.CommitTracker.<init> Hard AutoCommit: disabled
   [junit4]   2> 635409 T2425 oasu.CommitTracker.<init> Soft AutoCommit: disabled
   [junit4]   2> 635409 T2411 oasc.CoreContainer.create Creating SolrCore 'solrj_collection_shard2_replica1' using configuration from collection solrj_collection
   [junit4]   2> 635410 T2456 oasc.ShardLeaderElectionContext.waitForReplicasToComeUp Waiting until we see more replicas up for shard shard2: total=2 found=1 timeoutin=8.1974216E14ms
   [junit4]   2> 635408 T2393 oasc.CoreContainer.create Creating SolrCore 'solrj_collection_shard1_replica2' using configuration from collection solrj_collection
   [junit4]   2> 635410 T2456 oasc.ShardLeaderElectionContext.waitForReplicasToComeUp Was waiting for replicas to come up, but they are taking too long - assuming they won't come back till later
   [junit4]   2> 635410 T2456 oasc.ShardLeaderElectionContext.runLeaderProcess I may be the new leader - try and sync
   [junit4]   2> 635410 T2411 oasc.SolrCore.initDirectoryFactory org.apache.solr.core.MockDirectoryFactory
   [junit4]   2> 635409 T2425 oasu.RandomMergePolicy.<init> RandomMergePolicy wrapping class org.apache.lucene.index.TieredMergePolicy: [TieredMergePolicy: maxMergeAtOnce=32, maxMergeAtOnceExplicit=10, maxMergedSegmentMB=87.080078125, floorSegmentMB=2.0185546875, forceMergeDeletesPctAllowed=28.253189386805325, segmentsPerTier=47.0, maxCFSSegmentSizeMB=8.796093022207999E12, noCFSRatio=0.8686149343378382
   [junit4]   2> 635409 T2400 oasc.DistributedQueue$LatchChildWatcher.process LatchChildWatcher fired on path: /overseer/queue state: SyncConnected type NodeChildrenChanged
   [junit4]   2> 635411 T2411 oasc.SolrCore.<init> [solrj_collection_shard2_replica1] Opening new SolrCore at /mnt/ssd/jenkins/workspace/Lucene-Solr-trunk-Linux/solr/build/solr-core/test/J1/./temp/solr.cloud.CollectionsAPIDistributedZkTest-836554BD8ACF5AE7-001/tempDir-003/solrj_collection_shard2_replica1/, dataDir=/mnt/ssd/jenkins/workspace/Lucene-Solr-trunk-Linux/solr/build/solr-core/test/J1/./temp/solr.cloud.CollectionsAPIDistributedZkTest-836554BD8ACF5AE7-001/tempDir-003/solrj_collection_shard2_replica1/data/
   [junit4]   2> ASYNC  NEW_CORE C1305 name=solrj_collection_shard2_replica2 org.apache.solr.core.SolrCore@2762900f url=https://127.0.0.1:48687/_nn/solrj_collection_shard2_replica2 node=127.0.0.1:48687__nn C1305_STATE=coll:solrj_collection core:solrj_collection_shard2_replica2 props:{state=down, base_url=https://127.0.0.1:48687/_nn, core=solrj_collection_shard2_replica2, node_name=127.0.0.1:48687__nn}
   [junit4]   2> 635411 T2456 C1305 P48687 oasc.SyncStrategy.sync Sync replicas to https://127.0.0.1:48687/_nn/solrj_collection_shard2_replica2/
   [junit4]   2> 635410 T2393 oasc.SolrCore.initDirectoryFactory org.apache.solr.core.MockDirectoryFactory
   [junit4]   2> 635412 T2456 C1305 P48687 oasu.PeerSync.sync PeerSync: core=solrj_collection_shard2_replica2 url=https://127.0.0.1:48687/_nn START replicas=[https://127.0.0.1:50315/_nn/solrj_collection_shard2_replica1/] nUpdates=100
   [junit4]   2> 635412 T2411 oasc.JmxMonitoredMap.<init> JMX monitoring is enabled. Adding Solr mbeans to JMX Server: com.sun.jmx.mbeanserver.JmxMBeanServer@74582caf
   [junit4]   2> 635411 T2425 oasc.SolrDeletionPolicy.onInit SolrDeletionPolicy.onInit: commits: num=1
   [junit4]   2> 		commit{dir=MockDirectoryWrapper(RAMDirectory@e993e36 lockFactory=org.apache.lucene.store.SingleInstanceLockFactory@323d141b),segFN=segments_1,generation=1}
   [junit4]   2> 635411 T2400 oasc.DistributedQueue$LatchChildWatcher.process LatchChildWatcher fired on path: /overseer/queue state: SyncConnected type NodeChildrenChanged
   [junit4]   2> 635414 T2411 oasc.CachingDirectoryFactory.get return new directory for /mnt/ssd/jenkins/workspace/Lucene-Solr-trunk-Linux/solr/build/solr-core/test/J1/./temp/solr.cloud.CollectionsAPIDistributedZkTest-836554BD8ACF5AE7-001/tempDir-003/solrj_collection_shard2_replica1/data
   [junit4]   2> 635413 T2456 C1305 P4

[...truncated too long message...]

d.run WARN Session 0x146293f7a700011 for server null, unexpected error, closing socket connection and attempting reconnect java.net.ConnectException: Connection refused
   [junit4]   2> 	at sun.nio.ch.SocketChannelImpl.checkConnect(Native Method)
   [junit4]   2> 	at sun.nio.ch.SocketChannelImpl.finishConnect(SocketChannelImpl.java:712)
   [junit4]   2> 	at org.apache.zookeeper.ClientCnxnSocketNIO.doTransport(ClientCnxnSocketNIO.java:361)
   [junit4]   2> 	at org.apache.zookeeper.ClientCnxn$SendThread.run(ClientCnxn.java:1081)
   [junit4]   2> 
   [junit4]   2> 765805 T2532 oaz.ClientCnxn$SendThread.run WARN Unexpected exception java.lang.InterruptedException: sleep interrupted
   [junit4]   2> 	at java.lang.Thread.sleep(Native Method)
   [junit4]   2> 	at org.apache.zookeeper.ClientCnxn$SendThread.run(ClientCnxn.java:994)
   [junit4]   2> 
   [junit4]   2> 766305 T2532 oazc.StaticHostProvider.next WARN Unexpected exception java.lang.InterruptedException: sleep interrupted
   [junit4]   2> 	at java.lang.Thread.sleep(Native Method)
   [junit4]   2> 	at org.apache.zookeeper.client.StaticHostProvider.next(StaticHostProvider.java:101)
   [junit4]   2> 	at org.apache.zookeeper.ClientCnxn$SendThread.startConnect(ClientCnxn.java:940)
   [junit4]   2> 	at org.apache.zookeeper.ClientCnxn$SendThread.run(ClientCnxn.java:1003)
   [junit4]   2> 
   [junit4]   2> 766306 T2532 oaz.ClientCnxn$SendThread.run WARN Session 0x146293f7a700011 for server null, unexpected error, closing socket connection and attempting reconnect java.net.ConnectException: Connection refused
   [junit4]   2> 	at sun.nio.ch.SocketChannelImpl.checkConnect(Native Method)
   [junit4]   2> 	at sun.nio.ch.SocketChannelImpl.finishConnect(SocketChannelImpl.java:712)
   [junit4]   2> 	at org.apache.zookeeper.ClientCnxnSocketNIO.doTransport(ClientCnxnSocketNIO.java:361)
   [junit4]   2> 	at org.apache.zookeeper.ClientCnxn$SendThread.run(ClientCnxn.java:1081)
   [junit4]   2> 
   [junit4]   2> 766805 T2532 oaz.ClientCnxn$SendThread.run WARN Unexpected exception java.lang.InterruptedException: sleep interrupted
   [junit4]   2> 	at java.lang.Thread.sleep(Native Method)
   [junit4]   2> 	at org.apache.zookeeper.ClientCnxn$SendThread.run(ClientCnxn.java:994)
   [junit4]   2> 
   [junit4]   2> 139859 T2371 ccr.ThreadLeakControl.tryToInterruptAll SEVERE There are still zombie threads that couldn't be terminated:
   [junit4]   2> 	   1) Thread[id=2532, name=TEST-CollectionsAPIDistributedZkTest.testDistribSearch-seed#[836554BD8ACF5AE7]-SendThread(127.0.0.1:35788), state=TIMED_WAITING, group=TGRP-CollectionsAPIDistributedZkTest]
   [junit4]   2> 	        at java.lang.Thread.sleep(Native Method)
   [junit4]   2> 	        at org.apache.zookeeper.client.StaticHostProvider.next(StaticHostProvider.java:101)
   [junit4]   2> 	        at org.apache.zookeeper.ClientCnxn$SendThread.startConnect(ClientCnxn.java:940)
   [junit4]   2> 	        at org.apache.zookeeper.ClientCnxn$SendThread.run(ClientCnxn.java:1003)
   [junit4]   2> NOTE: test params are: codec=CheapBastard, sim=DefaultSimilarity, locale=es_ES, timezone=America/Havana
   [junit4]   2> NOTE: Linux 3.8.0-39-generic amd64/Oracle Corporation 1.8.0_05 (64-bit)/cpus=8,threads=2,free=92775808,total=278798336
   [junit4]   2> NOTE: All tests run in this JVM: [DocExpirationUpdateProcessorFactoryTest, LegacyHTMLStripCharFilterTest, TestManagedStopFilterFactory, DebugComponentTest, TestFreeTextSuggestions, DocValuesMissingTest, TestIBSimilarityFactory, TestHighFrequencyDictionaryFactory, TestDynamicFieldCollectionResource, TestBinaryResponseWriter, TestInfoStreamLogging, SpellCheckCollatorTest, UniqFieldsUpdateProcessorFactoryTest, ResourceLoaderTest, TestRTGBase, XmlUpdateRequestHandlerTest, OpenCloseCoreStressTest, TestAtomicUpdateErrorCases, TestClassNameShortening, TestHashPartitioner, ShardRoutingCustomTest, AtomicUpdatesTest, TestDistributedGrouping, DistributedSuggestComponentTest, InfoHandlerTest, TestIndexSearcher, SolrTestCaseJ4Test, TestOrdValues, TestLRUCache, TestFoldingMultitermQuery, BlockDirectoryTest, TestQuerySenderListener, DistribDocExpirationUpdateProcessorTest, TestFastWriter, TestLazyCores, HdfsLockFactoryTest, TestModifyConfFiles, TestStandardQParsers, ChangedSchemaMergeTest, TestSolrDeletionPolicy2, TestSolrJ, TestOverriddenPrefixQueryForCustomFieldType, DirectSolrSpellCheckerTest, SolrPluginUtilsTest, HighlighterTest, MigrateRouteKeyTest, PluginInfoTest, FunctionTest, TestFileDictionaryLookup, TestSchemaNameResource, HdfsBasicDistributedZkTest, TestOmitPositions, MultiThreadedOCPTest, TestCoreDiscovery, SimplePostToolTest, TestFastOutputStream, SystemInfoHandlerTest, HighlighterConfigTest, MergeStrategyTest, DisMaxRequestHandlerTest, TestPartialUpdateDeduplication, DOMUtilTest, RequestHandlersTest, TestQuerySenderNoQuery, EnumFieldTest, CurrencyFieldOpenExchangeTest, DateMathParserTest, TestDistributedMissingSort, CurrencyFieldXmlFileTest, SolrCmdDistributorTest, TestMultiCoreConfBootstrap, DistribCursorPagingTest, TestStressLucene, TestDocBasedVersionConstraints, JSONWriterTest, TestCloudManagedSchema, TestComponentsName, SuggesterWFSTTest, TestFieldResource, TestArbitraryIndexDir, BasicZkTest, FieldFacetTest, ResponseHeaderTest, DocumentAnalysisRequestHandlerTest, SpellCheckComponentTest, CoreMergeIndexesAdminHandlerTest, TestDFRSimilarityFactory, LeaderElectionIntegrationTest, XsltUpdateRequestHandlerTest, CollectionsAPIDistributedZkTest]
   [junit4]   2> NOTE: reproduce with: ant test  -Dtestcase=CollectionsAPIDistributedZkTest -Dtests.seed=836554BD8ACF5AE7 -Dtests.multiplier=3 -Dtests.slow=true -Dtests.locale=es_ES -Dtests.timezone=America/Havana -Dtests.file.encoding=UTF-8
   [junit4] ERROR   0.00s J1 | CollectionsAPIDistributedZkTest (suite) <<<
   [junit4]    > Throwable #1: java.lang.AssertionError: ERROR: SolrZkClient opens=21 closes=20
   [junit4]    > 	at __randomizedtesting.SeedInfo.seed([836554BD8ACF5AE7]:0)
   [junit4]    > 	at org.apache.solr.SolrTestCaseJ4.endTrackingZkClients(SolrTestCaseJ4.java:451)
   [junit4]    > 	at org.apache.solr.SolrTestCaseJ4.afterClass(SolrTestCaseJ4.java:185)
   [junit4]    > 	at java.lang.Thread.run(Thread.java:745)Throwable #2: com.carrotsearch.randomizedtesting.ThreadLeakError: 2 threads leaked from SUITE scope at org.apache.solr.cloud.CollectionsAPIDistributedZkTest: 
   [junit4]    >    1) Thread[id=2532, name=TEST-CollectionsAPIDistributedZkTest.testDistribSearch-seed#[836554BD8ACF5AE7]-SendThread(127.0.0.1:35788), state=TIMED_WAITING, group=TGRP-CollectionsAPIDistributedZkTest]
   [junit4]    >         at java.lang.Thread.sleep(Native Method)
   [junit4]    >         at org.apache.zookeeper.client.StaticHostProvider.next(StaticHostProvider.java:101)
   [junit4]    >         at org.apache.zookeeper.ClientCnxn$SendThread.startConnect(ClientCnxn.java:940)
   [junit4]    >         at org.apache.zookeeper.ClientCnxn$SendThread.run(ClientCnxn.java:1003)
   [junit4]    >    2) Thread[id=2533, name=TEST-CollectionsAPIDistributedZkTest.testDistribSearch-seed#[836554BD8ACF5AE7]-EventThread, state=WAITING, group=TGRP-CollectionsAPIDistributedZkTest]
   [junit4]    >         at sun.misc.Unsafe.park(Native Method)
   [junit4]    >         at java.util.concurrent.locks.LockSupport.park(LockSupport.java:175)
   [junit4]    >         at java.util.concurrent.locks.AbstractQueuedSynchronizer$ConditionObject.await(AbstractQueuedSynchronizer.java:2039)
   [junit4]    >         at java.util.concurrent.LinkedBlockingQueue.take(LinkedBlockingQueue.java:442)
   [junit4]    >         at org.apache.zookeeper.ClientCnxn$EventThread.run(ClientCnxn.java:494)
   [junit4]    > 	at __randomizedtesting.SeedInfo.seed([836554BD8ACF5AE7]:0)Throwable #3: com.carrotsearch.randomizedtesting.ThreadLeakError: There are still zombie threads that couldn't be terminated:
   [junit4]    >    1) Thread[id=2532, name=TEST-CollectionsAPIDistributedZkTest.testDistribSearch-seed#[836554BD8ACF5AE7]-SendThread(127.0.0.1:35788), state=TIMED_WAITING, group=TGRP-CollectionsAPIDistributedZkTest]
   [junit4]    >         at java.lang.Thread.sleep(Native Method)
   [junit4]    >         at org.apache.zookeeper.client.StaticHostProvider.next(StaticHostProvider.java:101)
   [junit4]    >         at org.apache.zookeeper.ClientCnxn$SendThread.startConnect(ClientCnxn.java:940)
   [junit4]    >         at org.apache.zookeeper.ClientCnxn$SendThread.run(ClientCnxn.java:1003)
   [junit4]    > 	at __randomizedtesting.SeedInfo.seed([836554BD8ACF5AE7]:0)
   [junit4] Completed on J1 in 139.90s, 1 test, 2 failures, 2 errors <<< FAILURES!

[...truncated 653 lines...]
BUILD FAILED
/mnt/ssd/jenkins/workspace/Lucene-Solr-trunk-Linux/build.xml:467: The following error occurred while executing this line:
/mnt/ssd/jenkins/workspace/Lucene-Solr-trunk-Linux/build.xml:447: The following error occurred while executing this line:
/mnt/ssd/jenkins/workspace/Lucene-Solr-trunk-Linux/build.xml:45: The following error occurred while executing this line:
/mnt/ssd/jenkins/workspace/Lucene-Solr-trunk-Linux/extra-targets.xml:37: The following error occurred while executing this line:
/mnt/ssd/jenkins/workspace/Lucene-Solr-trunk-Linux/solr/build.xml:189: The following error occurred while executing this line:
/mnt/ssd/jenkins/workspace/Lucene-Solr-trunk-Linux/solr/common-build.xml:496: The following error occurred while executing this line:
/mnt/ssd/jenkins/workspace/Lucene-Solr-trunk-Linux/lucene/common-build.xml:1296: The following error occurred while executing this line:
/mnt/ssd/jenkins/workspace/Lucene-Solr-trunk-Linux/lucene/common-build.xml:920: There were test failures: 406 suites, 1688 tests, 3 suite-level errors, 1 failure, 840 ignored (13 assumptions)

Total time: 54 minutes 8 seconds
Build step 'Invoke Ant' marked build as failure
Description set: Java: 64bit/jdk1.8.0_05 -XX:-UseCompressedOops -XX:+UseConcMarkSweepGC
Archiving artifacts
Recording test results
Email was triggered for: Failure
Sending email for trigger: Failure



Mime
View raw message