lucene-dev mailing list archives

Site index · List index
Message view « Date » · « Thread »
Top « Date » · « Thread »
From Policeman Jenkins Server <jenk...@thetaphi.de>
Subject [JENKINS] Lucene-Solr-trunk-Linux (64bit/ibm-j9-jdk7) - Build # 10388 - Still Failing!
Date Mon, 26 May 2014 14:41:16 GMT
Build: http://jenkins.thetaphi.de/job/Lucene-Solr-trunk-Linux/10388/
Java: 64bit/ibm-j9-jdk7 -Xjit:exclude={org/apache/lucene/util/fst/FST.pack(IIF)Lorg/apache/lucene/util/fst/FST;}

2 tests failed.
REGRESSION:  org.apache.solr.update.AutoCommitTest.testMaxTime

Error Message:
Exception during query

Stack Trace:
java.lang.RuntimeException: Exception during query
	at __randomizedtesting.SeedInfo.seed([22EDC1625D28A4D7:B819BC80C3B238EB]:0)
	at org.apache.solr.SolrTestCaseJ4.assertQ(SolrTestCaseJ4.java:719)
	at org.apache.solr.update.AutoCommitTest.testMaxTime(AutoCommitTest.java:227)
	at sun.reflect.NativeMethodAccessorImpl.invoke0(Native Method)
	at sun.reflect.NativeMethodAccessorImpl.invoke(NativeMethodAccessorImpl.java:94)
	at sun.reflect.DelegatingMethodAccessorImpl.invoke(DelegatingMethodAccessorImpl.java:55)
	at java.lang.reflect.Method.invoke(Method.java:619)
	at com.carrotsearch.randomizedtesting.RandomizedRunner.invoke(RandomizedRunner.java:1618)
	at com.carrotsearch.randomizedtesting.RandomizedRunner$6.evaluate(RandomizedRunner.java:827)
	at com.carrotsearch.randomizedtesting.RandomizedRunner$7.evaluate(RandomizedRunner.java:863)
	at com.carrotsearch.randomizedtesting.RandomizedRunner$8.evaluate(RandomizedRunner.java:877)
	at com.carrotsearch.randomizedtesting.rules.SystemPropertiesRestoreRule$1.evaluate(SystemPropertiesRestoreRule.java:53)
	at org.apache.lucene.util.TestRuleSetupTeardownChained$1.evaluate(TestRuleSetupTeardownChained.java:50)
	at org.apache.lucene.util.AbstractBeforeAfterRule$1.evaluate(AbstractBeforeAfterRule.java:46)
	at com.carrotsearch.randomizedtesting.rules.SystemPropertiesInvariantRule$1.evaluate(SystemPropertiesInvariantRule.java:55)
	at org.apache.lucene.util.TestRuleThreadAndTestName$1.evaluate(TestRuleThreadAndTestName.java:49)
	at org.apache.lucene.util.TestRuleIgnoreAfterMaxFailures$1.evaluate(TestRuleIgnoreAfterMaxFailures.java:65)
	at org.apache.lucene.util.TestRuleMarkFailure$1.evaluate(TestRuleMarkFailure.java:48)
	at com.carrotsearch.randomizedtesting.rules.StatementAdapter.evaluate(StatementAdapter.java:36)
	at com.carrotsearch.randomizedtesting.ThreadLeakControl$StatementRunner.run(ThreadLeakControl.java:360)
	at com.carrotsearch.randomizedtesting.ThreadLeakControl.forkTimeoutingTask(ThreadLeakControl.java:793)
	at com.carrotsearch.randomizedtesting.ThreadLeakControl$3.evaluate(ThreadLeakControl.java:453)
	at com.carrotsearch.randomizedtesting.RandomizedRunner.runSingleTest(RandomizedRunner.java:836)
	at com.carrotsearch.randomizedtesting.RandomizedRunner$3.evaluate(RandomizedRunner.java:738)
	at com.carrotsearch.randomizedtesting.RandomizedRunner$4.evaluate(RandomizedRunner.java:772)
	at com.carrotsearch.randomizedtesting.RandomizedRunner$5.evaluate(RandomizedRunner.java:783)
	at com.carrotsearch.randomizedtesting.rules.StatementAdapter.evaluate(StatementAdapter.java:36)
	at com.carrotsearch.randomizedtesting.rules.SystemPropertiesRestoreRule$1.evaluate(SystemPropertiesRestoreRule.java:53)
	at org.apache.lucene.util.AbstractBeforeAfterRule$1.evaluate(AbstractBeforeAfterRule.java:46)
	at org.apache.lucene.util.TestRuleStoreClassName$1.evaluate(TestRuleStoreClassName.java:42)
	at com.carrotsearch.randomizedtesting.rules.SystemPropertiesInvariantRule$1.evaluate(SystemPropertiesInvariantRule.java:55)
	at com.carrotsearch.randomizedtesting.rules.NoShadowingOrOverridesOnMethodsRule$1.evaluate(NoShadowingOrOverridesOnMethodsRule.java:39)
	at com.carrotsearch.randomizedtesting.rules.NoShadowingOrOverridesOnMethodsRule$1.evaluate(NoShadowingOrOverridesOnMethodsRule.java:39)
	at com.carrotsearch.randomizedtesting.rules.StatementAdapter.evaluate(StatementAdapter.java:36)
	at com.carrotsearch.randomizedtesting.rules.StatementAdapter.evaluate(StatementAdapter.java:36)
	at com.carrotsearch.randomizedtesting.rules.StatementAdapter.evaluate(StatementAdapter.java:36)
	at org.apache.lucene.util.TestRuleAssertionsRequired$1.evaluate(TestRuleAssertionsRequired.java:43)
	at org.apache.lucene.util.TestRuleMarkFailure$1.evaluate(TestRuleMarkFailure.java:48)
	at org.apache.lucene.util.TestRuleIgnoreAfterMaxFailures$1.evaluate(TestRuleIgnoreAfterMaxFailures.java:65)
	at org.apache.lucene.util.TestRuleIgnoreTestSuites$1.evaluate(TestRuleIgnoreTestSuites.java:55)
	at com.carrotsearch.randomizedtesting.rules.StatementAdapter.evaluate(StatementAdapter.java:36)
	at com.carrotsearch.randomizedtesting.ThreadLeakControl$StatementRunner.run(ThreadLeakControl.java:360)
	at java.lang.Thread.run(Thread.java:853)
Caused by: java.lang.RuntimeException: REQUEST FAILED: xpath=//result[@numFound=0]
	xml response was: <?xml version="1.0" encoding="UTF-8"?>
<response>
<lst name="responseHeader"><int name="status">0</int><int name="QTime">2360</int></lst><result name="response" numFound="1" start="0"><doc><int name="id">529</int><arr name="range_facet_l"><long>529</long></arr><arr name="field_t"><str>what's inside?</str></arr><arr name="subject"><str>info</str></arr><long name="_version_">1469175250081021952</long><int name="intDefault">42</int><arr name="multiDefault"><str>muLti-Default</str></arr><date name="timestamp">2014-05-26T14:31:42.302Z</date></doc></result>
</response>

	request was:rows=20&qt=standard&start=0&q=id:529&version=2.2
	at org.apache.solr.SolrTestCaseJ4.assertQ(SolrTestCaseJ4.java:712)
	... 41 more


REGRESSION:  org.apache.solr.update.HardAutoCommitTest.testCommitWithin

Error Message:
Exception during query

Stack Trace:
java.lang.RuntimeException: Exception during query
	at __randomizedtesting.SeedInfo.seed([22EDC1625D28A4D7:983FAE1ADE064AC2]:0)
	at org.apache.solr.SolrTestCaseJ4.assertQ(SolrTestCaseJ4.java:719)
	at org.apache.solr.update.HardAutoCommitTest.testCommitWithin(HardAutoCommitTest.java:79)
	at sun.reflect.NativeMethodAccessorImpl.invoke0(Native Method)
	at sun.reflect.NativeMethodAccessorImpl.invoke(NativeMethodAccessorImpl.java:94)
	at sun.reflect.DelegatingMethodAccessorImpl.invoke(DelegatingMethodAccessorImpl.java:55)
	at java.lang.reflect.Method.invoke(Method.java:619)
	at com.carrotsearch.randomizedtesting.RandomizedRunner.invoke(RandomizedRunner.java:1618)
	at com.carrotsearch.randomizedtesting.RandomizedRunner$6.evaluate(RandomizedRunner.java:827)
	at com.carrotsearch.randomizedtesting.RandomizedRunner$7.evaluate(RandomizedRunner.java:863)
	at com.carrotsearch.randomizedtesting.RandomizedRunner$8.evaluate(RandomizedRunner.java:877)
	at com.carrotsearch.randomizedtesting.rules.SystemPropertiesRestoreRule$1.evaluate(SystemPropertiesRestoreRule.java:53)
	at org.apache.lucene.util.TestRuleSetupTeardownChained$1.evaluate(TestRuleSetupTeardownChained.java:50)
	at org.apache.lucene.util.AbstractBeforeAfterRule$1.evaluate(AbstractBeforeAfterRule.java:46)
	at com.carrotsearch.randomizedtesting.rules.SystemPropertiesInvariantRule$1.evaluate(SystemPropertiesInvariantRule.java:55)
	at org.apache.lucene.util.TestRuleThreadAndTestName$1.evaluate(TestRuleThreadAndTestName.java:49)
	at org.apache.lucene.util.TestRuleIgnoreAfterMaxFailures$1.evaluate(TestRuleIgnoreAfterMaxFailures.java:65)
	at org.apache.lucene.util.TestRuleMarkFailure$1.evaluate(TestRuleMarkFailure.java:48)
	at com.carrotsearch.randomizedtesting.rules.StatementAdapter.evaluate(StatementAdapter.java:36)
	at com.carrotsearch.randomizedtesting.ThreadLeakControl$StatementRunner.run(ThreadLeakControl.java:360)
	at com.carrotsearch.randomizedtesting.ThreadLeakControl.forkTimeoutingTask(ThreadLeakControl.java:793)
	at com.carrotsearch.randomizedtesting.ThreadLeakControl$3.evaluate(ThreadLeakControl.java:453)
	at com.carrotsearch.randomizedtesting.RandomizedRunner.runSingleTest(RandomizedRunner.java:836)
	at com.carrotsearch.randomizedtesting.RandomizedRunner$3.evaluate(RandomizedRunner.java:738)
	at com.carrotsearch.randomizedtesting.RandomizedRunner$4.evaluate(RandomizedRunner.java:772)
	at com.carrotsearch.randomizedtesting.RandomizedRunner$5.evaluate(RandomizedRunner.java:783)
	at com.carrotsearch.randomizedtesting.rules.StatementAdapter.evaluate(StatementAdapter.java:36)
	at com.carrotsearch.randomizedtesting.rules.SystemPropertiesRestoreRule$1.evaluate(SystemPropertiesRestoreRule.java:53)
	at org.apache.lucene.util.AbstractBeforeAfterRule$1.evaluate(AbstractBeforeAfterRule.java:46)
	at org.apache.lucene.util.TestRuleStoreClassName$1.evaluate(TestRuleStoreClassName.java:42)
	at com.carrotsearch.randomizedtesting.rules.SystemPropertiesInvariantRule$1.evaluate(SystemPropertiesInvariantRule.java:55)
	at com.carrotsearch.randomizedtesting.rules.NoShadowingOrOverridesOnMethodsRule$1.evaluate(NoShadowingOrOverridesOnMethodsRule.java:39)
	at com.carrotsearch.randomizedtesting.rules.NoShadowingOrOverridesOnMethodsRule$1.evaluate(NoShadowingOrOverridesOnMethodsRule.java:39)
	at com.carrotsearch.randomizedtesting.rules.StatementAdapter.evaluate(StatementAdapter.java:36)
	at com.carrotsearch.randomizedtesting.rules.StatementAdapter.evaluate(StatementAdapter.java:36)
	at com.carrotsearch.randomizedtesting.rules.StatementAdapter.evaluate(StatementAdapter.java:36)
	at org.apache.lucene.util.TestRuleAssertionsRequired$1.evaluate(TestRuleAssertionsRequired.java:43)
	at org.apache.lucene.util.TestRuleMarkFailure$1.evaluate(TestRuleMarkFailure.java:48)
	at org.apache.lucene.util.TestRuleIgnoreAfterMaxFailures$1.evaluate(TestRuleIgnoreAfterMaxFailures.java:65)
	at org.apache.lucene.util.TestRuleIgnoreTestSuites$1.evaluate(TestRuleIgnoreTestSuites.java:55)
	at com.carrotsearch.randomizedtesting.rules.StatementAdapter.evaluate(StatementAdapter.java:36)
	at com.carrotsearch.randomizedtesting.ThreadLeakControl$StatementRunner.run(ThreadLeakControl.java:360)
	at java.lang.Thread.run(Thread.java:853)
Caused by: java.lang.RuntimeException: REQUEST FAILED: xpath=//result[@numFound=0]
	xml response was: <?xml version="1.0" encoding="UTF-8"?>
<response>
<lst name="responseHeader"><int name="status">0</int><int name="QTime">3137</int></lst><result name="response" numFound="1" start="0"><doc><int name="id">529</int><arr name="range_facet_l"><long>529</long></arr><arr name="field_t"><str>what's inside?</str></arr><arr name="subject"><str>info</str></arr><long name="_version_">1469175480316854272</long><arr name="multiDefault"><str>muLti-Default</str></arr><int name="intDefault">42</int><date name="timestamp">2014-05-26T14:35:21.872Z</date></doc></result>
</response>

	request was:start=0&rows=20&q=id:529&version=2.2&qt=standard
	at org.apache.solr.SolrTestCaseJ4.assertQ(SolrTestCaseJ4.java:712)
	... 41 more




Build Log:
[...truncated 10622 lines...]
   [junit4] Suite: org.apache.solr.update.AutoCommitTest
   [junit4]   2> Creating dataDir: /mnt/ssd/jenkins/workspace/Lucene-Solr-trunk-Linux/solr/build/solr-core/test/J0/./temp/solr.update.AutoCommitTest-22EDC1625D28A4D7-001/init-core-data-001
   [junit4]   2> 83178 T297 oas.SolrTestCaseJ4.buildSSLConfig Randomized ssl (false) and clientAuth (true)
   [junit4]   2> 83180 T297 oas.SolrTestCaseJ4.initCore ####initCore
   [junit4]   2> 83182 T297 oasc.SolrResourceLoader.<init> new SolrResourceLoader for directory: '/mnt/ssd/jenkins/workspace/Lucene-Solr-trunk-Linux/solr/core/src/test-files/solr/collection1/'
   [junit4]   2> 83184 T297 oasc.SolrResourceLoader.replaceClassLoader Adding 'file:/mnt/ssd/jenkins/workspace/Lucene-Solr-trunk-Linux/solr/core/src/test-files/solr/collection1/lib/.svn/' to classloader
   [junit4]   2> 83184 T297 oasc.SolrResourceLoader.replaceClassLoader Adding 'file:/mnt/ssd/jenkins/workspace/Lucene-Solr-trunk-Linux/solr/core/src/test-files/solr/collection1/lib/classes/' to classloader
   [junit4]   2> 83186 T297 oasc.SolrResourceLoader.replaceClassLoader Adding 'file:/mnt/ssd/jenkins/workspace/Lucene-Solr-trunk-Linux/solr/core/src/test-files/solr/collection1/lib/README' to classloader
   [junit4]   2> 83290 T297 oasc.SolrConfig.<init> Using Lucene MatchVersion: LUCENE_5_0
   [junit4]   2> 83398 T297 oasc.SolrConfig.<init> Loaded SolrConfig: solrconfig.xml
   [junit4]   2> 83403 T297 oass.IndexSchema.readSchema Reading Solr Schema from schema.xml
   [junit4]   2> 83423 T297 oass.IndexSchema.readSchema [null] Schema name=test
   [junit4]   2> 83738 T297 oass.OpenExchangeRatesOrgProvider.init Initialized with rates=open-exchange-rates.json, refreshInterval=1440.
   [junit4]   2> 83745 T297 oass.IndexSchema.readSchema default search field in schema is text
   [junit4]   2> 83747 T297 oass.IndexSchema.readSchema unique key field: id
   [junit4]   2> 83756 T297 oass.FileExchangeRateProvider.reload Reloading exchange rates from file currency.xml
   [junit4]   2> 83760 T297 oass.FileExchangeRateProvider.reload Reloading exchange rates from file currency.xml
   [junit4]   2> 83765 T297 oass.OpenExchangeRatesOrgProvider.reload Reloading exchange rates from open-exchange-rates.json
   [junit4]   2> 83766 T297 oass.OpenExchangeRatesOrgProvider$OpenExchangeRates.<init> WARN Unknown key IMPORTANT NOTE
   [junit4]   2> 83767 T297 oass.OpenExchangeRatesOrgProvider$OpenExchangeRates.<init> WARN Expected key, got STRING
   [junit4]   2> 83767 T297 oass.OpenExchangeRatesOrgProvider.reload Reloading exchange rates from open-exchange-rates.json
   [junit4]   2> 83768 T297 oass.OpenExchangeRatesOrgProvider$OpenExchangeRates.<init> WARN Unknown key IMPORTANT NOTE
   [junit4]   2> 83768 T297 oass.OpenExchangeRatesOrgProvider$OpenExchangeRates.<init> WARN Expected key, got STRING
   [junit4]   2> 83769 T297 oasc.SolrResourceLoader.locateSolrHome JNDI not configured for solr (NoInitialContextEx)
   [junit4]   2> 83770 T297 oasc.SolrResourceLoader.locateSolrHome using system property solr.solr.home: /mnt/ssd/jenkins/workspace/Lucene-Solr-trunk-Linux/solr/core/src/test-files/solr
   [junit4]   2> 83770 T297 oasc.SolrResourceLoader.<init> new SolrResourceLoader for directory: '/mnt/ssd/jenkins/workspace/Lucene-Solr-trunk-Linux/solr/core/src/test-files/solr/'
   [junit4]   2> 83811 T297 oasc.CoreContainer.<init> New CoreContainer -1273491225
   [junit4]   2> 83811 T297 oasc.CoreContainer.load Loading cores into CoreContainer [instanceDir=/mnt/ssd/jenkins/workspace/Lucene-Solr-trunk-Linux/solr/core/src/test-files/solr/]
   [junit4]   2> 83812 T297 oashc.HttpShardHandlerFactory.getParameter Setting socketTimeout to: 0
   [junit4]   2> 83813 T297 oashc.HttpShardHandlerFactory.getParameter Setting urlScheme to: null
   [junit4]   2> 83813 T297 oashc.HttpShardHandlerFactory.getParameter Setting connTimeout to: 0
   [junit4]   2> 83813 T297 oashc.HttpShardHandlerFactory.getParameter Setting maxConnectionsPerHost to: 20
   [junit4]   2> 83814 T297 oashc.HttpShardHandlerFactory.getParameter Setting corePoolSize to: 0
   [junit4]   2> 83814 T297 oashc.HttpShardHandlerFactory.getParameter Setting maximumPoolSize to: 2147483647
   [junit4]   2> 83814 T297 oashc.HttpShardHandlerFactory.getParameter Setting maxThreadIdleTime to: 5
   [junit4]   2> 83815 T297 oashc.HttpShardHandlerFactory.getParameter Setting sizeOfQueue to: -1
   [junit4]   2> 83815 T297 oashc.HttpShardHandlerFactory.getParameter Setting fairnessPolicy to: false
   [junit4]   2> 83816 T297 oasl.LogWatcher.createWatcher SLF4J impl is org.slf4j.impl.Log4jLoggerFactory
   [junit4]   2> 83816 T297 oasl.LogWatcher.newRegisteredLogWatcher Registering Log Listener [Log4j (org.slf4j.impl.Log4jLoggerFactory)]
   [junit4]   2> 83816 T297 oasc.CoreContainer.load Host Name: 
   [junit4]   2> 83820 T298 oasc.SolrResourceLoader.<init> new SolrResourceLoader for directory: '/mnt/ssd/jenkins/workspace/Lucene-Solr-trunk-Linux/solr/core/src/test-files/solr/collection1/'
   [junit4]   2> 83820 T298 oasc.SolrResourceLoader.replaceClassLoader Adding 'file:/mnt/ssd/jenkins/workspace/Lucene-Solr-trunk-Linux/solr/core/src/test-files/solr/collection1/lib/.svn/' to classloader
   [junit4]   2> 83820 T298 oasc.SolrResourceLoader.replaceClassLoader Adding 'file:/mnt/ssd/jenkins/workspace/Lucene-Solr-trunk-Linux/solr/core/src/test-files/solr/collection1/lib/classes/' to classloader
   [junit4]   2> 83821 T298 oasc.SolrResourceLoader.replaceClassLoader Adding 'file:/mnt/ssd/jenkins/workspace/Lucene-Solr-trunk-Linux/solr/core/src/test-files/solr/collection1/lib/README' to classloader
   [junit4]   2> 83859 T298 oasc.SolrConfig.<init> Using Lucene MatchVersion: LUCENE_5_0
   [junit4]   2> 83905 T298 oasc.SolrConfig.<init> Loaded SolrConfig: solrconfig.xml
   [junit4]   2> 83906 T298 oass.IndexSchema.readSchema Reading Solr Schema from schema.xml
   [junit4]   2> 83911 T298 oass.IndexSchema.readSchema [collection1] Schema name=test
   [junit4]   2> 84201 T298 oass.OpenExchangeRatesOrgProvider.init Initialized with rates=open-exchange-rates.json, refreshInterval=1440.
   [junit4]   2> 84206 T298 oass.IndexSchema.readSchema default search field in schema is text
   [junit4]   2> 84209 T298 oass.IndexSchema.readSchema unique key field: id
   [junit4]   2> 84214 T298 oass.FileExchangeRateProvider.reload Reloading exchange rates from file currency.xml
   [junit4]   2> 84218 T298 oass.FileExchangeRateProvider.reload Reloading exchange rates from file currency.xml
   [junit4]   2> 84221 T298 oass.OpenExchangeRatesOrgProvider.reload Reloading exchange rates from open-exchange-rates.json
   [junit4]   2> 84221 T298 oass.OpenExchangeRatesOrgProvider$OpenExchangeRates.<init> WARN Unknown key IMPORTANT NOTE
   [junit4]   2> 84222 T298 oass.OpenExchangeRatesOrgProvider$OpenExchangeRates.<init> WARN Expected key, got STRING
   [junit4]   2> 84222 T298 oass.OpenExchangeRatesOrgProvider.reload Reloading exchange rates from open-exchange-rates.json
   [junit4]   2> 84222 T298 oass.OpenExchangeRatesOrgProvider$OpenExchangeRates.<init> WARN Unknown key IMPORTANT NOTE
   [junit4]   2> 84222 T298 oass.OpenExchangeRatesOrgProvider$OpenExchangeRates.<init> WARN Expected key, got STRING
   [junit4]   2> 84223 T298 oasc.CoreContainer.create Creating SolrCore 'collection1' using configuration from instancedir /mnt/ssd/jenkins/workspace/Lucene-Solr-trunk-Linux/solr/core/src/test-files/solr/collection1/
   [junit4]   2> 84223 T298 oasc.SolrCore.initDirectoryFactory org.apache.solr.core.MockDirectoryFactory
   [junit4]   2> 84223 T298 oasc.SolrCore.<init> [collection1] Opening new SolrCore at /mnt/ssd/jenkins/workspace/Lucene-Solr-trunk-Linux/solr/core/src/test-files/solr/collection1/, dataDir=/mnt/ssd/jenkins/workspace/Lucene-Solr-trunk-Linux/solr/build/solr-core/test/J0/./temp/solr.update.AutoCommitTest-22EDC1625D28A4D7-001/init-core-data-001/
   [junit4]   2> 84224 T298 oasc.JmxMonitoredMap.<init> JMX monitoring is enabled. Adding Solr mbeans to JMX Server: com.sun.jmx.mbeanserver.JmxMBeanServer@fa4aa6d
   [junit4]   2> 84224 T298 oasc.CachingDirectoryFactory.get return new directory for /mnt/ssd/jenkins/workspace/Lucene-Solr-trunk-Linux/solr/build/solr-core/test/J0/./temp/solr.update.AutoCommitTest-22EDC1625D28A4D7-001/init-core-data-001
   [junit4]   2> 84225 T298 oasc.SolrCore.getNewIndexDir New index directory detected: old=null new=/mnt/ssd/jenkins/workspace/Lucene-Solr-trunk-Linux/solr/build/solr-core/test/J0/./temp/solr.update.AutoCommitTest-22EDC1625D28A4D7-001/init-core-data-001/index/
   [junit4]   2> 84225 T298 oasc.SolrCore.initIndex WARN [collection1] Solr index directory '/mnt/ssd/jenkins/workspace/Lucene-Solr-trunk-Linux/solr/build/solr-core/test/J0/./temp/solr.update.AutoCommitTest-22EDC1625D28A4D7-001/init-core-data-001/index' doesn't exist. Creating new index...
   [junit4]   2> 84226 T298 oasc.CachingDirectoryFactory.get return new directory for /mnt/ssd/jenkins/workspace/Lucene-Solr-trunk-Linux/solr/build/solr-core/test/J0/./temp/solr.update.AutoCommitTest-22EDC1625D28A4D7-001/init-core-data-001/index
   [junit4]   2> 84227 T298 oasu.RandomMergePolicy.<init> RandomMergePolicy wrapping class org.apache.lucene.index.LogByteSizeMergePolicy: [LogByteSizeMergePolicy: minMergeSize=1677721, mergeFactor=24, maxMergeSize=2147483648, maxMergeSizeForForcedMerge=9223372036854775807, calibrateSizeByDeletes=false, maxMergeDocs=2147483647, maxCFSSegmentSizeMB=8.796093022207999E12, noCFSRatio=0.0]
   [junit4]   2> 84228 T298 oasc.SolrDeletionPolicy.onCommit SolrDeletionPolicy.onCommit: commits: num=1
   [junit4]   2> 		commit{dir=RateLimitedDirectoryWrapper(MockDirectoryWrapper(RAMDirectory@6da717bf lockFactory=org.apache.lucene.store.SingleInstanceLockFactory@5c0120fe)),segFN=segments_1,generation=1}
   [junit4]   2> 84228 T298 oasc.SolrDeletionPolicy.updateCommits newest commit generation = 1
   [junit4]   2> 84229 T298 oasc.SolrCore.initWriters created xml: solr.XMLResponseWriter
   [junit4]   2> 84232 T298 oasup.UpdateRequestProcessorChain.init creating updateRequestProcessorChain "dedupe"
   [junit4]   2> 84232 T298 oasup.UpdateRequestProcessorChain.init inserting DistributedUpdateProcessorFactory into updateRequestProcessorChain "dedupe"
   [junit4]   2> 84233 T298 oasup.UpdateRequestProcessorChain.init creating updateRequestProcessorChain "dedupe-allfields"
   [junit4]   2> 84233 T298 oasup.UpdateRequestProcessorChain.init inserting DistributedUpdateProcessorFactory into updateRequestProcessorChain "dedupe-allfields"
   [junit4]   2> 84233 T298 oasup.UpdateRequestProcessorChain.init creating updateRequestProcessorChain "stored_sig"
   [junit4]   2> 84233 T298 oasup.UpdateRequestProcessorChain.init inserting DistributedUpdateProcessorFactory into updateRequestProcessorChain "stored_sig"
   [junit4]   2> 84234 T298 oasup.UpdateRequestProcessorChain.init creating updateRequestProcessorChain "uniq-fields"
   [junit4]   2> 84234 T298 oasup.UpdateRequestProcessorChain.init inserting DistributedUpdateProcessorFactory into updateRequestProcessorChain "uniq-fields"
   [junit4]   2> 84234 T298 oasup.UpdateRequestProcessorChain.init creating updateRequestProcessorChain "distrib-dup-test-chain-explicit"
   [junit4]   2> 84234 T298 oasup.UpdateRequestProcessorChain.init creating updateRequestProcessorChain "distrib-dup-test-chain-implicit"
   [junit4]   2> 84235 T298 oasup.UpdateRequestProcessorChain.init inserting DistributedUpdateProcessorFactory into updateRequestProcessorChain "distrib-dup-test-chain-implicit"
   [junit4]   2> 84235 T298 oasc.SolrCore.loadUpdateProcessorChains no updateRequestProcessorChain defined as default, creating implicit default
   [junit4]   2> 84235 T298 oasc.RequestHandlers.initHandlersFromConfig adding lazy requestHandler: solr.ReplicationHandler
   [junit4]   2> 84236 T298 oasc.RequestHandlers.initHandlersFromConfig created /replication: solr.ReplicationHandler
   [junit4]   2> 84236 T298 oasc.RequestHandlers.initHandlersFromConfig created standard: solr.StandardRequestHandler
   [junit4]   2> 84236 T298 oasc.RequestHandlers.initHandlersFromConfig created /get: solr.RealTimeGetHandler
   [junit4]   2> 84237 T298 oasc.RequestHandlers.initHandlersFromConfig created dismax: solr.SearchHandler
   [junit4]   2> 84237 T298 oasc.RequestHandlers.initHandlersFromConfig created mock: org.apache.solr.core.MockQuerySenderListenerReqHandler
   [junit4]   2> 84237 T298 oasc.RequestHandlers.initHandlersFromConfig created /admin/: org.apache.solr.handler.admin.AdminHandlers
   [junit4]   2> 84238 T298 oasc.RequestHandlers.initHandlersFromConfig created /admin/file: solr.admin.ShowFileRequestHandler
   [junit4]   2> 84238 T298 oasc.RequestHandlers.initHandlersFromConfig created /admin/fileedit: solr.admin.EditFileRequestHandler
   [junit4]   2> 84238 T298 oasc.RequestHandlers.initHandlersFromConfig created defaults: solr.StandardRequestHandler
   [junit4]   2> 84239 T298 oasc.RequestHandlers.initHandlersFromConfig adding lazy requestHandler: solr.StandardRequestHandler
   [junit4]   2> 84239 T298 oasc.RequestHandlers.initHandlersFromConfig created lazy: solr.StandardRequestHandler
   [junit4]   2> 84239 T298 oasc.RequestHandlers.initHandlersFromConfig created /update: solr.UpdateRequestHandler
   [junit4]   2> 84240 T298 oasc.RequestHandlers.initHandlersFromConfig created /terms: org.apache.solr.handler.component.SearchHandler
   [junit4]   2> 84240 T298 oasc.RequestHandlers.initHandlersFromConfig created spellCheckCompRH: org.apache.solr.handler.component.SearchHandler
   [junit4]   2> 84241 T298 oasc.RequestHandlers.initHandlersFromConfig created spellCheckCompRH_Direct: org.apache.solr.handler.component.SearchHandler
   [junit4]   2> 84241 T298 oasc.RequestHandlers.initHandlersFromConfig created spellCheckWithWordbreak: org.apache.solr.handler.component.SearchHandler
   [junit4]   2> 84242 T298 oasc.RequestHandlers.initHandlersFromConfig created spellCheckWithWordbreak_Direct: org.apache.solr.handler.component.SearchHandler
   [junit4]   2> 84242 T298 oasc.RequestHandlers.initHandlersFromConfig created spellCheckCompRH1: org.apache.solr.handler.component.SearchHandler
   [junit4]   2> 84243 T298 oasc.RequestHandlers.initHandlersFromConfig created mltrh: org.apache.solr.handler.component.SearchHandler
   [junit4]   2> 84243 T298 oasc.RequestHandlers.initHandlersFromConfig created tvrh: org.apache.solr.handler.component.SearchHandler
   [junit4]   2> 84243 T298 oasc.RequestHandlers.initHandlersFromConfig created /mlt: solr.MoreLikeThisHandler
   [junit4]   2> 84244 T298 oasc.RequestHandlers.initHandlersFromConfig created /debug/dump: solr.DumpRequestHandler
   [junit4]   2> 84245 T298 oashl.XMLLoader.init xsltCacheLifetimeSeconds=60
   [junit4]   2> 84246 T298 oasc.SolrCore.initDeprecatedSupport WARN solrconfig.xml uses deprecated <admin/gettableFiles>, Please update your config to use the ShowFileRequestHandler.
   [junit4]   2> 84248 T298 oasu.CommitTracker.<init> Hard AutoCommit: disabled
   [junit4]   2> 84248 T298 oasu.CommitTracker.<init> Soft AutoCommit: disabled
   [junit4]   2> 84249 T298 oasu.RandomMergePolicy.<init> RandomMergePolicy wrapping class org.apache.lucene.index.LogByteSizeMergePolicy: [LogByteSizeMergePolicy: minMergeSize=1677721, mergeFactor=14, maxMergeSize=2147483648, maxMergeSizeForForcedMerge=9223372036854775807, calibrateSizeByDeletes=false, maxMergeDocs=2147483647, maxCFSSegmentSizeMB=8.796093022207999E12, noCFSRatio=0.8094005471773986]
   [junit4]   2> 84250 T298 oasc.SolrDeletionPolicy.onInit SolrDeletionPolicy.onInit: commits: num=1
   [junit4]   2> 		commit{dir=RateLimitedDirectoryWrapper(MockDirectoryWrapper(RAMDirectory@6da717bf lockFactory=org.apache.lucene.store.SingleInstanceLockFactory@5c0120fe)),segFN=segments_1,generation=1}
   [junit4]   2> 84250 T298 oasc.SolrDeletionPolicy.updateCommits newest commit generation = 1
   [junit4]   2> 84250 T298 oass.SolrIndexSearcher.<init> Opening Searcher@e04ab16f[collection1] main
   [junit4]   2> 84251 T298 oasr.RestManager.init Initializing RestManager with initArgs: {storageIO=org.apache.solr.rest.ManagedResourceStorage$InMemoryStorageIO}
   [junit4]   2> 84251 T298 oasr.ManagedResourceStorage.load Reading _rest_managed.json using InMemoryStorage
   [junit4]   2> 84252 T298 oasr.ManagedResource.reloadFromStorage WARN No stored data found for /rest/managed
   [junit4]   2> 84252 T298 oasr.ManagedResource.notifyObserversDuringInit WARN No registered observers for /rest/managed
   [junit4]   2> 84252 T298 oasr.RestManager.init Initializing 0 registered ManagedResources
   [junit4]   2> 84252 T298 oashc.SpellCheckComponent.inform Initializing spell checkers
   [junit4]   2> 84401 T298 oass.DirectSolrSpellChecker.init init: {name=direct,classname=DirectSolrSpellChecker,field=lowerfilt,minQueryLength=3}
   [junit4]   2> 84436 T299 oasc.SolrCore.registerSearcher [collection1] Registered new searcher Searcher@e04ab16f[collection1] main{UninvertingDirectoryReader()}
   [junit4]   2> 84444 T298 oasc.CoreContainer.registerCore registering core: collection1
   [junit4]   2> 84446 T297 oas.SolrTestCaseJ4.initCore ####initCore end
   [junit4]   2> 84449 T297 oas.SolrTestCaseJ4.setUp ###Starting testMaxTime
   [junit4]   2> ASYNC  NEW_CORE C368 name=collection1 org.apache.solr.core.SolrCore@36fae866
   [junit4]   2> 84450 T297 C368 oasup.LogUpdateProcessor.finish [collection1] webapp=null path=null params={} {deleteByQuery=*:* (-1469175247734308864)} 0 1
   [junit4]   2> 84454 T297 oasc.SolrResourceLoader.<init> new SolrResourceLoader for directory: '/mnt/ssd/jenkins/workspace/Lucene-Solr-trunk-Linux/solr/core/src/test-files/solr/collection1/'
   [junit4]   2> 84454 T297 oasc.SolrResourceLoader.replaceClassLoader Adding 'file:/mnt/ssd/jenkins/workspace/Lucene-Solr-trunk-Linux/solr/core/src/test-files/solr/collection1/lib/.svn/' to classloader
   [junit4]   2> 84455 T297 oasc.SolrResourceLoader.replaceClassLoader Adding 'file:/mnt/ssd/jenkins/workspace/Lucene-Solr-trunk-Linux/solr/core/src/test-files/solr/collection1/lib/classes/' to classloader
   [junit4]   2> 84455 T297 oasc.SolrResourceLoader.replaceClassLoader Adding 'file:/mnt/ssd/jenkins/workspace/Lucene-Solr-trunk-Linux/solr/core/src/test-files/solr/collection1/lib/README' to classloader
   [junit4]   2> 84493 T297 oasc.SolrConfig.<init> Using Lucene MatchVersion: LUCENE_5_0
   [junit4]   2> 84540 T297 oasc.SolrConfig.<init> Loaded SolrConfig: solrconfig.xml
   [junit4]   2> 84540 T297 oass.IndexSchema.readSchema Reading Solr Schema from schema.xml
   [junit4]   2> 84546 T297 oass.IndexSchema.readSchema [collection1] Schema name=test
   [junit4]   2> 84959 T297 oass.OpenExchangeRatesOrgProvider.init Initialized with rates=open-exchange-rates.json, refreshInterval=1440.
   [junit4]   2> 84994 T297 oass.IndexSchema.readSchema default search field in schema is text
   [junit4]   2> 84997 T297 oass.IndexSchema.readSchema unique key field: id
   [junit4]   2> 85057 T297 oass.FileExchangeRateProvider.reload Reloading exchange rates from file currency.xml
   [junit4]   2> 85066 T297 oass.FileExchangeRateProvider.reload Reloading exchange rates from file currency.xml
   [junit4]   2> 85073 T297 oass.OpenExchangeRatesOrgProvider.reload Reloading exchange rates from open-exchange-rates.json
   [junit4]   2> 85073 T297 oass.OpenExchangeRatesOrgProvider$OpenExchangeRates.<init> WARN Unknown key IMPORTANT NOTE
   [junit4]   2> 85074 T297 oass.OpenExchangeRatesOrgProvider$OpenExchangeRates.<init> WARN Expected key, got STRING
   [junit4]   2> 85075 T297 oass.OpenExchangeRatesOrgProvider.reload Reloading exchange rates from open-exchange-rates.json
   [junit4]   2> 85076 T297 oass.OpenExchangeRatesOrgProvider$OpenExchangeRates.<init> WARN Unknown key IMPORTANT NOTE
   [junit4]   2> 85076 T297 oass.OpenExchangeRatesOrgProvider$OpenExchangeRates.<init> WARN Expected key, got STRING
   [junit4]   2> 85077 T297 oasc.CoreContainer.reload Reloading SolrCore 'collection1' using configuration from instancedir /mnt/ssd/jenkins/workspace/Lucene-Solr-trunk-Linux/solr/core/src/test-files/solr/collection1/
   [junit4]   2> 85078 T297 oasc.SolrCore.<init> [collection1] Opening new SolrCore at /mnt/ssd/jenkins/workspace/Lucene-Solr-trunk-Linux/solr/core/src/test-files/solr/collection1/, dataDir=/mnt/ssd/jenkins/workspace/Lucene-Solr-trunk-Linux/solr/build/solr-core/test/J0/./temp/solr.update.AutoCommitTest-22EDC1625D28A4D7-001/init-core-data-001/
   [junit4]   2> 85079 T297 oasc.JmxMonitoredMap.<init> JMX monitoring is enabled. Adding Solr mbeans to JMX Server: com.sun.jmx.mbeanserver.JmxMBeanServer@fa4aa6d
   [junit4]   2> 85080 T297 oasc.SolrCore.getNewIndexDir New index directory detected: old=null new=/mnt/ssd/jenkins/workspace/Lucene-Solr-trunk-Linux/solr/build/solr-core/test/J0/./temp/solr.update.AutoCommitTest-22EDC1625D28A4D7-001/init-core-data-001/index/
   [junit4]   2> 85081 T297 oasc.SolrCore.initWriters created xml: solr.XMLResponseWriter
   [junit4]   2> 85094 T297 oasup.UpdateRequestProcessorChain.init creating updateRequestProcessorChain "dedupe"
   [junit4]   2> 85095 T297 oasup.UpdateRequestProcessorChain.init inserting DistributedUpdateProcessorFactory into updateRequestProcessorChain "dedupe"
   [junit4]   2> 85096 T297 oasup.UpdateRequestProcessorChain.init creating updateRequestProcessorChain "dedupe-allfields"
   [junit4]   2> 85098 T297 oasup.UpdateRequestProcessorChain.init inserting DistributedUpdateProcessorFactory into updateRequestProcessorChain "dedupe-allfields"
   [junit4]   2> 85108 T297 oasup.UpdateRequestProcessorChain.init creating updateRequestProcessorChain "stored_sig"
   [junit4]   2> 85110 T297 oasup.UpdateRequestProcessorChain.init inserting DistributedUpdateProcessorFactory into updateRequestProcessorChain "stored_sig"
   [junit4]   2> 85111 T297 oasup.UpdateRequestProcessorChain.init creating updateRequestProcessorChain "uniq-fields"
   [junit4]   2> 85113 T297 oasup.UpdateRequestProcessorChain.init inserting DistributedUpdateProcessorFactory into updateRequestProcessorChain "uniq-fields"
   [junit4]   2> 85113 T297 oasup.UpdateRequestProcessorChain.init creating updateRequestProcessorChain "distrib-dup-test-chain-explicit"
   [junit4]   2> 85114 T297 oasup.UpdateRequestProcessorChain.init creating updateRequestProcessorChain "distrib-dup-test-chain-implicit"
   [junit4]   2> 85117 T297 oasup.UpdateRequestProcessorChain.init inserting DistributedUpdateProcessorFactory into updateRequestProcessorChain "distrib-dup-test-chain-implicit"
   [junit4]   2> 85118 T297 oasc.SolrCore.loadUpdateProcessorChains no updateRequestProcessorChain defined as default, creating implicit default
   [junit4]   2> 85119 T297 oasc.RequestHandlers.initHandlersFromConfig adding lazy requestHandler: solr.ReplicationHandler
   [junit4]   2> 85120 T297 oasc.RequestHandlers.initHandlersFromConfig created /replication: solr.ReplicationHandler
   [junit4]   2> 85121 T297 oasc.RequestHandlers.initHandlersFromConfig created standard: solr.StandardRequestHandler
   [junit4]   2> 85122 T297 oasc.RequestHandlers.initHandlersFromConfig created /get: solr.RealTimeGetHandler
   [junit4]   2> 85127 T297 oasc.RequestHandlers.initHandlersFromConfig created dismax: solr.SearchHandler
   [junit4]   2> 85128 T297 oasc.RequestHandlers.initHandlersFromConfig created mock: org.apache.solr.core.MockQuerySenderListenerReqHandler
   [junit4]   2> 85129 T297 oasc.RequestHandlers.initHandlersFromConfig created /admin/: org.apache.solr.handler.admin.AdminHandlers
   [junit4]   2> 85134 T297 oasc.RequestHandlers.initHandlersFromConfig created /admin/file: solr.admin.ShowFileRequestHandler
   [junit4]   2> 85138 T297 oasc.RequestHandlers.initHandlersFromConfig created /admin/fileedit: solr.admin.EditFileRequestHandler
   [junit4]   2> 85139 T297 oasc.RequestHandlers.initHandlersFromConfig created defaults: solr.StandardRequestHandler
   [junit4]   2> 85140 T297 oasc.RequestHandlers.initHandlersFromConfig adding lazy requestHandler: solr.StandardRequestHandler
   [junit4]   2> 85141 T297 oasc.RequestHandlers.initHandlersFromConfig created lazy: solr.StandardRequestHandler
   [junit4]   2> 85142 T297 oasc.RequestHandlers.initHandlersFromConfig created /update: solr.UpdateRequestHandler
   [junit4]   2> 85155 T297 oasc.RequestHandlers.initHandlersFromConfig created /terms: org.apache.solr.handler.component.SearchHandler
   [junit4]   2> 85156 T297 oasc.RequestHandlers.initHandlersFromConfig created spellCheckCompRH: org.apache.solr.handler.component.SearchHandler
   [junit4]   2> 85158 T297 oasc.RequestHandlers.initHandlersFromConfig created spellCheckCompRH_Direct: org.apache.solr.handler.component.SearchHandler
   [junit4]   2> 85159 T297 oasc.RequestHandlers.initHandlersFromConfig created spellCheckWithWordbreak: org.apache.solr.handler.component.SearchHandler
   [junit4]   2> 85160 T297 oasc.RequestHandlers.initHandlersFromConfig created spellCheckWithWordbreak_Direct: org.apache.solr.handler.component.SearchHandler
   [junit4]   2> 85161 T297 oasc.RequestHandlers.initHandlersFromConfig created spellCheckCompRH1: org.apache.solr.handler.component.SearchHandler
   [junit4]   2> 85184 T297 oasc.RequestHandlers.initHandlersFromConfig created mltrh: org.apache.solr.handler.component.SearchHandler
   [junit4]   2> 85187 T297 oasc.RequestHandlers.initHandlersFromConfig created tvrh: org.apache.solr.handler.component.SearchHandler
   [junit4]   2> 85188 T297 oasc.RequestHandlers.initHandlersFromConfig created /mlt: solr.MoreLikeThisHandler
   [junit4]   2> 85189 T297 oasc.RequestHandlers.initHandlersFromConfig created /debug/dump: solr.DumpRequestHandler
   [junit4]   2> 85191 T297 oashl.XMLLoader.init xsltCacheLifetimeSeconds=60
   [junit4]   2> 85194 T297 oasc.SolrCore.initDeprecatedSupport WARN solrconfig.xml uses deprecated <admin/gettableFiles>, Please update your config to use the ShowFileRequestHandler.
   [junit4]   2> 85216 T297 oasu.CommitTracker.<init> Hard AutoCommit: disabled
   [junit4]   2> 85218 T297 oasu.CommitTracker.<init> Soft AutoCommit: disabled
   [junit4]   2> 85233 T297 oass.SolrIndexSearcher.<init> Opening Searcher@8d7632f6[collection1] main
   [junit4]   2> 85234 T297 oasr.RestManager.init Initializing RestManager with initArgs: {storageIO=org.apache.solr.rest.ManagedResourceStorage$InMemoryStorageIO}
   [junit4]   2> 85237 T297 oasr.ManagedResourceStorage.load Reading _rest_managed.json using InMemoryStorage
   [junit4]   2> 85238 T297 oasr.ManagedResource.reloadFromStorage WARN No stored data found for /rest/managed
   [junit4]   2> 85239 T297 oasr.ManagedResource.notifyObserversDuringInit WARN No registered observers for /rest/managed
   [junit4]   2> 85240 T297 oasr.RestManager.init Initializing 0 registered ManagedResources
   [junit4]   2> 85241 T297 oashc.SpellCheckComponent.inform Initializing spell checkers
   [junit4]   2> 85244 T297 oass.DirectSolrSpellChecker.init init: {name=direct,classname=DirectSolrSpellChecker,field=lowerfilt,minQueryLength=3}
   [junit4]   2> 85282 T301 oasc.SolrCore.registerSearcher [collection1] Registered new searcher Searcher@8d7632f6[collection1] main{UninvertingDirectoryReader()}
   [junit4]   2> 85355 T297 oasu.DefaultSolrCoreState.newIndexWriter Creating new IndexWriter...
   [junit4]   2> 85355 T297 oasu.DefaultSolrCoreState.newIndexWriter Waiting until IndexWriter is unused... core=collection1
   [junit4]   2> 85356 T297 oasu.DefaultSolrCoreState.newIndexWriter Closing old IndexWriter... core=collection1
   [junit4]   2> 85379 T297 oasu.RandomMergePolicy.<init> RandomMergePolicy wrapping class org.apache.lucene.index.TieredMergePolicy: [TieredMergePolicy: maxMergeAtOnce=26, maxMergeAtOnceExplicit=13, maxMergedSegmentMB=44.4326171875, floorSegmentMB=1.0390625, forceMergeDeletesPctAllowed=10.780591935453442, segmentsPerTier=23.0, maxCFSSegmentSizeMB=8.796093022207999E12, noCFSRatio=0.5219433601853941
   [junit4]   2> 85382 T297 oasc.SolrDeletionPolicy.onInit SolrDeletionPolicy.onInit: commits: num=1
   [junit4]   2> 		commit{dir=RateLimitedDirectoryWrapper(MockDirectoryWrapper(RAMDirectory@6da717bf lockFactory=org.apache.lucene.store.SingleInstanceLockFactory@5c0120fe)),segFN=segments_1,generation=1}
   [junit4]   2> 85382 T297 oasc.SolrDeletionPolicy.updateCommits newest commit generation = 1
   [junit4]   2> 85383 T297 oasu.DefaultSolrCoreState.newIndexWriter New IndexWriter is ready to be used.
   [junit4]   2> 85386 T297 oass.SolrIndexSearcher.<init> Opening Searcher@3c468bd[collection1] main
   [junit4]   2> 85392 T301 oasc.SolrCore.registerSearcher [collection1] Registered new searcher Searcher@3c468bd[collection1] main{UninvertingDirectoryReader()}
   [junit4]   2> 85394 T297 oasc.CoreContainer.registerCore replacing core: collection1
   [junit4]   2> 85394 T297 oasc.SolrCore.close [collection1]  CLOSING SolrCore org.apache.solr.core.SolrCore@36fae866
   [junit4]   2> 85450 T297 oasu.DirectUpdateHandler2.close closing DirectUpdateHandler2{commits=0,autocommits=0,soft autocommits=0,optimizes=0,rollbacks=0,expungeDeletes=0,docsPending=0,adds=0,deletesById=0,deletesByQuery=1,errors=0,cumulative_adds=0,cumulative_deletesById=0,cumulative_deletesByQuery=1,cumulative_errors=0,transaction_logs_total_size=0,transaction_logs_total_number=0}
   [junit4]   2> 85450 T297 oasc.SolrCore.closeSearcher [collection1] Closing main searcher on request.
   [junit4]   2> 86689 T297 oasup.LogUpdateProcessor.finish [collection1] {add=[529 (1469175250081021952)]} 0 1235
   [junit4]   2> 87689 T302 oasu.DirectUpdateHandler2.commit start commit{,optimize=false,openSearcher=true,waitSearcher=true,expungeDeletes=false,softCommit=true,prepareCommit=false}
   [junit4]   2> 87695 T302 oass.SolrIndexSearcher.<init> Opening Searcher@981d5a5e[collection1] main
   [junit4]   2> 87696 T302 oasu.DirectUpdateHandler2.commit end_commit_flush
   [junit4]   2> 87699 T301 oasc.SolrCore.registerSearcher [collection1] Registered new searcher Searcher@981d5a5e[collection1] main{UninvertingDirectoryReader(Uninverting(_0(5.0):c1))}
   [junit4]   2> ASYNC  NEW_CORE C369 name=collection1 org.apache.solr.core.SolrCore@883f8ec7
   [junit4]   2> 89050 T297 C369 oasc.SolrCore.execute [collection1] webapp=null path=null params={rows=20&qt=standard&start=0&q=id:529&version=2.2} hits=1 status=0 QTime=2360 
   [junit4]   2> 89099 T297 oas.SolrTestCaseJ4.assertQ ERROR REQUEST FAILED: xpath=//result[@numFound=0]
   [junit4]   2> 		xml response was: <?xml version="1.0" encoding="UTF-8"?>
   [junit4]   2> 	<response>
   [junit4]   2> 	<lst name="responseHeader"><int name="status">0</int><int name="QTime">2360</int></lst><result name="response" numFound="1" start="0"><doc><int name="id">529</int><arr name="range_facet_l"><long>529</long></arr><arr name="field_t"><str>what's inside?</str></arr><arr name="subject"><str>info</str></arr><long name="_version_">1469175250081021952</long><int name="intDefault">42</int><arr name="multiDefault"><str>muLti-Default</str></arr><date name="timestamp">2014-05-26T14:31:42.302Z</date></doc></result>
   [junit4]   2> 	</response>
   [junit4]   2> 	
   [junit4]   2> 		request was:rows=20&qt=standard&start=0&q=id:529&version=2.2
   [junit4]   2> 89101 T297 oasc.SolrException.log ERROR REQUEST FAILED: rows=20&qt=standard&start=0&q=id:529&version=2.2:java.lang.RuntimeException: REQUEST FAILED: xpath=//result[@numFound=0]
   [junit4]   2> 		xml response was: <?xml version="1.0" encoding="UTF-8"?>
   [junit4]   2> 	<response>
   [junit4]   2> 	<lst name="responseHeader"><int name="status">0</int><int name="QTime">2360</int></lst><result name="response" numFound="1" start="0"><doc><int name="id">529</int><arr name="range_facet_l"><long>529</long></arr><arr name="field_t"><str>what's inside?</str></arr><arr name="subject"><str>info</str></arr><long name="_version_">1469175250081021952</long><int name="intDefault">42</int><arr name="multiDefault"><str>muLti-Default</str></arr><date name="timestamp">2014-05-26T14:31:42.302Z</date></doc></result>
   [junit4]   2> 	</response>
   [junit4]   2> 	
   [junit4]   2> 		request was:rows=20&qt=standard&start=0&q=id:529&version=2.2
   [junit4]   2> 		at org.apache.solr.SolrTestCaseJ4.assertQ(SolrTestCaseJ4.java:712)
   [junit4]   2> 		at org.apache.solr.update.AutoCommitTest.testMaxTime(AutoCommitTest.java:227)
   [junit4]   2> 		at sun.reflect.NativeMethodAccessorImpl.invoke0(Native Method)
   [junit4]   2> 		at sun.reflect.NativeMethodAccessorImpl.invoke(NativeMethodAccessorImpl.java:94)
   [junit4]   2> 		at sun.reflect.DelegatingMethodAccessorImpl.invoke(DelegatingMethodAccessorImpl.java:55)
   [junit4]   2> 		at java.lang.reflect.Method.invoke(Method.java:619)
   [junit4]   2> 		at com.carrotsearch.randomizedtesting.RandomizedRunner.invoke(RandomizedRunner.java:1618)
   [junit4]   2> 		at com.carrotsearch.randomizedtesting.RandomizedRunner$6.evaluate(RandomizedRunner.java:827)
   [junit4]   2> 		at com.carrotsearch.randomizedtesting.RandomizedRunner$7.evaluate(RandomizedRunner.java:863)
   [junit4]   2> 		at com.carrotsearch.randomizedtesting.RandomizedRunner$8.evaluate(RandomizedRunner.java:877)
   [junit4]   2> 		at com.carrotsearch.randomizedtesting.rules.SystemPropertiesRestoreRule$1.evaluate(SystemPropertiesRestoreRule.java:53)
   [junit4]   2> 		at org.apache.lucene.util.TestRuleSetupTeardownChained$1.evaluate(TestRuleSetupTeardownChained.java:50)
   [junit4]   2> 		at org.apache.lucene.util.AbstractBeforeAfterRule$1.evaluate(AbstractBeforeAfterRule.java:46)
   [junit4]   2> 		at com.carrotsearch.randomizedtesting.rules.SystemPropertiesInvariantRule$1.evaluate(SystemPropertiesInvariantRule.java:55)
   [junit4]   2> 		at org.apache.lucene.util.TestRuleThreadAndTestName$1.evaluate(TestRuleThreadAndTestName.java:49)
   [junit4]   2> 		at org.apache.lucene.util.TestRuleIgnoreAfterMaxFailures$1.evaluate(TestRuleIgnoreAfterMaxFailures.java:65)
   [junit4]   2> 		at org.apache.lucene.util.TestRuleMarkFailure$1.evaluate(TestRuleMarkFailure.java:48)
   [junit4]   2> 		at com.carrotsearch.randomizedtesting.rules.StatementAdapter.evaluate(StatementAdapter.java:36)
   [junit4]   2> 		at com.carrotsearch.randomizedtesting.ThreadLeakControl$StatementRunner.run(ThreadLeakControl.java:360)
   [junit4]   2> 		at com.carrotsearch.randomizedtesting.ThreadLeakControl.forkTimeoutingTask(ThreadLeakControl.java:793)
   [junit4]   2> 		at com.carrotsearch.randomizedtesting.ThreadLeakControl$3.evaluate(ThreadLeakControl.java:453)
   [junit4]   2> 		at com.carrotsearch.randomizedtesting.RandomizedRunner.runSingleTest(RandomizedRunner.java:836)
   [junit4]   2> 		at com.carrotsearch.randomizedtesting.RandomizedRunner$3.evaluate(RandomizedRunner.java:738)
   [junit4]   2> 		at com.carrotsearch.randomizedtesting.RandomizedRunner$4.evaluate(RandomizedRunner.java:772)
   [junit4]   2> 		at com.carrotsearch.randomizedtesting.RandomizedRunner$5.evaluate(RandomizedRunner.java:783)
   [junit4]   2> 		at com.carrotsearch.randomizedtesting.rules.StatementAdapter.evaluate(StatementAdapter.java:36)
   [junit4]   2> 		at com.carrotsearch.randomizedtesting.rules.SystemPropertiesRestoreRule$1.evaluate(SystemPropertiesRestoreRule.java:53)
   [junit4]   2> 		at org.apache.lucene.util.AbstractBeforeAfterRule$1.evaluate(AbstractBeforeAfterRule.java:46)
   [junit4]   2> 		at org.apache.lucene.util.TestRuleStoreClassName$1.evaluate(TestRuleStoreClassName.java:42)
   [junit4]   2> 		at com.carrotsearch.randomizedtesting.rules.SystemPropertiesInvariantRule$1.evaluate(SystemPropertiesInvariantRule.java:55)
   [junit4]   2> 		at com.carrotsearch.randomizedtesting.rules.NoShadowingOrOverridesOnMethodsRule$1.evaluate(NoShadowingOrOverridesOnMethodsRule.java:39)
   [junit4]   2> 		at com.carrotsearch.randomizedtesting.rules.NoShadowingOrOverridesOnMethodsRule$1.evaluate(NoShadowingOrOverridesOnMethodsRule.java:39)
   [junit4]   2> 		at com.carrotsearch.randomizedtesting.rules.StatementAdapter.evaluate(StatementAdapter.java:36)
   [junit4]   2> 		at com.carrotsearch.randomizedtesting.rules.StatementAdapter.evaluate(StatementAdapter.java:36)
   [junit4]   2> 		at com.carrotsearch.randomizedtesting.rules.StatementAdapter.evaluate(StatementAdapter.java:36)
   [junit4]   2> 		at org.apache.lucene.util.TestRuleAssertionsRequired$1.evaluate(TestRuleAssertionsRequired.java:43)
   [junit4]   2> 		at org.apache.lucene.util.TestRuleMarkFailure$1.evaluate(TestRuleMarkFailure.java:48)
   [junit4]   2> 		at org.apache.lucene.util.TestRuleIgnoreAfterMaxFailures$1.evaluate(TestRuleIgnoreAfterMaxFailures.java:65)
   [junit4]   2> 		at org.apache.lucene.util.TestRuleIgnoreTestSuites$1.evaluate(TestRuleIgnoreTestSuites.java:55)
   [junit4]   2> 		at com.carrotsearch.randomizedtesting.rules.StatementAdapter.evaluate(StatementAdapter.java:36)
   [junit4]   2> 		at com.carrotsearch.randomizedtesting.ThreadLeakControl$StatementRunner.run(ThreadLeakControl.java:360)
   [junit4]   2> 		at java.lang.Thread.run(Thread.java:853)
   [junit4]   2> 	
   [junit4]   2> 89102 T297 oas.SolrTestCaseJ4.tearDown ###Ending testMaxTime
   [junit4]   2> NOTE: reproduce with: ant test  -Dtestcase=AutoCommitTest -Dtests.method=testMaxTime -Dtests.seed=22EDC1625D28A4D7 -Dtests.multiplier=3 -Dtests.slow=true -Dtests.locale=ru -Dtests.timezone=America/Paramaribo -Dtests.file.encoding=US-ASCII
   [junit4] ERROR   4.69s J0 | AutoCommitTest.testMaxTime <<<
   [junit4]    > Throwable #1: java.lang.RuntimeException: Exception during query
   [junit4]    > 	at __randomizedtesting.SeedInfo.seed([22EDC1625D28A4D7:B819BC80C3B238EB]:0)
   [junit4]    > 	at org.apache.solr.SolrTestCaseJ4.assertQ(SolrTestCaseJ4.java:719)
   [junit4]    > 	at org.apache.solr.update.AutoCommitTest.testMaxTime(AutoCommitTest.java:227)
   [junit4]    > 	at java.lang.Thread.run(Thread.java:853)
   [junit4]    > Caused by: java.lang.RuntimeException: REQUEST FAILED: xpath=//result[@numFound=0]
   [junit4]    > 	xml response was: <?xml version="1.0" encoding="UTF-8"?>
   [junit4]    > <response>
   [junit4]    > <lst name="responseHeader"><int name="status">0</int><int name="QTime">2360</int></lst><result name="response" numFound="1" start="0"><doc><int name="id">529</int><arr name="range_facet_l"><long>529</long></arr><arr name="field_t"><str>what's inside?</str></arr><arr name="subject"><str>info</str></arr><long name="_version_">1469175250081021952</long><int name="intDefault">42</int><arr name="multiDefault"><str>muLti-Default</str></arr><date name="timestamp">2014-05-26T14:31:42.302Z</date></doc></result>
   [junit4]    > </response>
   [junit4]    > 	request was:rows=20&qt=standard&start=0&q=id:529&version=2.2
   [junit4]    > 	at org.apache.solr.SolrTestCaseJ4.assertQ(SolrTestCaseJ4.java:712)
   [junit4]    > 	... 41 more
   [junit4]   2> 89147 T297 oas.SolrTestCaseJ4.setUp ###Starting testMaxDocs
   [junit4]   2> 89150 T297 C369 oass.SolrIndexSearcher.<init> Opening Searcher@798df734[collection1] realtime
   [junit4]   2> 89155 T297 C369 oasup.LogUpdateProcessor.finish [collection1] webapp=null path=null params={} {deleteByQuery=*:* (-1469175252661567488)} 0 7
   [junit4]   2> 89397 T297 oasc.SolrResourceLoader.<init> new SolrResourceLoader for directory: '/mnt/ssd/jenkins/workspace/Lucene-Solr-trunk-Linux/solr/core/src/test-files/solr/collection1/'
   [junit4]   2> 89398 T297 oasc.SolrResourceLoader.replaceClassLoader Adding 'file:/mnt/ssd/jenkins/workspace/Lucene-Solr-trunk-Linux/solr/core/src/test-files/solr/collection1/lib/.svn/' to classloader
   [junit4]   2> 89399 T297 oasc.SolrResourceLoader.replaceClassLoader Adding 'file:/mnt/ssd/jenkins/workspace/Lucene-Solr-trunk-Linux/solr/core/src/test-files/solr/collection1/lib/classes/' to classloader
   [junit4]   2> 89399 T297 oasc.SolrResourceLoader.replaceClassLoader Adding 'file:/mnt/ssd/jenkins/workspace/Lucene-Solr-trunk-Linux/solr/core/src/test-files/solr/collection1/lib/README' to classloader
   [junit4]   2> 89476 T297 oasc.SolrConfig.<init> Using Lucene MatchVersion: LUCENE_5_0
   [junit4]   2> 89567 T297 oasc.SolrConfig.<init> Loaded SolrConfig: solrconfig.xml
   [junit4]   2> 89568 T297 oass.IndexSchema.readSchema Reading Solr Schema from schema.xml
   [junit4]   2> 89600 T297 oass.IndexSchema.readSchema [collection1] Schema name=test
   [junit4]   2> 90015 T297 oass.OpenExchangeRatesOrgProvider.init Initialized with rates=open-exchange-rates.json, refreshInterval=1440.
   [junit4]   2> 90024 T297 oass.IndexSchema.readSchema default search field in schema is text
   [junit4]   2> 90028 T297 oass.IndexSchema.readSchema unique key field: id
   [junit4]   2> 90037 T297 oass.FileExchangeRateProvider.reload Reloading exchange rates from file currency.xml
   [junit4]   2> 90041 T297 oass.FileExchangeRateProvider.reload Reloading exchange rates from file currency.xml
   [junit4]   2> 90044 T297 oass.OpenExchangeRatesOrgProvider.reload Reloading exchange rates from open-exchange-rates.json
   [junit4]   2> 90045 T297 oass.OpenExchangeRatesOrgProvider$OpenExchangeRates.<init> WARN Unknown key IMPORTANT NOTE
   [junit4]   2> 90045 T297 oass.OpenExchangeRatesOrgProvider$OpenExchangeRates.<init> WARN Expected key, got STRING
   [junit4]   2> 90046 T297 oass.OpenExchangeRatesOrgProvider.reload Reloading exchange rates from open-exchange-rates.json
   [junit4]   2> 90046 T297 oass.OpenExchangeRatesOrgProvider$OpenExchangeRates.<init> WARN Unknown key IMPORTANT NOTE
   [junit4]   2> 90047 T297 oass.OpenExchangeRatesOrgProvider$OpenExchangeRates.<init> WARN Expected key, got STRING
   [junit4]   2> 90047 T297 oasc.CoreContainer.reload Reloading SolrCore 'collection1' using configuration from instancedir /mnt/ssd/jenkins/workspace/Lucene-Solr-trunk-Linux/solr/core/src/test-files/solr/collection1/
   [junit4]   2> 90048 T297 oasc.SolrCore.<init> [collection1] Opening new SolrCore at /mnt/ssd/jenkins/workspace/Lucene-Solr-trunk-Linux/solr/core/src/test-files/solr/collection1/, dataDir=/mnt/ssd/jenkins/workspace/Lucene-Solr-trunk-Linux/solr/build/solr-core/test/J0/./temp/solr.update.AutoCommitTest-22EDC1625D28A4D7-001/init-core-data-001/
   [junit4]   2> 90048 T297 oasc.JmxMonitoredMap.<init> JMX monitoring is enabled. Adding Solr mbeans to JMX Server: com.sun.jmx.mbeanserver.JmxMBeanServer@fa4aa6d
   [junit4]   2> 90049 T297 oasc.SolrCore.getNewIndexDir New index directory detected: old=null new=/mnt/ssd/jenkins/workspace/Lucene-Solr-trunk-Linux/solr/build/solr-core/test/J0/./temp/solr.update.AutoCommitTest-22EDC1625D28A4D7-001/init-core-data-001/index/
   [junit4]   2> 90049 T297 oasc.SolrCore.initWriters created xml: solr.XMLResponseWriter
   [junit4]   2> 90055 T297 oasup.UpdateRequestProcessorChain.init creating updateRequestProcessorChain "dedupe"
   [junit4]   2> 90056 T297 oasup.UpdateRequestProcessorChain.init inserting DistributedUpdateProcessorFactory into updateRequestProcessorChain "dedupe"
   [junit4]   2> 90056 T297 oasup.UpdateRequestProcessorChain.init creating updateRequestProcessorChain "dedupe-allfields"
   [junit4]   2> 90057 T297 oasup.UpdateRequestProcessorChain.init inserting DistributedUpdateProcessorFactory into updateRequestProcessorChain "dedupe-allfields"
   [junit4]   2> 90057 T297 oasup.UpdateRequestProcessorChain.init creating updateRequestProcessorChain "stored_sig"
   [junit4]   2> 90058 T297 oasup.UpdateRequestProcessorChain.init inserting DistributedUpdateProcessorFactory into updateRequestProcessorChain "stored_sig"
   [junit4]   2> 90058 T297 oasup.UpdateRequestProcessorChain.init creating updateRequestProcessorChain "uniq-fields"
   [junit4]   2> 90059 T297 oasup.UpdateRequestProcessorChain.init inserting DistributedUpdateProcessorFactory into updateRequestProcessorChain "uniq-fields"
   [junit4]   2> 90059 T297 oasup.UpdateRequestProcessorChain.init creating updateRequestProcessorChain "distrib-dup-test-chain-explicit"
   [junit4]   2> 90060 T297 oasup.UpdateRequestProcessorChain.init creating updateRequestProcessorChain "distrib-dup-test-chain-implicit"
   [junit4]   2> 90060 T297 oasup.UpdateRequestProcessorChain.init inserting DistributedUpdateProcessorFactory into updateRequestProcessorChain "distrib-dup-test-chain-implicit"
   [junit4]   2> 90060 T297 oasc.SolrCore.loadUpdateProcessorChains no updateRequestProcessorChain defined as default, creating implicit default
   [junit4]   2> 90061 T297 oasc.RequestHandlers.initHandlersFromConfig adding lazy requestHandler: solr.ReplicationHandler
   [junit4]   2> 90061 T297 oasc.RequestHandlers.initHandlersFromConfig created /replication: solr.ReplicationHandler
   [junit4]   2> 90062 T297 oasc.RequestHandlers.initHandlersFromConfig created standard: solr.StandardRequestHandler
   [junit4]   2> 90063 T297 oasc.RequestHandlers.initHandlersFromConfig created /get: solr.RealTimeGetHandler
   [junit4]   2> 90063 T297 oasc.RequestHandlers.initHandlersFromConfig created dismax: solr.SearchHandler
   [junit4]   2> 90064 T297 oasc.RequestHandlers.initHandlersFromConfig created mock: org.apache.solr.core.MockQuerySenderListenerReqHandler
   [junit4]   2> 90065 T297 oasc.RequestHandlers.initHandlersFromConfig created /admin/: org.apache.solr.handler.admin.AdminHandlers
   [junit4]   2> 90065 T297 oasc.RequestHandlers.initHandlersFromConfig created /admin/file: solr.admin.ShowFileRequestHandler
   [junit4]   2> 90066 T297 oasc.RequestHandlers.initHandlersFromConfig created /admin/fileedit: solr.admin.EditFileRequestHandler
   [junit4]   2> 90067 T297 oasc.RequestHandlers.initHandlersFromConfig created defaults: solr.StandardRequestHandler
   [junit4]   2> 90067 T297 oasc.RequestHandlers.initHandlersFromConfig adding lazy requestHandler: solr.StandardRequestHandler
   [junit4]   2> 90067 T297 oasc.RequestHandlers.initHandlersFromConfig created lazy: solr.StandardRequestHandler
   [junit4]   2> 90068 T297 oasc.RequestHandlers.initHandlersFromConfig created /update: solr.UpdateRequestHandler
   [junit4]   2> 90069 T297 oasc.RequestHandlers.initHandlersFromConfig created /terms: org.apache.solr.handler.component.SearchHandler
   [junit4]   2> 90070 T297 oasc.RequestHandlers.initHandlersFromConfig created spellCheckCompRH: org.apache.solr.handler.component.SearchHandler
   [junit4]   2> 90070 T297 oasc.RequestHandlers.initHandlersFromConfig created spellCheckCompRH_Direct: org.apache.solr.handler.component.SearchHandler
   [junit4]   2> 90071 T297 oasc.RequestHandlers.initHandlersFromConfig created spellCheckWithWordbreak: org.apache.solr.handler.component.SearchHandler
   [junit4]   2> 90072 T297 oasc.RequestHandlers.initHandlersFromConfig created spellCheckWithWordbreak_Direct: org.apache.solr.handler.component.SearchHandler
   [junit4]   2> 90072 T297 oasc.RequestHandlers.initHandlersFromConfig created spellCheckCompRH1: org.apache.solr.handler.component.SearchHandler
   [junit4]   2> 90073 T297 oasc.RequestHandlers.initHandlersFromConfig created mltrh: org.apache.solr.handler.component.SearchHandler
   [junit4]   2> 90074 T297 oasc.RequestHandlers.initHandlersFromConfig created tvrh: org.apache.solr.handler.component.SearchHandler
   [junit4]   2> 90074 T297 oasc.RequestHandlers.initHandlersFromConfig created /mlt: solr.MoreLikeThisHandler
   [junit4]   2> 90075 T297 oasc.RequestHandlers.initHandlersFromConfig created /debug/dump: solr.DumpRequestHandler
   [junit4]   2> 90076 T297 oashl.XMLLoader.init xsltCacheLifetimeSeconds=60
   [junit4]   2> 90078 T297 oasc.SolrCore.initDeprecatedSupport WARN solrconfig.xml uses deprecated <admin/gettableFiles>, Please update your config to use the ShowFileRequestHandler.
   [junit4]   2> 90080 T297 oasu.CommitTracker.<init> Hard AutoCommit: disabled
   [junit4]   2> 90080 T297 oasu.CommitTracker.<init> Soft AutoCommit: disabled
   [junit4]   2> 90081 T297 oass.SolrIndexSearcher.<init> Opening Searcher@6b80a83e[collection1] main
   [junit4]   2> 90082 T297 oasr.RestManager.init Initializing RestManager with initArgs: {storageIO=org.apache.solr.rest.ManagedResourceStorage$InMemoryStorageIO}
   [junit4]   2> 90082 T297 oasr.ManagedResourceStorage.load Reading _rest_managed.json using InMemoryStorage
   [junit4]   2> 90083 T297 oasr.ManagedResource.reloadFromStorage WARN No stored data found for /rest/managed
   [junit4]   2> 90083 T297 oasr.ManagedResource.notifyObserversDuringInit WARN No registered observers for /rest/managed
   [junit4]   2> 90084 T297 oasr.RestManager.init Initializing 0 registered ManagedResources
   [junit4]   2> 90084 T297 oashc.SpellCheckComponent.inform Initializing spell checkers
   [junit4]   2> 90086 T297 oass.DirectSolrSpellChecker.init init: {name=direct,classname=DirectSolrSpellChecker,field=lowerfilt,minQueryLength=3}
   [junit4]   2> 90098 T303 oasc.SolrCore.registerSearcher [collection1] Registered new searcher Searcher@6b80a83e[collection1] main{UninvertingDirectoryReader()}
   [junit4]   2> 90107 T297 oasu.DefaultSolrCoreState.newIndexWriter Creating new IndexWriter...
   [junit4]   2> 90108 T297 oasu.DefaultSolrCoreState.newIndexWriter Waiting until IndexWriter is unused... core=collection1
   [junit4]   2> 90108 T297 oasu.DefaultSolrCoreState.newIndexWriter Closing old IndexWriter... core=collection1
   [junit4]   2> 90109 T297 oasc.SolrDeletionPolicy.onCommit SolrDeletionPolicy.onCommit: commits: num=2
   [junit4]   2> 		commit{dir=RateLimitedDirectoryWrapper(MockDirectoryWrapper(RAMDirectory@6da717bf lockFactory=org.apache.lucene.store.SingleInstanceLockFactory@5c0120fe)),segFN=segments_1,generation=1}
   [junit4]   2> 		commit{dir=RateLimitedDirectoryWrapper(MockDirectoryWrapper(RAMDirectory@6da717bf lockFactory=org.apache.lucene.store.SingleInstanceLockFactory@5c0120fe)),segFN=segments_2,generation=2}
   [junit4]   2> 90110 T297 oasc.SolrDeletionPolicy.updateCommits newest commit generation = 2
   [junit4]   2> 90110 T297 oasu.RandomMergePolicy.<init> RandomMergePolicy wrapping class org.apache.lucene.index.LogDocMergePolicy: [LogDocMergePolicy: minMergeSize=1000, mergeFactor=27, maxMergeSize=9223372036854775807, maxMergeSizeForForcedMerge=9223372036854775807, calibrateSizeByDeletes=false, maxMergeDocs=2147483647, maxCFSSegmentSizeMB=8.796093022207999E12, noCFSRatio=0.5081559375231061]
   [junit4]   2> 90112 T297 oasc.SolrDeletionPolicy.onInit SolrDeletionPolicy.onInit: commits: num=1
   [junit4]   2> 		commit{dir=RateLimitedDirectoryWrapper(MockDirectoryWrapper(RAMDirectory@6da717bf lockFactory=org.apache.lucene.store.SingleInstanceLockFactory@5c0120fe)),segFN=segments_2,generation=2}
   [junit4]   2> 90113 T297 oasc.SolrDeletionPolicy.updateCommits newest commit generation = 2
   [junit4]   2> 90113 T297 oasu.DefaultSolrCoreState.newIndexWriter New IndexWriter is ready to be used.
   [junit4]   2> 90114 T297 oass.SolrIndexSearcher.<init> Opening Searcher@492901e0[collection1] main
   [junit4]   2> 90114 T297 oasc.CoreContainer.registerCore replacing core: collection1
   [junit4]   2> 90115 T297 oasc.SolrCore.close [collection1]  CLOSING SolrCore org.apache.solr.core.SolrCore@883f8ec7
   [junit4]   2> 90117 T303 oasc.SolrCore.registerSearcher [collection1] Registered new searcher Searcher@492901e0[collection1] main{UninvertingDirectoryReader()}
   [junit4]   2> 90125 T297 oasu.DirectUpdateHandler2.close closing DirectUpdateHandler2{commits=1,autocommits=0,soft autocommit maxTime=1000ms,soft autocommits=1,optimizes=0,rollbacks=0,expungeDeletes=0,docsPending=1,adds=0,deletesById=0,deletesByQuery=1,errors=0,cumulative_adds=1,cumulative_deletesById=0,cumulative_deletesByQuery=1,cumulative_errors=0,transaction_logs_total_size=0,transaction_logs_total_number=0}
   [junit4]   2> 90126 T297 oasc.SolrCore.closeSearcher [collection1] Closing main searcher on request.
   [junit4]   2> 90244 T297 oasup.LogUpdateProcessor.finish [collection1] {add=[0 (1469175253809758208)]} 0 116
   [junit4]   2> 90245 T297 oasup.LogUpdateProcessor.finish [collection1] {add=[1 (1469175253811855360)]} 0 116
   [junit4]   2> 90246 T297 oasup.LogUpdateProcessor.finish [collection1] {add=[2 (1469175253812903936)]} 0 116
   [junit4]   2> 90247 T297 oasup.LogUpdateProcessor.finish [collection1] {add=[3 (1469175253813952512)]} 0 116
   [junit4]   2> 90248 T297 oasup.LogUpdateProcessor.finish [collection1] {add=[4 (1469175253815001088)]} 0 116
   [junit4]   2> 90249 T297 oasup.LogUpdateProcessor.finish [collection1] {add=[5 (1469175253816049664)]} 0 116
   [junit4]   2> 90250 T297 oasup.LogUpdateProcessor.finish [collection1] {add=[6 (1469175253817098240)]} 0 116
   [junit4]   2> 90251 T297 oasup.LogUpdateProcessor.finish [collection1] {add=[7 (1469175253818146816)]} 0 116
   [junit4]   2> 90252 T297 oasup.LogUpdateProcessor.finish [collection1] {add=[8 (1469175253819195392)]} 0 116
   [junit4]   2> 90253 T297 oasup.LogUpdateProcessor.finish [collection1] {add=[9 (1469175253820243968)]} 0 116
   [junit4]   2> 90254 T297 oasup.LogUpdateProcessor.finish [collection1] {add=[10 (1469175253821292544)]} 0 116
   [junit4]   2> 90255 T297 oasup.LogUpdateProcessor.finish [collection1] {add=[11 (1469175253822341120)]} 0 116
   [junit4]   2> 90256 T297 oasup.LogUpdateProcessor.finish [collection1] {add=[12 (1469175253823389696)]} 0 116
   [junit4]   2> 90258 T297 oasup.LogUpdateProcessor.finish [collection1] {add=[13 (1469175253824438272)]} 0 116
   [junit4]   2> ASYNC  NEW_CORE C370 name=collection1 org.apache.solr.core.SolrCore@b71184fa
   [junit4]   2> 90265 T297 C370 oasc.SolrCore.execute [collection1] webapp=null path=null params={rows=20&qt=standard&start=0&q=id:1&version=2.2} hits=0 status=0 QTime=6 
   [junit4]   2> 90268 T297 oasup.LogUpdateProcessor.finish [collection1] {add=[14 (1469175253835972608)]} 0 116
   [junit4]   2> 90269 T304 oasu.DirectUpdateHandler2.commit start commit{,optimize=false,openSearcher=true,waitSearcher=true,expungeDeletes=false,softCommit=true,prepareCommit=false}
   [junit4]   2> 90276 T304 oass.SolrIndexSearcher.<init> Opening Searcher@6fcf431a[collection1] main
   [junit4]   2> 90277 T304 oasu.DirectUpdateHandler2.commit end_commit_flush
   [junit4]   2> 90279 T303 oasc.SolrCore.registerSearcher [collection1] Registered new searcher Searcher@6fcf431a[collection1] main{UninvertingDirectoryReader(Uninverting(_1(5.0):c15))}
   [junit4]   2> 90521 T297 oasup.LogUpdateProcessor.finish [collection1] {add=[15 (1469175254100213760)]} 0 116
   [junit4]   2> 90523 T297 C370 oasc.SolrCore.execute [collection1] webapp=null path=null params={rows=20&qt=standard&start=0&q=id:14&version=2.2} hits=1 status=0 QTime=1 
   [junit4]   2> 90527 T297 C370 oasc.SolrCore.execute [collection1] webapp=null path=null params={rows=20&qt=standard&start=0&q=id:15&version=2.2} hits=0 status=0 QTime=0 
   [junit4]   2> 90529 T297 oas.SolrTestCaseJ4.tearDown ###Ending testMaxDocs
   [junit4]   2> 90535 T297 oas.SolrTestCaseJ4.setUp ###Starting testCommitWithin
   [junit4]   2> 90540 T297 C370 oass.SolrIndexSearcher.<init> Opening Searcher@171408b5[collection1] realtime
   [junit4]   2> 90541 T297 C370 oasup.LogUpdateProcessor.finish [collection1] webapp=null path=null params={} {deleteByQuery=*:* (-1469175254115942400)} 0 6
   [junit4]   2> 90543 T297 oasc.SolrResourceLoader.<init> new SolrResourceLoader for directory: '/mnt/ssd/jenkins/workspace/Lucene-Solr-trunk-Linux/solr/core/src/test-files/solr/collection1/'
   [junit4]   2> 90544 T297 oasc.SolrResourceLoader.replaceClassLoader Adding 'file:/mnt/ssd/jenkins/workspace/Lucene-Solr-trunk-Linux/solr/core/src/test-files/solr/collection1/lib/.svn/' to classloader
   [junit4]   2> 90545 T297 oasc.SolrResourceLoader.replaceClassLoader Adding 'file:/mnt/ssd/jenkins/workspace/Lucene-Solr-trunk-Linux/solr/core/src/test-files/solr/collection1/lib/classes/' to classloader
   [junit4]   2> 90545 T297 oasc.SolrResourceLoader.replaceClassLoader Adding 'file:/mnt/ssd/jenkins/workspace/Lucene-Solr-trunk-Linux/solr/core/src/test-files/solr/collection1/lib/README' to classloader
   [junit4]   2> 90603 T297 oasc.SolrConfig.<init> Using Lucene MatchVersion: LUCENE_5_0
   [junit4]   2> 90684 T297 oasc.SolrConfig.<init> Loaded SolrConfig: solrconfig.xml
   [junit4]   2> 90685 T297 oass.IndexSchema.readSchema Reading Solr Schema from schema.xml
   [junit4]   2> 90694 T297 oass.IndexSchema.readSchema [collection1] Schema name=test
   [junit4]   2> 91038 T297 oass.OpenExchangeRatesOrgProvider.init Initialized with rates=open-exchange-rates.json, refreshInterval=1440.
   [junit4]   2> 91045 T297 oass.IndexSchema.readSchema default search field in schema is text
   [junit4]   2> 91048 T297 oass.IndexSchema.readSchema unique key field: id
   [junit4]   2> 91054 T297 oass.FileExchangeRateProvider.reload Reloading exchange rates from file currency.xml
   [junit4]   2> 91058 T297 oass.FileExchangeRateProvider.reload Reloading exchange rates from file currency.xml
   [junit4]   2> 91062 T297 oass.OpenExchangeRatesOrgProvider.reload Reloading exchange rates from open-exchange-rates.json
   [junit4]   2> 91062 T297 oass.OpenExchangeRatesOrgProvider$OpenExchangeRates.<init> WARN Unknown key IMPORTANT NOTE
   [junit4]   2> 91063 T297 oass.OpenExchangeRatesOrgProvider$OpenExchangeRates.<init> WARN Expected key, got STRING
   [junit4]   2> 91063 T297 oass.OpenExchangeRatesOrgProvider.reload Reloading exchange rates from open-exchange-rates.json
   [junit4]   2> 91064 T297 oass.OpenExchangeRatesOrgProvider$OpenExchangeRates.<init> WARN Unknown key IMPORTANT NOTE
   [junit4]   2> 91064 T297 oass.OpenExchangeRatesOrgProvider$OpenExchangeRates.<init> WARN Expected key, got STRING
   [junit4]   2> 91065 T297 oasc.CoreContainer.reload Reloading SolrCore 'collection1' using configuration from instancedir /mnt/ssd/jenkins/workspace/Lucene-Solr-trunk-Linux/solr/core/src/test-files/solr/collection1/
   [junit4]   2> 91065 T297 oasc.SolrCore.<init> [collection1] Opening new SolrCore at /mnt/ssd/jenkins/workspace/Lucene-Solr-trunk-Linux/solr/core/src/test-files/solr/collection1/, dataDir=/mnt/ssd/jenkins/workspace/Lucene-Solr-trunk-Linux/solr/build/solr-core/test/J0/./temp/solr.update.AutoCommitTest-22EDC1625D28A4D7-001/init-core-data-001/
   [junit4]   2> 91066 T297 oasc.JmxMonitoredMap.<init> JMX monitoring is enabled. Adding Solr mbeans to JMX Server: com.sun.jmx.mbeanserver.JmxMBeanServer@fa4aa6d
   [junit4]   2> 91067 T297 oasc.SolrCore.getNewIndexDir New index directory detected: old=null new=/mnt/ssd/jenkins/workspace/Lucene-Solr-trunk-Linux/solr/build/solr-core/test/J0/./temp/solr.update.AutoCommitTest-22EDC1625D28A4D7-001/init-core-data-001/index/
   [junit4]   2> 91067 T297 oasc.SolrCore.initWriters created xml: solr.XMLResponseWriter
   [junit4]   2> 91071 T297 oasup.UpdateRequestProcessorChain.init creating updateRequestProcessorChain "dedupe"
   [junit4]   2> 91072 T297 oasup.UpdateRequestProcessorChain.init inserting DistributedUpdateProcessorFactory into updateRequestProcessorChain "dedupe"
   [junit4]   2> 91072 T297 oasup.UpdateRequestProcessorChain.init creating updateRequestProcessorChain "dedupe-allfields"
   [junit4]   2> 91072 T297 oasup.UpdateRequestProcessorChain.init inserting DistributedUpdateProcessorFactory into updateRequestProcessorChain "dedupe-allfields"
   [junit4]   2> 91073 T297 oasup.UpdateRequestProcessorChain.init creating updateRequestProcessorChain "stored_sig"
   [junit4]   2> 91073 T297 oasup.UpdateRequestProcessorChain.init inserting DistributedUpdateProcessorFactory into updateRequestProcessorChain "stored_sig"
   [junit4]   2> 91074 T297 oasup.UpdateRequestProcessorChain.init creating updateRequestProcessorChain "uniq-fields"
   [junit4]   2> 91074 T297 oasup.UpdateRequestProcessorChain.init inserting DistributedUpdateProcessorFactory into updateRequestProcessorChain "uniq-fields"
   [junit4]   2> 91074 T297 oasup.UpdateRequestProcessorChain.init creating updateRequestProcessorChain "distrib-dup-test-chain-explicit"
   [junit4]   2> 91075 T297 oasup.UpdateRequestProcessorChain.init creating updateRequestProcessorChain "distrib-dup-test-chain-implicit"
   [junit4]   2> 91075 T297 oasup.UpdateRequestProcessorChain.init inserting DistributedUpdateProcessorFactory into updateRequestProcessorChain "distrib-dup-test-chain-implicit"
   [junit4]   2> 91076 T297 oasc.SolrCore.loadUpdateProcessorChains no updateRequestProcessorChain defined as default, creating implicit default
   [junit4]   2> 91076 T297 oasc.RequestHandlers.initHandlersFromConfig adding lazy requestHandler: solr.ReplicationHandler
   [junit4]   2> 91076 T297 oasc.RequestHandlers.initHandlersFromConfig created /replication: solr.ReplicationHandler
   [junit4]   2> 91077 T297 oasc.RequestHandlers.initHandlersFromConfig created standard: solr.StandardRequestHandler
   [junit4]   2> 91078 T297 oasc.RequestHandlers.initHandlersFromConfig created /get: solr.RealTimeGetHandler
   [junit4]   2> 91079 T297 oasc.RequestHandlers.initHandlersFromConfig created dismax: solr.SearchHandler
   [junit4]   2> 91080 T297 oasc.RequestHandlers.initHandlersFromConfig created mock: org.apache.solr.core.MockQuerySenderListenerReqHandler
   [junit4]   2> 91081 T297 oasc.RequestHandlers.initHandlersFromConfig created /admin/: org.apache.solr.handler.admin.AdminHandlers
   [junit4]   2> 91082 T297 oasc.RequestHandlers.initHandlersFromConfig created /admin/file: solr.admin.ShowFileRequestHandler
   [junit4]   2> 91083 T297 oasc.RequestHandlers.initHandlersFromConfig created /admin/fileedit: solr.admin.EditFileRequestHandler
   [junit4]   2> 91084 T297 oasc.RequestHandlers.initHandlersFromConfig created defaults: solr.StandardRequestHandler
   [junit4]   2> 91084 T297 oasc.RequestHandlers.initHandlersFromConfig adding lazy requestHandler: solr.StandardRequestHandler
   [junit4]   2> 91085 T297 oasc.RequestHandlers.initHandlersFromConfig created lazy: solr.StandardRequestHandler
   [junit4]   2> 91086 T297 oasc.RequestHandlers.initHandlersFromConfig created /update: solr.UpdateRequestHandler
   [junit4]   2> 91087 T297 oasc.RequestHandlers.initHandlersFromConfig created /terms: org.apache.solr.handler.component.SearchHandler
   [junit4]   2> 91088 T297 oasc.RequestHandlers.initHandlersFromConfig created spellCheckCompRH: org.apache.solr.handler.component.SearchHandler
   [junit4]   2> 91089 T297 oasc.RequestHandlers.initHandlersFromConfig created spellCheckCompRH_Direct: org.apache.solr.handler.component.SearchHandler
   [junit4]   2> 91089 T297 oasc.RequestHandlers.initHandlersFromConfig created spellCheckWithWordbreak: org.apache.solr.handler.component.SearchHandler
   [junit4]   2> 91090 T297 oasc.RequestHandlers.initHandlersFromConfig created spellCheckWithWordbreak_Direct: org.apache.solr.handler.component.SearchHandler
   [junit4]   2> 91091 T297 oasc.RequestHandlers.initHandlersFromConfig created spellCheckCompRH1: org.apache.solr.handler.component.SearchHandler
   [junit4]   2> 91092 T297 oasc.RequestHandlers.initHandlersFromConfig created mltrh: org.apache.solr.handler.component.SearchHandler
   [junit4]   2> 91093 T297 oasc.RequestHandlers.initHandlersFromConfig created tvrh: org.apache.solr.handler.component.SearchHandler
   [junit4]   2> 91094 T297 oasc.RequestHandlers.initHandlersFromConfig created /mlt: solr.MoreLikeThisHandler
   [junit4]   2> 91095 T297 oasc.RequestHandlers.initHandlersFromConfig created /debug/dump: solr.DumpRequestHandler
   [junit4]   2> 91097 T297 oashl.XMLLoader.init xsltCacheLifetimeSeconds=60
   [junit4]   2> 91098 T297 oasc.SolrCore.initDeprecatedSupport WARN solrconfig.xml uses deprecated <admin/gettableFiles>, Please update your config to use the ShowFileRequestHandler.
   [junit4]   2> 91100 T297 oasu.CommitTracker.<init> Hard AutoCommit: disabled
   [junit4]   2> 91100 T297 oasu.CommitTracker.<init> Soft AutoCommit: disabled
   [junit4]   2> 91101 T297 oass.SolrIndexSearcher.<init> Opening Searcher@c1ba6a37[collection1] main
   [junit4]   2> 91101 T297 oasr.RestManager.init Initializing RestManager with initArgs: {storageIO=org.apache.solr.rest.ManagedResourceStorage$InMemoryStorageIO}
   [junit4]   2> 91102 T297 oasr.ManagedResourceStorage.load Reading _rest_managed.json using InMemoryStorage
   [junit4]   2> 91102 T297 oasr.ManagedResource.reloadFromStorage WARN No stored data found for /rest/managed
   [junit4]   2> 91103 T297 oasr.ManagedResource.notifyObserversDuringInit WARN No registered observers for /rest/managed
   [junit4]   2> 91103 T297 oasr.RestManager.init Initializing 0 registered ManagedResources
   [junit4]   2> 91103 T297 oashc.SpellCheckComponent.inform Initializing spell checkers
   [junit4]   2> 91104 T297 oass.DirectSolrSpellChecker.init init: {name=direct,classname=DirectSolrSpellChecker,field=lowerfilt,minQueryLength=3}
   [junit4]   2> 91117 T305 oasc.SolrCore.registerSearcher [collection1] Registered new searcher Searcher@c1ba6a37[collection1] main{UninvertingDirectoryReader()}
   [junit4]   2> 91122 T297 oasu.DefaultSolrCoreState.newIndexWriter Creating new IndexWriter...
   [junit4]   2> 91122 T297 oasu.DefaultSolrCoreState.newIndexWriter Waiting until IndexWriter is unused... core=collection1
   [junit4]   2> 91123 T297 oasu.DefaultSolrCoreState.newIndexWriter Closing old IndexWriter... core=collection1
   [junit4]   2> 91124 T297 oasc.SolrDeletionPolicy.onCommit SolrDeletionPolicy.onCommit: commits: num=2
   [junit4]   2> 		commit{dir=RateLimitedDirectoryWrapper(MockDirectoryWrapper(RAMDirectory@6da717bf lockFactory=org.apache.lucene.store.SingleInstanceLockFactory@5c0120fe)),segFN=segments_2,generation=2}
   [junit4]   2> 		commit{dir=RateLimitedDirectoryWrapper(MockDirectoryWrapper(RAMDirectory@6da717bf lockFactory=org.apache.lucene.store.SingleInstanceLockFactory@5c0120fe)),segFN=segments_3,generation=3}
   [junit4]   2> 91124 T297 oasc.SolrDeletionPolicy.updateCommits newest commit generation = 3
   [junit4]   2> 91125 T297 oasu.RandomMergePolicy.<init> RandomMergePolicy wrapping class org.apache.lucene.index.LogByteSizeMergePolicy: [LogByteSizeMergePolicy: minMergeSize=1677721, mergeFactor=33, maxMergeSize=2147483648, maxMergeSizeForForcedMerge=9223372036854775807, calibrateSizeByDeletes=false, maxMergeDocs=2147483647, maxCFSSegmentSizeMB=8.796093022207999E12, noCFSRatio=0.15059631850862829]
   [junit4]   2> 91126 T297 oasc.SolrDeletionPolicy.onInit SolrDeletionPolicy.onInit: commits: num=1
   [junit4]   2> 		commit{dir=RateLimitedDirectoryWrapper(MockDirectoryWrapper(RAMDirectory@6da717bf lockFactory=org.apache.lucene.store.SingleInstanceLockFactory@5c0120fe)),segFN=segments_3,generation=3}
   [junit4]   2> 91127 T297 oasc.SolrDeletionPolicy.updateCommits newest commit generation = 3
   [junit4]   2> 91128 T297 oasu.DefaultSolrCoreState.newIndexWriter New IndexWriter is ready to be used.
   [junit4]   2> 91128 T297 oass.SolrIndexSearcher.<init> Opening Searcher@943fbba2[collection1] main
   [junit4]   2> 91129 T297 oasc.CoreContainer.registerCore replacing core: collection1
   [junit4]   2> 91130 T297 oasc.SolrCore.close [collection1]  CLOSING SolrCore org.apache.solr.core.SolrCore@b71184fa
   [junit4]   2> 91131 T305 oasc.SolrCore.registerSearcher [collection1] Registered new searcher Searcher@943fbba2[collection1] main{UninvertingDirectoryReader()}
   [junit4]   2> 91140 T297 oasu.DirectUpdateHandler2.close closing DirectUpdateHandler2{commits=1,autocommits=0,soft autocommit maxDocs=14,soft autocommits=1,optimizes=0,rollbacks=0,expungeDeletes=0,docsPending=16,adds=1,deletesById=0,deletesByQuery=1,errors=0,cumulative_adds=16,cumulative_deletesById=0,cumulative_deletesByQuery=1,cumulative_errors=0,transaction_logs_total_size=0,transaction_logs_total_number=0}
   [junit4]   2> 91141 T297 oasc.SolrCore.closeSearcher [collection1] Closing main searcher on request.
   [junit4]   2> 91146 T297 oasup.LogUpdateProcessor.finish [collection1] {add=[529 (1469175254754525184)]} 0 3
   [junit4]   2> ASYNC  NEW_CORE C371 name=collection1 org.apache.solr.core.SolrCore@cf85bc7d
   [junit4]   2> 91147 T297 C371 oasc.SolrCore.execute [collection1] webapp=null path=null params={rows=20&qt=standard&start=0&q=id:529&version=2.2} hits=0 status=0 QTime=0 
   [junit4]   2> 95146 T306 oasu.DirectUpdateHandler2.commit start commit{,optimize=false,openSearcher=true,waitSearcher=true,expungeDeletes=false,softCommit=true,prepareCommit=false}
   [junit4]   2> 95150 T306 oass.SolrIndexSearcher.<init> Opening Searcher@96a2a2a[collection1] main
   [junit4]   2> 95150 T306 oasu.DirectUpdateHandler2.commit end_commit_flush
   [junit4]   2> 95152 T305 oasc.SolrCore.registerSearcher [collection1] Registered new searcher Searcher@96a2a2a[collection1] main{UninvertingDirectoryReader(Uninverting(_3(5.0):c1))}
   [junit4]   2> 95154 T297 oasup.LogUpdateProcessor.finish [collection1] {add=[530 (1469175258958266368)]} 0 3
   [junit4]   2> 95155 T297 C371 oasc.SolrCore.execute [collection1] webapp=null path=null params={rows=20&qt=standard&start=0&q=id:530&version=2.2} hits=0 status=0 QTime=0 
   [junit4]   2> 95157 T297 oasup.LogUpdateProcessor.finish [collection1] {delete=[529 (-1469175258962460672)]} 0 3
   [junit4]   2> 95157 T297 C371 oasc.SolrCore.execute [collection1] webapp=null path=null params={rows=20&qt=standard&start=0&q=id:529&version=2.2} hits=1 status=0 QTime=0 
   [junit4]   2> 96157 T306 oasu.DirectUpdateHandler2.commit start commit{,optimize=false,openSearcher=true,waitSearcher=true,expungeDeletes=false,softCommit=true,prepareCommit=false}
   [junit4]   2> 96160 T306 oass.SolrIndexSearcher.<init> Opening Searcher@a5be41b9[collection1] main
   [junit4]   2> 96161 T306 oasu.DirectUpdateHandler2.commit end_commit_flush
   [junit4]   2> 96162 T305 oasc.SolrCore.registerSearcher [collection1] Registered new searcher Searcher@a5be41b9[collection1] main{UninvertingDirectoryReader(Uninverting(_4(5.0):c1))}
   [junit4]   2> 96409 T297 C371 oasc.SolrCore.execute [collection1] webapp=null path=null params={rows=20&qt=standard&start=0&q=id:529&version=2.2} hits=0 status=0 QTime=0 
   [junit4]   2> 96412 T297 C371 oasc.SolrCore.execute [collection1] webapp=null path=null params={rows=20&qt=standard&start=0&q=id:530&version=2.2} hits=1 status=0 QTime=1 
   [junit4]   2> 96415 T297 oasup.LogUpdateProcessor.finish [collection1] {add=[500 (1469175260280520704)]} 0 3
   [junit4]   2> 96416 T297 oasup.LogUpdateProcessor.finish [collection1] {add=[500 (1469175260282617856)]} 0 3
   [junit4]   2> 96418 T297 oasup.LogUpdateProcessor.finish [collection1] {add=[500 (1469175260284715008)]} 0 3
   [junit4]   2> 96419 T297 oasup.LogUpdateProcessor.finish [collection1] {add=[500 (1469175260285763584)]} 0 3
   [junit4]   2> 96420 T297 oasup.LogUpdateProcessor.finish [collection1] {add=[500 (1469175260286812160)]} 0 3
   [junit4]   2> 96420 T297 oasup.LogUpdateProcessor.finish [collection1] {add=[500 (1469175260286812161)]} 0 3
   [junit4]   2> 96421 T297 oasup.LogUpdateProcessor.finish [collection1] {add=[500 (1469175260287860736)]} 0 3
   [junit4]   2> 96421 T297 oasup.LogUpdateProcessor.finish [collection1] {add=[500 (1469175260287860737)]} 0 3
   [junit4]   2> 96422 T297 oasup.LogUpdateProcessor.finish [collection1] {add=[500 (1469175260288909312)]} 0 3
   [junit4]   2> 96423 T297 oasup.LogUpdateProcessor.finish [collection1] {add=[500 (1469175260288909313)]} 0 3
   [junit4]   2> 96423 T297 C371 oasc.SolrCore.execute [collection1] webapp=null path=null params={rows=20&qt=standard&start=0&q=id:500&version=2.2} hits=0 status=0 QTime=0 
   [junit4]   2> 96425 T297 oasup.LogUpdateProcessor.finish [collection1] {delete=[530 (-1469175260292055040)]} 0 3
   [junit4]   2> 96426 T297 oasup.LogUpdateProcessor.finish [collection1] {delete=[530 (-1469175260292055041)]} 0 3
   [junit4]   2> 96426 T297 oasup.LogUpdateProcessor.finish [collection1] {delete=[530 (-1469175260293103616)]} 0 3
   [junit4]   2> 96427 T297 oasup.LogUpdateProcessor.finish [collection1] {delete=[530 (-1469175260294152192)]} 0 3
   [junit4]   2> 96427 T297 oasup.LogUpdateProcessor.finish [collection1] {delete=[530 (-1469175260294152193)]} 0 3
   [junit4]   2> 96428 T297 oasup.LogUpdateProcessor.finish [collection1] {delete=[530 (-1469175260295200768)]} 0 3
   [junit4]   2> 96428 T297 oasup.LogUpdateProcessor.finish [collection1] {delete=[530 (-1469175260295200769)]} 0 3
   [junit4]   2> 96429 T297 oasup.LogUpdateProcessor.finish [collection1] {delete=[530 (-1469175260296249344)]} 0 3
   [junit4]   2> 96429 T297 oasup.LogUpdateProcessor.finish [collection1] {delete=[530 (-1469175260296249345)]} 0 3
   [junit4]   2> 96430 T297 oasup.LogUpdateProcessor.finish [collection1] {delete=[530 (-1469175260297297920)]} 0 3
   [junit4]   2> 96430 T297 C371 oasc.SolrCore.execute [collection1] webapp=null path=null params={rows=20&qt=standard&start=0&q=id:530&version=2.2} hits=1 status=0 QTime=0 
   [junit4]   2> 97425 T306 oasu.DirectUpdateHandler2.commit start commit{,optimize=false,openSearcher=true,waitSearcher=true,expungeDeletes=false,softCommit=true,prepareCommit=false}
   [junit4]   2> 97429 T306 oass.SolrIndexSearcher.<init> Opening Searcher@bbd648f7[collection1] main
   [junit4]   2> 97429 T306 oasu.DirectUpdateHandler2.commit end_commit_flush
   [junit4]   2> 97431 T305 oasc.SolrCore.registerSearcher [collection1] Registered new searcher Searcher@bbd648f7[collection1] main{UninvertingDirectoryReader(Uninverting(_5(5.0):c10/9:delGen=1))}
   [junit4]   2> 97432 T297 C371 oasc.SolrCore.execute [collection1] webapp=null path=null params={rows=20&qt=standard&start=0&q=id:500&version=2.2} hits=1 status=0 QTime=0 
   [junit4]   2> 97434 T297 C371 oasc.SolrCore.execute [collection1] webapp=null path=null params={rows=20&qt=standard&start=0&q=id:530&version=2.2} hits=0 status=0 QTime=0 
   [junit4]   2> 97435 T297 oas.SolrTestCaseJ4.tearDown ###Ending testCommitWithin
   [junit4]   2> 97437 T297 oas.SolrTestCaseJ4.deleteCore ###deleteCore
   [junit4]   2> 97437 T297 oasc.CoreContainer.shutdown Shutting down CoreContainer instance=-1273491225
   [junit4]   2> 97438 T297 oasc.SolrCore.close [collection1]  CLOSING SolrCore org.apache.solr.core.SolrCore@cf85bc7d
   [junit4]   2> 97449 T297 oasu.DirectUpdateHandler2.close closing DirectUpdateHandler2{commits=3,autocommits=0,soft autocommits=3,optimizes=0,rollbacks=0,expungeDeletes=0,docsPending=12,adds=0,deletesById=0,deletesByQuery=0,errors=0,cumulative_adds=12,cumulative_deletesById=11,cumulative_deletesByQuery=0,cumulative_errors=0,transaction_logs_total_size=0,transaction_logs_total_number=0}
   [junit4]   2> 97449 T297 oasu.SolrCoreState.decrefSolrCoreState Closing SolrCoreState
   [junit4]   2> 97449 T297 oasu.DefaultSolrCoreState.closeIndexWriter SolrCoreState ref count has reached 0 - closing IndexWriter
   [junit4]   2> 97450 T297 oasu.DefaultSolrCoreState.closeIndexWriter closing IndexWriter with IndexWriterCloser
   [junit4]   2> 97450 T297 C371 oasu.DirectUpdateHandler2.closeWriter Committing on IndexWriter close.
   [junit4]   2> 97451 T297 C371 oasc.SolrDeletionPolicy.onCommit SolrDeletionPolicy.onCommit: commits: num=2
   [junit4]   2> 		commit{dir=RateLimitedDirectoryWrapper(MockDirectoryWrapper(RAMDirectory@6da717bf lockFactory=org.apache.lucene.store.SingleInstanceLockFactory@5c0120fe)),segFN=segments_3,generation=3}
   [junit4]   2> 		commit{dir=RateLimitedDirectoryWrapper(MockDirectoryWrapper(RAMDirectory@6da717bf lockFactory=org.apache.lucene.store.SingleInstanceLockFactory@5c0120fe)),segFN=segments_4,generation=4}
   [junit4]   2> 97451 T297 C371 oasc.SolrDeletionPolicy.updateCommits newest commit generation = 4
   [junit4]   2> 97452 T297 oasc.SolrCore.closeSearcher [collection1] Closing main searcher on request.
   [junit4]   2> 97452 T297 oasc.CachingDirectoryFactory.close Closing MockDirectoryFactory - 2 directories currently being tracked
   [junit4]   2> 97452 T297 oasc.CachingDirectoryFactory.closeCacheValue looking to close /mnt/ssd/jenkins/workspace/Lucene-Solr-trunk-Linux/solr/build/solr-core/test/J0/./temp/solr.update.AutoCommitTest-22EDC1625D28A4D7-001/init-core-data-001 [CachedDir<<refCount=0;path=/mnt/ssd/jenkins/workspace/Lucene-Solr-trunk-Linux/solr/build/solr-core/test/J0/./temp/solr.update.AutoCommitTest-22EDC1625D28A4D7-001/init-core-data-001;done=false>>]
   [junit4]   2> 97453 T297 oasc.CachingDirectoryFactory.close Closing directory: /mnt/ssd/jenkins/workspace/Lucene-Solr-trunk-Linux/solr/build/solr-core/test/J0/./temp/solr.update.AutoCommitTest-22EDC1625D28A4D7-001/init-core-data-001
   [junit4]   2> 97453 T297 oasc.CachingDirectoryFactory.closeCacheValue looking to close /mnt/ssd/jenkins/workspace/Lucene-Solr-trunk-Linux/solr/build/solr-core/test/J0/./temp/solr.update.AutoCommitTest-22EDC1625D28A4D7-001/init-core-data-001/index [CachedDir<<refCount=0;path=/mnt/ssd/jenkins/workspace/Lucene-Solr-trunk-Linux/solr/build/solr-core/test/J0/./temp/solr.update.AutoCommitTest-22EDC1625D28A4D7-001/init-core-data-001/index;done=false>>]
   [junit4]   2> 97453 T297 oasc.CachingDirectoryFactory.close Closing directory: /mnt/ssd/jenkins/workspace/Lucene-Solr-trunk-Linux/solr/build/solr-core/test/J0/./temp/solr.update.AutoCommitTest-22EDC1625D28A4D7-001/init-core-data-001/index
   [junit4]   2> NOTE: leaving temporary files on disk at: /mnt/ssd/jenkins/workspace/Lucene-Solr-trunk-Linux/solr/build/solr-core/test/J0/./temp/solr.update.AutoCommitTest-22EDC1625D28A4D7-001
   [junit4]   2> NOTE: test params are: codec=Lucene40, sim=DefaultSimilarity, locale=ru, timezone=America/Paramaribo
   [junit4]   2> NOTE: Linux 3.8.0-39-generic amd64/IBM Corporation 1.7.0 (64-bit)/cpus=8,threads=1,free=18635424,total=113573888
   [junit4]   2> NOTE: All tests run in this JVM: [DocValuesTest, LukeRequestHandlerTest, DistributedQueryComponentOptimizationTest, TestImplicitCoreProperties, TestSurroundQueryParser, HdfsChaosMonkeySafeLeaderTest, TestFieldResource, TestFastLRUCache, MultiThreadedOCPTest, TestSolrQueryParserDefaultOperatorResource, DirectUpdateHandlerOptimizeTest, TestCollationFieldDocValues, TestNRTOpen, OverseerCollectionProcessorTest, LoggingHandlerTest, ParsingFieldUpdateProcessorsTest, TimeZoneUtilsTest, TestClassNameShortening, SliceStateUpdateTest, UnloadDistributedZkTest, TestCharFilters, TestShortCircuitedRequests, TestStressVersions, TestComplexPhraseQParserPlugin, TestReloadAndDeleteDocs, TestElisionMultitermQuery, FileBasedSpellCheckerTest, TestInitQParser, AutoCommitTest]
   [junit4] Completed on J0 in 14.33s, 3 tests, 1 error <<< FAILURES!

[...truncated 434 lines...]
   [junit4] Suite: org.apache.solr.update.HardAutoCommitTest
   [junit4]   2> Creating dataDir: /mnt/ssd/jenkins/workspace/Lucene-Solr-trunk-Linux/solr/build/solr-core/test/J1/./temp/solr.update.HardAutoCommitTest-22EDC1625D28A4D7-001/init-core-data-001
   [junit4]   2> 304722 T954 oas.SolrTestCaseJ4.buildSSLConfig Randomized ssl (true) and clientAuth (false)
   [junit4]   2> 304722 T954 oas.SolrTestCaseJ4.initCore ####initCore
   [junit4]   2> 304723 T954 oasc.SolrResourceLoader.<init> new SolrResourceLoader for directory: '/mnt/ssd/jenkins/workspace/Lucene-Solr-trunk-Linux/solr/core/src/test-files/solr/collection1/'
   [junit4]   2> 304723 T954 oasc.SolrResourceLoader.replaceClassLoader Adding 'file:/mnt/ssd/jenkins/workspace/Lucene-Solr-trunk-Linux/solr/core/src/test-files/solr/collection1/lib/.svn/' to classloader
   [junit4]   2> 304724 T954 oasc.SolrResourceLoader.replaceClassLoader Adding 'file:/mnt/ssd/jenkins/workspace/Lucene-Solr-trunk-Linux/solr/core/src/test-files/solr/collection1/lib/classes/' to classloader
   [junit4]   2> 304724 T954 oasc.SolrResourceLoader.replaceClassLoader Adding 'file:/mnt/ssd/jenkins/workspace/Lucene-Solr-trunk-Linux/solr/core/src/test-files/solr/collection1/lib/README' to classloader
   [

[...truncated too long message...]

e.java:42)
   [junit4]   2> 		at com.carrotsearch.randomizedtesting.rules.SystemPropertiesInvariantRule$1.evaluate(SystemPropertiesInvariantRule.java:55)
   [junit4]   2> 		at com.carrotsearch.randomizedtesting.rules.NoShadowingOrOverridesOnMethodsRule$1.evaluate(NoShadowingOrOverridesOnMethodsRule.java:39)
   [junit4]   2> 		at com.carrotsearch.randomizedtesting.rules.NoShadowingOrOverridesOnMethodsRule$1.evaluate(NoShadowingOrOverridesOnMethodsRule.java:39)
   [junit4]   2> 		at com.carrotsearch.randomizedtesting.rules.StatementAdapter.evaluate(StatementAdapter.java:36)
   [junit4]   2> 		at com.carrotsearch.randomizedtesting.rules.StatementAdapter.evaluate(StatementAdapter.java:36)
   [junit4]   2> 		at com.carrotsearch.randomizedtesting.rules.StatementAdapter.evaluate(StatementAdapter.java:36)
   [junit4]   2> 		at org.apache.lucene.util.TestRuleAssertionsRequired$1.evaluate(TestRuleAssertionsRequired.java:43)
   [junit4]   2> 		at org.apache.lucene.util.TestRuleMarkFailure$1.evaluate(TestRuleMarkFailure.java:48)
   [junit4]   2> 		at org.apache.lucene.util.TestRuleIgnoreAfterMaxFailures$1.evaluate(TestRuleIgnoreAfterMaxFailures.java:65)
   [junit4]   2> 		at org.apache.lucene.util.TestRuleIgnoreTestSuites$1.evaluate(TestRuleIgnoreTestSuites.java:55)
   [junit4]   2> 		at com.carrotsearch.randomizedtesting.rules.StatementAdapter.evaluate(StatementAdapter.java:36)
   [junit4]   2> 		at com.carrotsearch.randomizedtesting.ThreadLeakControl$StatementRunner.run(ThreadLeakControl.java:360)
   [junit4]   2> 		at java.lang.Thread.run(Thread.java:853)
   [junit4]   2> 	
   [junit4]   2> 309376 T954 oas.SolrTestCaseJ4.tearDown ###Ending testCommitWithin
   [junit4]   2> NOTE: reproduce with: ant test  -Dtestcase=HardAutoCommitTest -Dtests.method=testCommitWithin -Dtests.seed=22EDC1625D28A4D7 -Dtests.multiplier=3 -Dtests.slow=true -Dtests.locale=de_LU_PREEURO -Dtests.timezone=SystemV/HST10 -Dtests.file.encoding=US-ASCII
   [junit4] ERROR   3.65s J1 | HardAutoCommitTest.testCommitWithin <<<
   [junit4]    > Throwable #1: java.lang.RuntimeException: Exception during query
   [junit4]    > 	at __randomizedtesting.SeedInfo.seed([22EDC1625D28A4D7:983FAE1ADE064AC2]:0)
   [junit4]    > 	at org.apache.solr.SolrTestCaseJ4.assertQ(SolrTestCaseJ4.java:719)
   [junit4]    > 	at org.apache.solr.update.HardAutoCommitTest.testCommitWithin(HardAutoCommitTest.java:79)
   [junit4]    > 	at java.lang.Thread.run(Thread.java:853)
   [junit4]    > Caused by: java.lang.RuntimeException: REQUEST FAILED: xpath=//result[@numFound=0]
   [junit4]    > 	xml response was: <?xml version="1.0" encoding="UTF-8"?>
   [junit4]    > <response>
   [junit4]    > <lst name="responseHeader"><int name="status">0</int><int name="QTime">3137</int></lst><result name="response" numFound="1" start="0"><doc><int name="id">529</int><arr name="range_facet_l"><long>529</long></arr><arr name="field_t"><str>what's inside?</str></arr><arr name="subject"><str>info</str></arr><long name="_version_">1469175480316854272</long><arr name="multiDefault"><str>muLti-Default</str></arr><int name="intDefault">42</int><date name="timestamp">2014-05-26T14:35:21.872Z</date></doc></result>
   [junit4]    > </response>
   [junit4]    > 	request was:start=0&rows=20&q=id:529&version=2.2&qt=standard
   [junit4]    > 	at org.apache.solr.SolrTestCaseJ4.assertQ(SolrTestCaseJ4.java:712)
   [junit4]    > 	... 41 more
   [junit4]   2> 309390 T954 oas.SolrTestCaseJ4.deleteCore ###deleteCore
   [junit4]   2> 309391 T954 oasc.CoreContainer.shutdown Shutting down CoreContainer instance=-1307403051
   [junit4]   2> 309391 T954 oasc.SolrCore.close [collection1]  CLOSING SolrCore org.apache.solr.core.SolrCore@7c7d3e55
   [junit4]   2> 309400 T954 oasu.DirectUpdateHandler2.close closing DirectUpdateHandler2{commits=1,autocommits=1,soft autocommits=0,optimizes=0,rollbacks=0,expungeDeletes=0,docsPending=0,adds=0,deletesById=0,deletesByQuery=0,errors=0,cumulative_adds=1,cumulative_deletesById=0,cumulative_deletesByQuery=0,cumulative_errors=0,transaction_logs_total_size=151,transaction_logs_total_number=1}
   [junit4]   2> 309400 T954 oasu.SolrCoreState.decrefSolrCoreState Closing SolrCoreState
   [junit4]   2> 309401 T954 oasu.DefaultSolrCoreState.closeIndexWriter SolrCoreState ref count has reached 0 - closing IndexWriter
   [junit4]   2> 309401 T954 oasu.DefaultSolrCoreState.closeIndexWriter closing IndexWriter with IndexWriterCloser
   [junit4]   2> 309402 T954 oasc.SolrCore.closeSearcher [collection1] Closing main searcher on request.
   [junit4]   2> 309402 T954 oasc.CachingDirectoryFactory.close Closing MockDirectoryFactory - 2 directories currently being tracked
   [junit4]   2> 309402 T954 oasc.CachingDirectoryFactory.closeCacheValue looking to close /mnt/ssd/jenkins/workspace/Lucene-Solr-trunk-Linux/solr/build/solr-core/test/J1/./temp/solr.update.HardAutoCommitTest-22EDC1625D28A4D7-001/init-core-data-001/index [CachedDir<<refCount=0;path=/mnt/ssd/jenkins/workspace/Lucene-Solr-trunk-Linux/solr/build/solr-core/test/J1/./temp/solr.update.HardAutoCommitTest-22EDC1625D28A4D7-001/init-core-data-001/index;done=false>>]
   [junit4]   2> 309403 T954 oasc.CachingDirectoryFactory.close Closing directory: /mnt/ssd/jenkins/workspace/Lucene-Solr-trunk-Linux/solr/build/solr-core/test/J1/./temp/solr.update.HardAutoCommitTest-22EDC1625D28A4D7-001/init-core-data-001/index
   [junit4]   2> 309403 T954 oasc.CachingDirectoryFactory.closeCacheValue looking to close /mnt/ssd/jenkins/workspace/Lucene-Solr-trunk-Linux/solr/build/solr-core/test/J1/./temp/solr.update.HardAutoCommitTest-22EDC1625D28A4D7-001/init-core-data-001 [CachedDir<<refCount=0;path=/mnt/ssd/jenkins/workspace/Lucene-Solr-trunk-Linux/solr/build/solr-core/test/J1/./temp/solr.update.HardAutoCommitTest-22EDC1625D28A4D7-001/init-core-data-001;done=false>>]
   [junit4]   2> 309403 T954 oasc.CachingDirectoryFactory.close Closing directory: /mnt/ssd/jenkins/workspace/Lucene-Solr-trunk-Linux/solr/build/solr-core/test/J1/./temp/solr.update.HardAutoCommitTest-22EDC1625D28A4D7-001/init-core-data-001
   [junit4]   2> NOTE: leaving temporary files on disk at: /mnt/ssd/jenkins/workspace/Lucene-Solr-trunk-Linux/solr/build/solr-core/test/J1/./temp/solr.update.HardAutoCommitTest-22EDC1625D28A4D7-001
   [junit4]   2> NOTE: test params are: codec=DummyCompressingStoredFields(storedFieldsFormat=CompressingStoredFieldsFormat(compressionMode=DUMMY, chunkSize=243), termVectorsFormat=CompressingTermVectorsFormat(compressionMode=DUMMY, chunkSize=243)), sim=DefaultSimilarity, locale=de_LU_PREEURO, timezone=SystemV/HST10
   [junit4]   2> NOTE: Linux 3.8.0-39-generic amd64/IBM Corporation 1.7.0 (64-bit)/cpus=8,threads=1,free=30331848,total=106823680
   [junit4]   2> NOTE: All tests run in this JVM: [TestSolrQueryParserResource, BlockCacheTest, TestLMDirichletSimilarityFactory, LeaderElectionIntegrationTest, TestDistributedGrouping, TestSearcherReuse, TestCSVLoader, NotRequiredUniqueKeyTest, TestSolrCoreProperties, PingRequestHandlerTest, TestStressLucene, TestSolrXmlPersistence, TestPhraseSuggestions, AddBlockUpdateTest, TestRecovery, TestDocBasedVersionConstraints, TestManagedResource, UniqFieldsUpdateProcessorFactoryTest, HttpPartitionTest, TestCustomSort, IndexBasedSpellCheckerTest, TestBinaryField, NoCacheHeaderTest, TestAddFieldRealTimeGet, TestRTGBase, RequestHandlersTest, TestSolr4Spatial, CustomCollectionTest, TestAnalyzeInfixSuggestions, DefaultValueUpdateProcessorTest, DistributedDebugComponentTest, FieldFacetExtrasTest, AssignTest, ResponseHeaderTest, ChangedSchemaMergeTest, TestBinaryResponseWriter, DocumentAnalysisRequestHandlerTest, TestManagedSynonymFilterFactory, TestSolrJ, ResourceLoaderTest, AbstractAnalyticsStatsTest, DebugComponentTest, LegacyHTMLStripCharFilterTest, TestAtomicUpdateErrorCases, TestSolrXml, StandardRequestHandlerTest, TestMultiCoreConfBootstrap, TestSolrDeletionPolicy2, TestDFRSimilarityFactory, TestSchemaSimilarityResource, CoreMergeIndexesAdminHandlerTest, TestSolrXMLSerializer, TestReload, TestXIncludeConfig, TestAnalyzedSuggestions, XsltUpdateRequestHandlerTest, TestCoreDiscovery, SystemInfoHandlerTest, RemoteQueryErrorTest, TestLRUCache, TestArbitraryIndexDir, HdfsBasicDistributedZkTest, TestShardHandlerFactory, ZkNodePropsTest, BasicZkTest, TestStressRecovery, TestSweetSpotSimilarityFactory, HdfsSyncSliceTest, TestRangeQuery, ZkSolrClientTest, IndexSchemaRuntimeFieldTest, RangeFacetTest, DOMUtilTest, TestManagedStopFilterFactory, TestCloudInspectUtil, HardAutoCommitTest]
   [junit4] Completed on J1 in 4.70s, 1 test, 1 error <<< FAILURES!

[...truncated 671 lines...]
BUILD FAILED
/mnt/ssd/jenkins/workspace/Lucene-Solr-trunk-Linux/build.xml:467: The following error occurred while executing this line:
/mnt/ssd/jenkins/workspace/Lucene-Solr-trunk-Linux/build.xml:460: The following error occurred while executing this line:
/mnt/ssd/jenkins/workspace/Lucene-Solr-trunk-Linux/build.xml:45: The following error occurred while executing this line:
/mnt/ssd/jenkins/workspace/Lucene-Solr-trunk-Linux/extra-targets.xml:37: The following error occurred while executing this line:
/mnt/ssd/jenkins/workspace/Lucene-Solr-trunk-Linux/solr/build.xml:189: The following error occurred while executing this line:
/mnt/ssd/jenkins/workspace/Lucene-Solr-trunk-Linux/solr/common-build.xml:496: The following error occurred while executing this line:
/mnt/ssd/jenkins/workspace/Lucene-Solr-trunk-Linux/lucene/common-build.xml:1296: The following error occurred while executing this line:
/mnt/ssd/jenkins/workspace/Lucene-Solr-trunk-Linux/lucene/common-build.xml:920: There were test failures: 406 suites, 1688 tests, 2 errors, 94 ignored (15 assumptions)

Total time: 48 minutes 35 seconds
Build step 'Invoke Ant' marked build as failure
Description set: Java: 64bit/ibm-j9-jdk7 -Xjit:exclude={org/apache/lucene/util/fst/FST.pack(IIF)Lorg/apache/lucene/util/fst/FST;}
Archiving artifacts
Recording test results
Email was triggered for: Failure
Sending email for trigger: Failure



Mime
View raw message