lucene-dev mailing list archives

Site index · List index
Message view « Date » · « Thread »
Top « Date » · « Thread »
From Policeman Jenkins Server <jenk...@thetaphi.de>
Subject [JENKINS] Lucene-Solr-trunk-Linux (64bit/jdk1.8.0_05) - Build # 10379 - Failure!
Date Sun, 25 May 2014 15:34:39 GMT
Build: http://jenkins.thetaphi.de/job/Lucene-Solr-trunk-Linux/10379/
Java: 64bit/jdk1.8.0_05 -XX:+UseCompressedOops -XX:+UseConcMarkSweepGC

1 tests failed.
REGRESSION:  org.apache.solr.cloud.OverseerRolesTest.testDistribSearch

Error Message:
New overseer designate has not become the overseer, expected : 127.0.0.1:48995_na%2Fmaactual : null

Stack Trace:
java.lang.AssertionError: New overseer designate has not become the overseer, expected : 127.0.0.1:48995_na%2Fmaactual : null
	at __randomizedtesting.SeedInfo.seed([7AF9794BBBA1BCA0:FB1FF753CCFEDC9C]:0)
	at org.junit.Assert.fail(Assert.java:93)
	at org.junit.Assert.assertTrue(Assert.java:43)
	at org.apache.solr.cloud.OverseerRolesTest.testOverseerRole(OverseerRolesTest.java:223)
	at org.apache.solr.cloud.OverseerRolesTest.doTest(OverseerRolesTest.java:94)
	at org.apache.solr.BaseDistributedSearchTestCase.testDistribSearch(BaseDistributedSearchTestCase.java:863)
	at sun.reflect.GeneratedMethodAccessor47.invoke(Unknown Source)
	at sun.reflect.DelegatingMethodAccessorImpl.invoke(DelegatingMethodAccessorImpl.java:43)
	at java.lang.reflect.Method.invoke(Method.java:483)
	at com.carrotsearch.randomizedtesting.RandomizedRunner.invoke(RandomizedRunner.java:1618)
	at com.carrotsearch.randomizedtesting.RandomizedRunner$6.evaluate(RandomizedRunner.java:827)
	at com.carrotsearch.randomizedtesting.RandomizedRunner$7.evaluate(RandomizedRunner.java:863)
	at com.carrotsearch.randomizedtesting.RandomizedRunner$8.evaluate(RandomizedRunner.java:877)
	at com.carrotsearch.randomizedtesting.rules.SystemPropertiesRestoreRule$1.evaluate(SystemPropertiesRestoreRule.java:53)
	at org.apache.lucene.util.TestRuleSetupTeardownChained$1.evaluate(TestRuleSetupTeardownChained.java:50)
	at org.apache.lucene.util.AbstractBeforeAfterRule$1.evaluate(AbstractBeforeAfterRule.java:46)
	at com.carrotsearch.randomizedtesting.rules.SystemPropertiesInvariantRule$1.evaluate(SystemPropertiesInvariantRule.java:55)
	at org.apache.lucene.util.TestRuleThreadAndTestName$1.evaluate(TestRuleThreadAndTestName.java:49)
	at org.apache.lucene.util.TestRuleIgnoreAfterMaxFailures$1.evaluate(TestRuleIgnoreAfterMaxFailures.java:65)
	at org.apache.lucene.util.TestRuleMarkFailure$1.evaluate(TestRuleMarkFailure.java:48)
	at com.carrotsearch.randomizedtesting.rules.StatementAdapter.evaluate(StatementAdapter.java:36)
	at com.carrotsearch.randomizedtesting.ThreadLeakControl$StatementRunner.run(ThreadLeakControl.java:360)
	at com.carrotsearch.randomizedtesting.ThreadLeakControl.forkTimeoutingTask(ThreadLeakControl.java:793)
	at com.carrotsearch.randomizedtesting.ThreadLeakControl$3.evaluate(ThreadLeakControl.java:453)
	at com.carrotsearch.randomizedtesting.RandomizedRunner.runSingleTest(RandomizedRunner.java:836)
	at com.carrotsearch.randomizedtesting.RandomizedRunner$3.evaluate(RandomizedRunner.java:738)
	at com.carrotsearch.randomizedtesting.RandomizedRunner$4.evaluate(RandomizedRunner.java:772)
	at com.carrotsearch.randomizedtesting.RandomizedRunner$5.evaluate(RandomizedRunner.java:783)
	at com.carrotsearch.randomizedtesting.rules.StatementAdapter.evaluate(StatementAdapter.java:36)
	at com.carrotsearch.randomizedtesting.rules.SystemPropertiesRestoreRule$1.evaluate(SystemPropertiesRestoreRule.java:53)
	at org.apache.lucene.util.AbstractBeforeAfterRule$1.evaluate(AbstractBeforeAfterRule.java:46)
	at org.apache.lucene.util.TestRuleStoreClassName$1.evaluate(TestRuleStoreClassName.java:42)
	at com.carrotsearch.randomizedtesting.rules.SystemPropertiesInvariantRule$1.evaluate(SystemPropertiesInvariantRule.java:55)
	at com.carrotsearch.randomizedtesting.rules.NoShadowingOrOverridesOnMethodsRule$1.evaluate(NoShadowingOrOverridesOnMethodsRule.java:39)
	at com.carrotsearch.randomizedtesting.rules.NoShadowingOrOverridesOnMethodsRule$1.evaluate(NoShadowingOrOverridesOnMethodsRule.java:39)
	at com.carrotsearch.randomizedtesting.rules.StatementAdapter.evaluate(StatementAdapter.java:36)
	at com.carrotsearch.randomizedtesting.rules.StatementAdapter.evaluate(StatementAdapter.java:36)
	at com.carrotsearch.randomizedtesting.rules.StatementAdapter.evaluate(StatementAdapter.java:36)
	at org.apache.lucene.util.TestRuleAssertionsRequired$1.evaluate(TestRuleAssertionsRequired.java:43)
	at org.apache.lucene.util.TestRuleMarkFailure$1.evaluate(TestRuleMarkFailure.java:48)
	at org.apache.lucene.util.TestRuleIgnoreAfterMaxFailures$1.evaluate(TestRuleIgnoreAfterMaxFailures.java:65)
	at org.apache.lucene.util.TestRuleIgnoreTestSuites$1.evaluate(TestRuleIgnoreTestSuites.java:55)
	at com.carrotsearch.randomizedtesting.rules.StatementAdapter.evaluate(StatementAdapter.java:36)
	at com.carrotsearch.randomizedtesting.ThreadLeakControl$StatementRunner.run(ThreadLeakControl.java:360)
	at java.lang.Thread.run(Thread.java:745)




Build Log:
[...truncated 11757 lines...]
   [junit4] Suite: org.apache.solr.cloud.OverseerRolesTest
   [junit4]   2> Creating dataDir: /mnt/ssd/jenkins/workspace/Lucene-Solr-trunk-Linux/solr/build/solr-core/test/J1/./temp/solr.cloud.OverseerRolesTest-7AF9794BBBA1BCA0-001/init-core-data-001
   [junit4]   2> 1277371 T6685 oas.BaseDistributedSearchTestCase.initHostContext Setting hostContext system property: /na/ma
   [junit4]   2> 1277373 T6685 oas.SolrTestCaseJ4.setUp ###Starting testDistribSearch
   [junit4]   2> 1277374 T6685 oasc.ZkTestServer.run STARTING ZK TEST SERVER
   [junit4]   1> client port:0.0.0.0/0.0.0.0:0
   [junit4]   2> 1277374 T6686 oasc.ZkTestServer$ZKServerMain.runFromConfig Starting server
   [junit4]   2> 1277474 T6685 oasc.ZkTestServer.run start zk server on port:40024
   [junit4]   2> 1277475 T6685 oascc.ConnectionManager.waitForConnected Waiting for client to connect to ZooKeeper
   [junit4]   2> 1287056 T6689 oazsp.FileTxnLog.commit WARN fsync-ing the write ahead log in SyncThread:0 took 9579ms which will adversely effect operation latency. See the ZooKeeper troubleshooting guide
   [junit4]   2> 1287058 T6692 oascc.ConnectionManager.process Watcher org.apache.solr.common.cloud.ConnectionManager@6826454e name:ZooKeeperConnection Watcher:127.0.0.1:40024 got event WatchedEvent state:SyncConnected type:None path:null path:null type:None
   [junit4]   2> 1287058 T6685 oascc.ConnectionManager.waitForConnected Client is connected to ZooKeeper
   [junit4]   2> 1287058 T6685 oascc.SolrZkClient.makePath makePath: /solr
   [junit4]   2> 1287089 T6685 oascc.ConnectionManager.waitForConnected Waiting for client to connect to ZooKeeper
   [junit4]   2> 1287108 T6694 oascc.ConnectionManager.process Watcher org.apache.solr.common.cloud.ConnectionManager@38ea966e name:ZooKeeperConnection Watcher:127.0.0.1:40024/solr got event WatchedEvent state:SyncConnected type:None path:null path:null type:None
   [junit4]   2> 1287109 T6685 oascc.ConnectionManager.waitForConnected Client is connected to ZooKeeper
   [junit4]   2> 1287109 T6685 oascc.SolrZkClient.makePath makePath: /collections/collection1
   [junit4]   2> 1287148 T6685 oascc.SolrZkClient.makePath makePath: /collections/collection1/shards
   [junit4]   2> 1287172 T6685 oascc.SolrZkClient.makePath makePath: /collections/control_collection
   [junit4]   2> 1287188 T6685 oascc.SolrZkClient.makePath makePath: /collections/control_collection/shards
   [junit4]   2> 1287209 T6685 oasc.AbstractZkTestCase.putConfig put /mnt/ssd/jenkins/workspace/Lucene-Solr-trunk-Linux/solr/core/src/test-files/solr/collection1/conf/solrconfig-tlog.xml to /configs/conf1/solrconfig.xml
   [junit4]   2> 1287209 T6685 oascc.SolrZkClient.makePath makePath: /configs/conf1/solrconfig.xml
   [junit4]   2> 1293751 T6689 oazsp.FileTxnLog.commit WARN fsync-ing the write ahead log in SyncThread:0 took 6511ms which will adversely effect operation latency. See the ZooKeeper troubleshooting guide
   [junit4]   2> 1293752 T6685 oasc.AbstractZkTestCase.putConfig put /mnt/ssd/jenkins/workspace/Lucene-Solr-trunk-Linux/solr/core/src/test-files/solr/collection1/conf/schema.xml to /configs/conf1/schema.xml
   [junit4]   2> 1293753 T6685 oascc.SolrZkClient.makePath makePath: /configs/conf1/schema.xml
   [junit4]   2> 1293757 T6685 oasc.AbstractZkTestCase.putConfig put /mnt/ssd/jenkins/workspace/Lucene-Solr-trunk-Linux/solr/core/src/test-files/solr/collection1/conf/solrconfig.snippet.randomindexconfig.xml to /configs/conf1/solrconfig.snippet.randomindexconfig.xml
   [junit4]   2> 1293758 T6685 oascc.SolrZkClient.makePath makePath: /configs/conf1/solrconfig.snippet.randomindexconfig.xml
   [junit4]   2> 1293762 T6685 oasc.AbstractZkTestCase.putConfig put /mnt/ssd/jenkins/workspace/Lucene-Solr-trunk-Linux/solr/core/src/test-files/solr/collection1/conf/stopwords.txt to /configs/conf1/stopwords.txt
   [junit4]   2> 1293763 T6685 oascc.SolrZkClient.makePath makePath: /configs/conf1/stopwords.txt
   [junit4]   2> 1293765 T6685 oasc.AbstractZkTestCase.putConfig put /mnt/ssd/jenkins/workspace/Lucene-Solr-trunk-Linux/solr/core/src/test-files/solr/collection1/conf/protwords.txt to /configs/conf1/protwords.txt
   [junit4]   2> 1293766 T6685 oascc.SolrZkClient.makePath makePath: /configs/conf1/protwords.txt
   [junit4]   2> 1293769 T6685 oasc.AbstractZkTestCase.putConfig put /mnt/ssd/jenkins/workspace/Lucene-Solr-trunk-Linux/solr/core/src/test-files/solr/collection1/conf/currency.xml to /configs/conf1/currency.xml
   [junit4]   2> 1293770 T6685 oascc.SolrZkClient.makePath makePath: /configs/conf1/currency.xml
   [junit4]   2> 1293773 T6685 oasc.AbstractZkTestCase.putConfig put /mnt/ssd/jenkins/workspace/Lucene-Solr-trunk-Linux/solr/core/src/test-files/solr/collection1/conf/enumsConfig.xml to /configs/conf1/enumsConfig.xml
   [junit4]   2> 1293774 T6685 oascc.SolrZkClient.makePath makePath: /configs/conf1/enumsConfig.xml
   [junit4]   2> 1293778 T6685 oasc.AbstractZkTestCase.putConfig put /mnt/ssd/jenkins/workspace/Lucene-Solr-trunk-Linux/solr/core/src/test-files/solr/collection1/conf/open-exchange-rates.json to /configs/conf1/open-exchange-rates.json
   [junit4]   2> 1293778 T6685 oascc.SolrZkClient.makePath makePath: /configs/conf1/open-exchange-rates.json
   [junit4]   2> 1293781 T6685 oasc.AbstractZkTestCase.putConfig put /mnt/ssd/jenkins/workspace/Lucene-Solr-trunk-Linux/solr/core/src/test-files/solr/collection1/conf/mapping-ISOLatin1Accent.txt to /configs/conf1/mapping-ISOLatin1Accent.txt
   [junit4]   2> 1293782 T6685 oascc.SolrZkClient.makePath makePath: /configs/conf1/mapping-ISOLatin1Accent.txt
   [junit4]   2> 1293785 T6685 oasc.AbstractZkTestCase.putConfig put /mnt/ssd/jenkins/workspace/Lucene-Solr-trunk-Linux/solr/core/src/test-files/solr/collection1/conf/old_synonyms.txt to /configs/conf1/old_synonyms.txt
   [junit4]   2> 1293786 T6685 oascc.SolrZkClient.makePath makePath: /configs/conf1/old_synonyms.txt
   [junit4]   2> 1293789 T6685 oasc.AbstractZkTestCase.putConfig put /mnt/ssd/jenkins/workspace/Lucene-Solr-trunk-Linux/solr/core/src/test-files/solr/collection1/conf/synonyms.txt to /configs/conf1/synonyms.txt
   [junit4]   2> 1293789 T6685 oascc.SolrZkClient.makePath makePath: /configs/conf1/synonyms.txt
   [junit4]   2> 1294038 T6685 oejs.Server.doStart jetty-8.1.10.v20130312
   [junit4]   2> 1294042 T6685 oejs.AbstractConnector.doStart Started SelectChannelConnector@127.0.0.1:49898
   [junit4]   2> 1294043 T6685 oass.SolrDispatchFilter.init SolrDispatchFilter.init()
   [junit4]   2> 1294043 T6685 oasc.SolrResourceLoader.locateSolrHome JNDI not configured for solr (NoInitialContextEx)
   [junit4]   2> 1294043 T6685 oasc.SolrResourceLoader.locateSolrHome using system property solr.solr.home: /mnt/ssd/jenkins/workspace/Lucene-Solr-trunk-Linux/solr/build/solr-core/test/J1/./temp/solr.cloud.OverseerRolesTest-7AF9794BBBA1BCA0-001/tempDir-002
   [junit4]   2> 1294043 T6685 oasc.SolrResourceLoader.<init> new SolrResourceLoader for directory: '/mnt/ssd/jenkins/workspace/Lucene-Solr-trunk-Linux/solr/build/solr-core/test/J1/./temp/solr.cloud.OverseerRolesTest-7AF9794BBBA1BCA0-001/tempDir-002/'
   [junit4]   2> 1294054 T6685 oasc.ConfigSolr.fromFile Loading container configuration from /mnt/ssd/jenkins/workspace/Lucene-Solr-trunk-Linux/solr/build/solr-core/test/J1/./temp/solr.cloud.OverseerRolesTest-7AF9794BBBA1BCA0-001/tempDir-002/solr.xml
   [junit4]   2> 1294062 T6685 oasc.CorePropertiesLocator.<init> Config-defined core root directory: /mnt/ssd/jenkins/workspace/Lucene-Solr-trunk-Linux/solr/build/solr-core/test/J1/./temp/solr.cloud.OverseerRolesTest-7AF9794BBBA1BCA0-001/tempDir-002
   [junit4]   2> 1294062 T6685 oasc.CoreContainer.<init> New CoreContainer 850960103
   [junit4]   2> 1294062 T6685 oasc.CoreContainer.load Loading cores into CoreContainer [instanceDir=/mnt/ssd/jenkins/workspace/Lucene-Solr-trunk-Linux/solr/build/solr-core/test/J1/./temp/solr.cloud.OverseerRolesTest-7AF9794BBBA1BCA0-001/tempDir-002/]
   [junit4]   2> 1294063 T6685 oashc.HttpShardHandlerFactory.getParameter Setting socketTimeout to: 90000
   [junit4]   2> 1294063 T6685 oashc.HttpShardHandlerFactory.getParameter Setting urlScheme to: 
   [junit4]   2> 1294063 T6685 oashc.HttpShardHandlerFactory.getParameter Setting connTimeout to: 15000
   [junit4]   2> 1294064 T6685 oashc.HttpShardHandlerFactory.getParameter Setting maxConnectionsPerHost to: 20
   [junit4]   2> 1294064 T6685 oashc.HttpShardHandlerFactory.getParameter Setting corePoolSize to: 0
   [junit4]   2> 1294064 T6685 oashc.HttpShardHandlerFactory.getParameter Setting maximumPoolSize to: 2147483647
   [junit4]   2> 1294064 T6685 oashc.HttpShardHandlerFactory.getParameter Setting maxThreadIdleTime to: 5
   [junit4]   2> 1294065 T6685 oashc.HttpShardHandlerFactory.getParameter Setting sizeOfQueue to: -1
   [junit4]   2> 1294065 T6685 oashc.HttpShardHandlerFactory.getParameter Setting fairnessPolicy to: false
   [junit4]   2> 1294065 T6685 oasl.LogWatcher.createWatcher SLF4J impl is org.slf4j.impl.Log4jLoggerFactory
   [junit4]   2> 1294066 T6685 oasl.LogWatcher.newRegisteredLogWatcher Registering Log Listener [Log4j (org.slf4j.impl.Log4jLoggerFactory)]
   [junit4]   2> 1294066 T6685 oasc.CoreContainer.load Host Name: 127.0.0.1
   [junit4]   2> 1294066 T6685 oasc.ZkContainer.initZooKeeper Zookeeper client=127.0.0.1:40024/solr
   [junit4]   2> 1294066 T6685 oasc.ZkController.checkChrootPath zkHost includes chroot
   [junit4]   2> 1294075 T6685 oascc.ConnectionManager.waitForConnected Waiting for client to connect to ZooKeeper
   [junit4]   2> 1294076 T6705 oascc.ConnectionManager.process Watcher org.apache.solr.common.cloud.ConnectionManager@61fb95ac name:ZooKeeperConnection Watcher:127.0.0.1:40024 got event WatchedEvent state:SyncConnected type:None path:null path:null type:None
   [junit4]   2> 1294076 T6685 oascc.ConnectionManager.waitForConnected Client is connected to ZooKeeper
   [junit4]   2> 1294078 T6685 oascc.ConnectionManager.waitForConnected Waiting for client to connect to ZooKeeper
   [junit4]   2> 1294079 T6707 oascc.ConnectionManager.process Watcher org.apache.solr.common.cloud.ConnectionManager@2b57b217 name:ZooKeeperConnection Watcher:127.0.0.1:40024/solr got event WatchedEvent state:SyncConnected type:None path:null path:null type:None
   [junit4]   2> 1294079 T6685 oascc.ConnectionManager.waitForConnected Client is connected to ZooKeeper
   [junit4]   2> 1294080 T6685 oascc.SolrZkClient.makePath makePath: /overseer/queue
   [junit4]   2> 1294082 T6685 oascc.SolrZkClient.makePath makePath: /overseer/collection-queue-work
   [junit4]   2> 1294083 T6685 oascc.SolrZkClient.makePath makePath: /overseer/collection-map-running
   [junit4]   2> 1294085 T6685 oascc.SolrZkClient.makePath makePath: /overseer/collection-map-completed
   [junit4]   2> 1294087 T6685 oascc.SolrZkClient.makePath makePath: /overseer/collection-map-failure
   [junit4]   2> 1294088 T6685 oascc.SolrZkClient.makePath makePath: /live_nodes
   [junit4]   2> 1294089 T6685 oasc.ZkController.createEphemeralLiveNode Register node as live in ZooKeeper:/live_nodes/127.0.0.1:49898_na%2Fma
   [junit4]   2> 1294090 T6685 oascc.SolrZkClient.makePath makePath: /live_nodes/127.0.0.1:49898_na%2Fma
   [junit4]   2> 1294091 T6685 oascc.SolrZkClient.makePath makePath: /overseer_elect
   [junit4]   2> 1294102 T6685 oascc.SolrZkClient.makePath makePath: /overseer_elect/election
   [junit4]   2> 1294106 T6685 oasc.OverseerElectionContext.runLeaderProcess I am going to be the leader 127.0.0.1:49898_na%2Fma
   [junit4]   2> 1294106 T6685 oascc.SolrZkClient.makePath makePath: /overseer_elect/leader
   [junit4]   2> 1294107 T6685 oasc.Overseer.start Overseer (id=91818019171401731-127.0.0.1:49898_na%2Fma-n_0000000000) starting
   [junit4]   2> 1294109 T6685 oascc.SolrZkClient.makePath makePath: /overseer/queue-work
   [junit4]   2> 1294115 T6709 oasc.OverseerCollectionProcessor.run Process current queue of collection creations
   [junit4]   2> 1294115 T6685 oascc.SolrZkClient.makePath makePath: /clusterstate.json
   [junit4]   2> 1294117 T6685 oascc.SolrZkClient.makePath makePath: /aliases.json
   [junit4]   2> 1294119 T6685 oascc.ZkStateReader.createClusterStateWatchersAndUpdate Updating cluster state from ZooKeeper... 
   [junit4]   2> 1294120 T6708 oasc.Overseer$ClusterStateUpdater.run Starting to work on the main queue
   [junit4]   2> 1294121 T6685 oasc.CorePropertiesLocator.discover Looking for core definitions underneath /mnt/ssd/jenkins/workspace/Lucene-Solr-trunk-Linux/solr/build/solr-core/test/J1/./temp/solr.cloud.OverseerRolesTest-7AF9794BBBA1BCA0-001/tempDir-002
   [junit4]   2> 1294129 T6685 oasc.CorePropertiesLocator.discoverUnder Found core conf in /mnt/ssd/jenkins/workspace/Lucene-Solr-trunk-Linux/solr/build/solr-core/test/J1/./temp/solr.cloud.OverseerRolesTest-7AF9794BBBA1BCA0-001/tempDir-002/conf/
   [junit4]   2> 1294224 T6685 oasc.CorePropertiesLocator.discover Found 1 core definitions
   [junit4]   2> 1294225 T6685 oass.SolrDispatchFilter.init user.dir=/mnt/ssd/jenkins/workspace/Lucene-Solr-trunk-Linux/solr/build/solr-core/test/J1
   [junit4]   2> 1294225 T6685 oass.SolrDispatchFilter.init SolrDispatchFilter.init() done
   [junit4]   2> 1294226 T6685 oascc.ConnectionManager.waitForConnected Waiting for client to connect to ZooKeeper
   [junit4]   2> 1294227 T6712 oascc.ConnectionManager.process Watcher org.apache.solr.common.cloud.ConnectionManager@68fc6a2c name:ZooKeeperConnection Watcher:127.0.0.1:40024/solr got event WatchedEvent state:SyncConnected type:None path:null path:null type:None
   [junit4]   2> 1294227 T6685 oascc.ConnectionManager.waitForConnected Client is connected to ZooKeeper
   [junit4]   2> 1294228 T6685 oascc.ZkStateReader.createClusterStateWatchersAndUpdate Updating cluster state from ZooKeeper... 
   [junit4]   2> 1294230 T6685 oasc.ChaosMonkey.monkeyLog monkey: init - expire sessions:false cause connection loss:false
   [junit4]   2> 1294450 T6685 oasc.AbstractFullDistribZkTestBase.createJettys create jetty 1
   [junit4]   2> 1294451 T6685 oejs.Server.doStart jetty-8.1.10.v20130312
   [junit4]   2> 1294452 T6685 oejs.AbstractConnector.doStart Started SelectChannelConnector@127.0.0.1:49742
   [junit4]   2> 1294453 T6685 oass.SolrDispatchFilter.init SolrDispatchFilter.init()
   [junit4]   2> 1294453 T6685 oasc.SolrResourceLoader.locateSolrHome JNDI not configured for solr (NoInitialContextEx)
   [junit4]   2> 1294453 T6685 oasc.SolrResourceLoader.locateSolrHome using system property solr.solr.home: ../../../../../../../../../../mnt/ssd/jenkins/workspace/Lucene-Solr-trunk-Linux/solr/build/solr-core/test/J1/./temp/solr.cloud.OverseerRolesTest-7AF9794BBBA1BCA0-001/tempDir-003
   [junit4]   2> 1294454 T6685 oasc.SolrResourceLoader.<init> new SolrResourceLoader for directory: '../../../../../../../../../../mnt/ssd/jenkins/workspace/Lucene-Solr-trunk-Linux/solr/build/solr-core/test/J1/./temp/solr.cloud.OverseerRolesTest-7AF9794BBBA1BCA0-001/tempDir-003/'
   [junit4]   2> 1294471 T6685 oasc.ConfigSolr.fromFile Loading container configuration from /mnt/ssd/jenkins/workspace/Lucene-Solr-trunk-Linux/solr/build/solr-core/test/J1/../../../../../../../../../../mnt/ssd/jenkins/workspace/Lucene-Solr-trunk-Linux/solr/build/solr-core/test/J1/./temp/solr.cloud.OverseerRolesTest-7AF9794BBBA1BCA0-001/tempDir-003/solr.xml
   [junit4]   2> 1294478 T6685 oasc.CorePropertiesLocator.<init> Config-defined core root directory: /mnt/ssd/jenkins/workspace/Lucene-Solr-trunk-Linux/solr/build/solr-core/test/J1/../../../../../../../../../../mnt/ssd/jenkins/workspace/Lucene-Solr-trunk-Linux/solr/build/solr-core/test/J1/./temp/solr.cloud.OverseerRolesTest-7AF9794BBBA1BCA0-001/tempDir-003
   [junit4]   2> 1294478 T6685 oasc.CoreContainer.<init> New CoreContainer 949363090
   [junit4]   2> 1294478 T6685 oasc.CoreContainer.load Loading cores into CoreContainer [instanceDir=../../../../../../../../../../mnt/ssd/jenkins/workspace/Lucene-Solr-trunk-Linux/solr/build/solr-core/test/J1/./temp/solr.cloud.OverseerRolesTest-7AF9794BBBA1BCA0-001/tempDir-003/]
   [junit4]   2> 1294479 T6685 oashc.HttpShardHandlerFactory.getParameter Setting socketTimeout to: 90000
   [junit4]   2> 1294479 T6685 oashc.HttpShardHandlerFactory.getParameter Setting urlScheme to: 
   [junit4]   2> 1294479 T6685 oashc.HttpShardHandlerFactory.getParameter Setting connTimeout to: 15000
   [junit4]   2> 1294479 T6685 oashc.HttpShardHandlerFactory.getParameter Setting maxConnectionsPerHost to: 20
   [junit4]   2> 1294480 T6685 oashc.HttpShardHandlerFactory.getParameter Setting corePoolSize to: 0
   [junit4]   2> 1294480 T6685 oashc.HttpShardHandlerFactory.getParameter Setting maximumPoolSize to: 2147483647
   [junit4]   2> 1294480 T6685 oashc.HttpShardHandlerFactory.getParameter Setting maxThreadIdleTime to: 5
   [junit4]   2> 1294480 T6685 oashc.HttpShardHandlerFactory.getParameter Setting sizeOfQueue to: -1
   [junit4]   2> 1294481 T6685 oashc.HttpShardHandlerFactory.getParameter Setting fairnessPolicy to: false
   [junit4]   2> 1294481 T6685 oasl.LogWatcher.createWatcher SLF4J impl is org.slf4j.impl.Log4jLoggerFactory
   [junit4]   2> 1294481 T6685 oasl.LogWatcher.newRegisteredLogWatcher Registering Log Listener [Log4j (org.slf4j.impl.Log4jLoggerFactory)]
   [junit4]   2> 1294481 T6685 oasc.CoreContainer.load Host Name: 127.0.0.1
   [junit4]   2> 1294482 T6685 oasc.ZkContainer.initZooKeeper Zookeeper client=127.0.0.1:40024/solr
   [junit4]   2> 1294482 T6685 oasc.ZkController.checkChrootPath zkHost includes chroot
   [junit4]   2> 1294483 T6685 oascc.ConnectionManager.waitForConnected Waiting for client to connect to ZooKeeper
   [junit4]   2> 1294484 T6723 oascc.ConnectionManager.process Watcher org.apache.solr.common.cloud.ConnectionManager@7e6a168d name:ZooKeeperConnection Watcher:127.0.0.1:40024 got event WatchedEvent state:SyncConnected type:None path:null path:null type:None
   [junit4]   2> 1294484 T6685 oascc.ConnectionManager.waitForConnected Client is connected to ZooKeeper
   [junit4]   2> 1294486 T6685 oascc.ConnectionManager.waitForConnected Waiting for client to connect to ZooKeeper
   [junit4]   2> 1294488 T6725 oascc.ConnectionManager.process Watcher org.apache.solr.common.cloud.ConnectionManager@4f6e7421 name:ZooKeeperConnection Watcher:127.0.0.1:40024/solr got event WatchedEvent state:SyncConnected type:None path:null path:null type:None
   [junit4]   2> 1294488 T6685 oascc.ConnectionManager.waitForConnected Client is connected to ZooKeeper
   [junit4]   2> 1294495 T6685 oascc.ZkStateReader.createClusterStateWatchersAndUpdate Updating cluster state from ZooKeeper... 
   [junit4]   2> 1295498 T6685 oasc.ZkController.createEphemeralLiveNode Register node as live in ZooKeeper:/live_nodes/127.0.0.1:49742_na%2Fma
   [junit4]   2> 1295499 T6685 oascc.SolrZkClient.makePath makePath: /live_nodes/127.0.0.1:49742_na%2Fma
   [junit4]   2> 1295502 T6685 oasc.CorePropertiesLocator.discover Looking for core definitions underneath /mnt/ssd/jenkins/workspace/Lucene-Solr-trunk-Linux/solr/build/solr-core/test/J1/../../../../../../../../../../mnt/ssd/jenkins/workspace/Lucene-Solr-trunk-Linux/solr/build/solr-core/test/J1/./temp/solr.cloud.OverseerRolesTest-7AF9794BBBA1BCA0-001/tempDir-003
   [junit4]   2> 1295508 T6685 oasc.CorePropertiesLocator.discoverUnder Found core conf in /mnt/ssd/jenkins/workspace/Lucene-Solr-trunk-Linux/solr/build/solr-core/test/J1/../../../../../../../../../../mnt/ssd/jenkins/workspace/Lucene-Solr-trunk-Linux/solr/build/solr-core/test/J1/./temp/solr.cloud.OverseerRolesTest-7AF9794BBBA1BCA0-001/tempDir-003/conf/
   [junit4]   2> 1295635 T6685 oasc.CorePropertiesLocator.discover Found 1 core definitions
   [junit4]   2> 1295636 T6685 oass.SolrDispatchFilter.init user.dir=/mnt/ssd/jenkins/workspace/Lucene-Solr-trunk-Linux/solr/build/solr-core/test/J1
   [junit4]   2> 1295637 T6685 oass.SolrDispatchFilter.init SolrDispatchFilter.init() done
   [junit4]   2> 1295873 T6685 oasc.AbstractFullDistribZkTestBase.createJettys create jetty 2
   [junit4]   2> 1295874 T6685 oejs.Server.doStart jetty-8.1.10.v20130312
   [junit4]   2> 1295877 T6685 oejs.AbstractConnector.doStart Started SelectChannelConnector@127.0.0.1:50250
   [junit4]   2> 1295878 T6685 oass.SolrDispatchFilter.init SolrDispatchFilter.init()
   [junit4]   2> 1295878 T6685 oasc.SolrResourceLoader.locateSolrHome JNDI not configured for solr (NoInitialContextEx)
   [junit4]   2> 1295879 T6685 oasc.SolrResourceLoader.locateSolrHome using system property solr.solr.home: /mnt/ssd/jenkins/workspace/Lucene-Solr-trunk-Linux/solr/build/solr-core/test/J1/./temp/solr.cloud.OverseerRolesTest-7AF9794BBBA1BCA0-001/tempDir-004
   [junit4]   2> 1295879 T6685 oasc.SolrResourceLoader.<init> new SolrResourceLoader for directory: '/mnt/ssd/jenkins/workspace/Lucene-Solr-trunk-Linux/solr/build/solr-core/test/J1/./temp/solr.cloud.OverseerRolesTest-7AF9794BBBA1BCA0-001/tempDir-004/'
   [junit4]   2> 1295895 T6685 oasc.ConfigSolr.fromFile Loading container configuration from /mnt/ssd/jenkins/workspace/Lucene-Solr-trunk-Linux/solr/build/solr-core/test/J1/./temp/solr.cloud.OverseerRolesTest-7AF9794BBBA1BCA0-001/tempDir-004/solr.xml
   [junit4]   2> 1295901 T6685 oasc.CorePropertiesLocator.<init> Config-defined core root directory: /mnt/ssd/jenkins/workspace/Lucene-Solr-trunk-Linux/solr/build/solr-core/test/J1/./temp/solr.cloud.OverseerRolesTest-7AF9794BBBA1BCA0-001/tempDir-004
   [junit4]   2> 1295901 T6685 oasc.CoreContainer.<init> New CoreContainer 1255476532
   [junit4]   2> 1295902 T6685 oasc.CoreContainer.load Loading cores into CoreContainer [instanceDir=/mnt/ssd/jenkins/workspace/Lucene-Solr-trunk-Linux/solr/build/solr-core/test/J1/./temp/solr.cloud.OverseerRolesTest-7AF9794BBBA1BCA0-001/tempDir-004/]
   [junit4]   2> 1295902 T6685 oashc.HttpShardHandlerFactory.getParameter Setting socketTimeout to: 90000
   [junit4]   2> 1295902 T6685 oashc.HttpShardHandlerFactory.getParameter Setting urlScheme to: 
   [junit4]   2> 1295902 T6685 oashc.HttpShardHandlerFactory.getParameter Setting connTimeout to: 15000
   [junit4]   2> 1295903 T6685 oashc.HttpShardHandlerFactory.getParameter Setting maxConnectionsPerHost to: 20
   [junit4]   2> 1295903 T6685 oashc.HttpShardHandlerFactory.getParameter Setting corePoolSize to: 0
   [junit4]   2> 1295903 T6685 oashc.HttpShardHandlerFactory.getParameter Setting maximumPoolSize to: 2147483647
   [junit4]   2> 1295903 T6685 oashc.HttpShardHandlerFactory.getParameter Setting maxThreadIdleTime to: 5
   [junit4]   2> 1295904 T6685 oashc.HttpShardHandlerFactory.getParameter Setting sizeOfQueue to: -1
   [junit4]   2> 1295904 T6685 oashc.HttpShardHandlerFactory.getParameter Setting fairnessPolicy to: false
   [junit4]   2> 1295904 T6685 oasl.LogWatcher.createWatcher SLF4J impl is org.slf4j.impl.Log4jLoggerFactory
   [junit4]   2> 1295904 T6685 oasl.LogWatcher.newRegisteredLogWatcher Registering Log Listener [Log4j (org.slf4j.impl.Log4jLoggerFactory)]
   [junit4]   2> 1295905 T6685 oasc.CoreContainer.load Host Name: 127.0.0.1
   [junit4]   2> 1295905 T6685 oasc.ZkContainer.initZooKeeper Zookeeper client=127.0.0.1:40024/solr
   [junit4]   2> 1295905 T6685 oasc.ZkController.checkChrootPath zkHost includes chroot
   [junit4]   2> 1295906 T6685 oascc.ConnectionManager.waitForConnected Waiting for client to connect to ZooKeeper
   [junit4]   2> 1295908 T6737 oascc.ConnectionManager.process Watcher org.apache.solr.common.cloud.ConnectionManager@c5911e9 name:ZooKeeperConnection Watcher:127.0.0.1:40024 got event WatchedEvent state:SyncConnected type:None path:null path:null type:None
   [junit4]   2> 1295908 T6685 oascc.ConnectionManager.waitForConnected Client is connected to ZooKeeper
   [junit4]   2> 1295911 T6685 oascc.ConnectionManager.waitForConnected Waiting for client to connect to ZooKeeper
   [junit4]   2> 1295912 T6739 oascc.ConnectionManager.process Watcher org.apache.solr.common.cloud.ConnectionManager@6996b6c7 name:ZooKeeperConnection Watcher:127.0.0.1:40024/solr got event WatchedEvent state:SyncConnected type:None path:null path:null type:None
   [junit4]   2> 1295912 T6685 oascc.ConnectionManager.waitForConnected Client is connected to ZooKeeper
   [junit4]   2> 1295923 T6685 oascc.ZkStateReader.createClusterStateWatchersAndUpdate Updating cluster state from ZooKeeper... 
   [junit4]   2> 1296927 T6685 oasc.ZkController.createEphemeralLiveNode Register node as live in ZooKeeper:/live_nodes/127.0.0.1:50250_na%2Fma
   [junit4]   2> 1296928 T6685 oascc.SolrZkClient.makePath makePath: /live_nodes/127.0.0.1:50250_na%2Fma
   [junit4]   2> 1296936 T6685 oasc.CorePropertiesLocator.discover Looking for core definitions underneath /mnt/ssd/jenkins/workspace/Lucene-Solr-trunk-Linux/solr/build/solr-core/test/J1/./temp/solr.cloud.OverseerRolesTest-7AF9794BBBA1BCA0-001/tempDir-004
   [junit4]   2> 1296953 T6685 oasc.CorePropertiesLocator.discoverUnder Found core conf in /mnt/ssd/jenkins/workspace/Lucene-Solr-trunk-Linux/solr/build/solr-core/test/J1/./temp/solr.cloud.OverseerRolesTest-7AF9794BBBA1BCA0-001/tempDir-004/conf/
   [junit4]   2> 1297059 T6685 oasc.CorePropertiesLocator.discover Found 1 core definitions
   [junit4]   2> 1297060 T6685 oass.SolrDispatchFilter.init user.dir=/mnt/ssd/jenkins/workspace/Lucene-Solr-trunk-Linux/solr/build/solr-core/test/J1
   [junit4]   2> 1297060 T6685 oass.SolrDispatchFilter.init SolrDispatchFilter.init() done
   [junit4]   2> 1297281 T6685 oasc.AbstractFullDistribZkTestBase.createJettys create jetty 3
   [junit4]   2> 1297281 T6685 oejs.Server.doStart jetty-8.1.10.v20130312
   [junit4]   2> 1297292 T6685 oejs.AbstractConnector.doStart Started SelectChannelConnector@127.0.0.1:37700
   [junit4]   2> 1297293 T6685 oass.SolrDispatchFilter.init SolrDispatchFilter.init()
   [junit4]   2> 1297293 T6685 oasc.SolrResourceLoader.locateSolrHome JNDI not configured for solr (NoInitialContextEx)
   [junit4]   2> 1297293 T6685 oasc.SolrResourceLoader.locateSolrHome using system property solr.solr.home: ../../../../../../../../../../mnt/ssd/jenkins/workspace/Lucene-Solr-trunk-Linux/solr/build/solr-core/test/J1/./temp/solr.cloud.OverseerRolesTest-7AF9794BBBA1BCA0-001/tempDir-005
   [junit4]   2> 1297293 T6685 oasc.SolrResourceLoader.<init> new SolrResourceLoader for directory: '../../../../../../../../../../mnt/ssd/jenkins/workspace/Lucene-Solr-trunk-Linux/solr/build/solr-core/test/J1/./temp/solr.cloud.OverseerRolesTest-7AF9794BBBA1BCA0-001/tempDir-005/'
   [junit4]   2> 1297303 T6685 oasc.ConfigSolr.fromFile Loading container configuration from /mnt/ssd/jenkins/workspace/Lucene-Solr-trunk-Linux/solr/build/solr-core/test/J1/../../../../../../../../../../mnt/ssd/jenkins/workspace/Lucene-Solr-trunk-Linux/solr/build/solr-core/test/J1/./temp/solr.cloud.OverseerRolesTest-7AF9794BBBA1BCA0-001/tempDir-005/solr.xml
   [junit4]   2> 1297310 T6685 oasc.CorePropertiesLocator.<init> Config-defined core root directory: /mnt/ssd/jenkins/workspace/Lucene-Solr-trunk-Linux/solr/build/solr-core/test/J1/../../../../../../../../../../mnt/ssd/jenkins/workspace/Lucene-Solr-trunk-Linux/solr/build/solr-core/test/J1/./temp/solr.cloud.OverseerRolesTest-7AF9794BBBA1BCA0-001/tempDir-005
   [junit4]   2> 1297310 T6685 oasc.CoreContainer.<init> New CoreContainer 989041389
   [junit4]   2> 1297310 T6685 oasc.CoreContainer.load Loading cores into CoreContainer [instanceDir=../../../../../../../../../../mnt/ssd/jenkins/workspace/Lucene-Solr-trunk-Linux/solr/build/solr-core/test/J1/./temp/solr.cloud.OverseerRolesTest-7AF9794BBBA1BCA0-001/tempDir-005/]
   [junit4]   2> 1297311 T6685 oashc.HttpShardHandlerFactory.getParameter Setting socketTimeout to: 90000
   [junit4]   2> 1297311 T6685 oashc.HttpShardHandlerFactory.getParameter Setting urlScheme to: 
   [junit4]   2> 1297311 T6685 oashc.HttpShardHandlerFactory.getParameter Setting connTimeout to: 15000
   [junit4]   2> 1297311 T6685 oashc.HttpShardHandlerFactory.getParameter Setting maxConnectionsPerHost to: 20
   [junit4]   2> 1297312 T6685 oashc.HttpShardHandlerFactory.getParameter Setting corePoolSize to: 0
   [junit4]   2> 1297312 T6685 oashc.HttpShardHandlerFactory.getParameter Setting maximumPoolSize to: 2147483647
   [junit4]   2> 1297312 T6685 oashc.HttpShardHandlerFactory.getParameter Setting maxThreadIdleTime to: 5
   [junit4]   2> 1297312 T6685 oashc.HttpShardHandlerFactory.getParameter Setting sizeOfQueue to: -1
   [junit4]   2> 1297313 T6685 oashc.HttpShardHandlerFactory.getParameter Setting fairnessPolicy to: false
   [junit4]   2> 1297313 T6685 oasl.LogWatcher.createWatcher SLF4J impl is org.slf4j.impl.Log4jLoggerFactory
   [junit4]   2> 1297313 T6685 oasl.LogWatcher.newRegisteredLogWatcher Registering Log Listener [Log4j (org.slf4j.impl.Log4jLoggerFactory)]
   [junit4]   2> 1297314 T6685 oasc.CoreContainer.load Host Name: 127.0.0.1
   [junit4]   2> 1297314 T6685 oasc.ZkContainer.initZooKeeper Zookeeper client=127.0.0.1:40024/solr
   [junit4]   2> 1297314 T6685 oasc.ZkController.checkChrootPath zkHost includes chroot
   [junit4]   2> 1297315 T6685 oascc.ConnectionManager.waitForConnected Waiting for client to connect to ZooKeeper
   [junit4]   2> 1297316 T6751 oascc.ConnectionManager.process Watcher org.apache.solr.common.cloud.ConnectionManager@42311887 name:ZooKeeperConnection Watcher:127.0.0.1:40024 got event WatchedEvent state:SyncConnected type:None path:null path:null type:None
   [junit4]   2> 1297316 T6685 oascc.ConnectionManager.waitForConnected Client is connected to ZooKeeper
   [junit4]   2> 1297318 T6685 oascc.ConnectionManager.waitForConnected Waiting for client to connect to ZooKeeper
   [junit4]   2> 1297318 T6753 oascc.ConnectionManager.process Watcher org.apache.solr.common.cloud.ConnectionManager@51a59c14 name:ZooKeeperConnection Watcher:127.0.0.1:40024/solr got event WatchedEvent state:SyncConnected type:None path:null path:null type:None
   [junit4]   2> 1297319 T6685 oascc.ConnectionManager.waitForConnected Client is connected to ZooKeeper
   [junit4]   2> 1297323 T6685 oascc.ZkStateReader.createClusterStateWatchersAndUpdate Updating cluster state from ZooKeeper... 
   [junit4]   2> 1298325 T6685 oasc.ZkController.createEphemeralLiveNode Register node as live in ZooKeeper:/live_nodes/127.0.0.1:37700_na%2Fma
   [junit4]   2> 1298326 T6685 oascc.SolrZkClient.makePath makePath: /live_nodes/127.0.0.1:37700_na%2Fma
   [junit4]   2> 1298333 T6685 oasc.CorePropertiesLocator.discover Looking for core definitions underneath /mnt/ssd/jenkins/workspace/Lucene-Solr-trunk-Linux/solr/build/solr-core/test/J1/../../../../../../../../../../mnt/ssd/jenkins/workspace/Lucene-Solr-trunk-Linux/solr/build/solr-core/test/J1/./temp/solr.cloud.OverseerRolesTest-7AF9794BBBA1BCA0-001/tempDir-005
   [junit4]   2> 1298343 T6685 oasc.CorePropertiesLocator.discoverUnder Found core conf in /mnt/ssd/jenkins/workspace/Lucene-Solr-trunk-Linux/solr/build/solr-core/test/J1/../../../../../../../../../../mnt/ssd/jenkins/workspace/Lucene-Solr-trunk-Linux/solr/build/solr-core/test/J1/./temp/solr.cloud.OverseerRolesTest-7AF9794BBBA1BCA0-001/tempDir-005/conf/
   [junit4]   2> 1298465 T6685 oasc.CorePropertiesLocator.discover Found 1 core definitions
   [junit4]   2> 1298467 T6685 oass.SolrDispatchFilter.init user.dir=/mnt/ssd/jenkins/workspace/Lucene-Solr-trunk-Linux/solr/build/solr-core/test/J1
   [junit4]   2> 1298467 T6685 oass.SolrDispatchFilter.init SolrDispatchFilter.init() done
   [junit4]   2> 1298693 T6685 oasc.AbstractFullDistribZkTestBase.createJettys create jetty 4
   [junit4]   2> 1298694 T6685 oejs.Server.doStart jetty-8.1.10.v20130312
   [junit4]   2> 1298696 T6685 oejs.AbstractConnector.doStart Started SelectChannelConnector@127.0.0.1:53860
   [junit4]   2> 1298696 T6685 oass.SolrDispatchFilter.init SolrDispatchFilter.init()
   [junit4]   2> 1298697 T6685 oasc.SolrResourceLoader.locateSolrHome JNDI not configured for solr (NoInitialContextEx)
   [junit4]   2> 1298698 T6685 oasc.SolrResourceLoader.locateSolrHome using system property solr.solr.home: /mnt/ssd/jenkins/workspace/Lucene-Solr-trunk-Linux/solr/build/solr-core/test/J1/./temp/solr.cloud.OverseerRolesTest-7AF9794BBBA1BCA0-001/tempDir-006
   [junit4]   2> 1298698 T6685 oasc.SolrResourceLoader.<init> new SolrResourceLoader for directory: '/mnt/ssd/jenkins/workspace/Lucene-Solr-trunk-Linux/solr/build/solr-core/test/J1/./temp/solr.cloud.OverseerRolesTest-7AF9794BBBA1BCA0-001/tempDir-006/'
   [junit4]   2> 1298710 T6685 oasc.ConfigSolr.fromFile Loading container configuration from /mnt/ssd/jenkins/workspace/Lucene-Solr-trunk-Linux/solr/build/solr-core/test/J1/./temp/solr.cloud.OverseerRolesTest-7AF9794BBBA1BCA0-001/tempDir-006/solr.xml
   [junit4]   2> 1298723 T6685 oasc.CorePropertiesLocator.<init> Config-defined core root directory: /mnt/ssd/jenkins/workspace/Lucene-Solr-trunk-Linux/solr/build/solr-core/test/J1/./temp/solr.cloud.OverseerRolesTest-7AF9794BBBA1BCA0-001/tempDir-006
   [junit4]   2> 1298724 T6685 oasc.CoreContainer.<init> New CoreContainer 821250510
   [junit4]   2> 1298725 T6685 oasc.CoreContainer.load Loading cores into CoreContainer [instanceDir=/mnt/ssd/jenkins/workspace/Lucene-Solr-trunk-Linux/solr/build/solr-core/test/J1/./temp/solr.cloud.OverseerRolesTest-7AF9794BBBA1BCA0-001/tempDir-006/]
   [junit4]   2> 1298726 T6685 oashc.HttpShardHandlerFactory.getParameter Setting socketTimeout to: 90000
   [junit4]   2> 1298726 T6685 oashc.HttpShardHandlerFactory.getParameter Setting urlScheme to: 
   [junit4]   2> 1298727 T6685 oashc.HttpShardHandlerFactory.getParameter Setting connTimeout to: 15000
   [junit4]   2> 1298727 T6685 oashc.HttpShardHandlerFactory.getParameter Setting maxConnectionsPerHost to: 20
   [junit4]   2> 1298728 T6685 oashc.HttpShardHandlerFactory.getParameter Setting corePoolSize to: 0
   [junit4]   2> 1298728 T6685 oashc.HttpShardHandlerFactory.getParameter Setting maximumPoolSize to: 2147483647
   [junit4]   2> 1298729 T6685 oashc.HttpShardHandlerFactory.getParameter Setting maxThreadIdleTime to: 5
   [junit4]   2> 1298729 T6685 oashc.HttpShardHandlerFactory.getParameter Setting sizeOfQueue to: -1
   [junit4]   2> 1298730 T6685 oashc.HttpShardHandlerFactory.getParameter Setting fairnessPolicy to: false
   [junit4]   2> 1298731 T6685 oasl.LogWatcher.createWatcher SLF4J impl is org.slf4j.impl.Log4jLoggerFactory
   [junit4]   2> 1298731 T6685 oasl.LogWatcher.newRegisteredLogWatcher Registering Log Listener [Log4j (org.slf4j.impl.Log4jLoggerFactory)]
   [junit4]   2> 1298732 T6685 oasc.CoreContainer.load Host Name: 127.0.0.1
   [junit4]   2> 1298732 T6685 oasc.ZkContainer.initZooKeeper Zookeeper client=127.0.0.1:40024/solr
   [junit4]   2> 1298732 T6685 oasc.ZkController.checkChrootPath zkHost includes chroot
   [junit4]   2> 1298733 T6685 oascc.ConnectionManager.waitForConnected Waiting for client to connect to ZooKeeper
   [junit4]   2> 1298735 T6765 oascc.ConnectionManager.process Watcher org.apache.solr.common.cloud.ConnectionManager@6fb56a85 name:ZooKeeperConnection Watcher:127.0.0.1:40024 got event WatchedEvent state:SyncConnected type:None path:null path:null type:None
   [junit4]   2> 1298735 T6685 oascc.ConnectionManager.waitForConnected Client is connected to ZooKeeper
   [junit4]   2> 1298736 T6685 oascc.ConnectionManager.waitForConnected Waiting for client to connect to ZooKeeper
   [junit4]   2> 1298737 T6767 oascc.ConnectionManager.process Watcher org.apache.solr.common.cloud.ConnectionManager@7c533811 name:ZooKeeperConnection Watcher:127.0.0.1:40024/solr got event WatchedEvent state:SyncConnected type:None path:null path:null type:None
   [junit4]   2> 1298738 T6685 oascc.ConnectionManager.waitForConnected Client is connected to ZooKeeper
   [junit4]   2> 1298744 T6685 oascc.ZkStateReader.createClusterStateWatchersAndUpdate Updating cluster state from ZooKeeper... 
   [junit4]   2> 1299748 T6685 oasc.ZkController.createEphemeralLiveNode Register node as live in ZooKeeper:/live_nodes/127.0.0.1:53860_na%2Fma
   [junit4]   2> 1299750 T6685 oascc.SolrZkClient.makePath makePath: /live_nodes/127.0.0.1:53860_na%2Fma
   [junit4]   2> 1299759 T6685 oasc.CorePropertiesLocator.discover Looking for core definitions underneath /mnt/ssd/jenkins/workspace/Lucene-Solr-trunk-Linux/solr/build/solr-core/test/J1/./temp/solr.cloud.OverseerRolesTest-7AF9794BBBA1BCA0-001/tempDir-006
   [junit4]   2> 1299769 T6685 oasc.CorePropertiesLocator.discoverUnder Found core conf in /mnt/ssd/jenkins/workspace/Lucene-Solr-trunk-Linux/solr/build/solr-core/test/J1/./temp/solr.cloud.OverseerRolesTest-7AF9794BBBA1BCA0-001/tempDir-006/conf/
   [junit4]   2> 1299871 T6685 oasc.CorePropertiesLocator.discover Found 1 core definitions
   [junit4]   2> 1299873 T6685 oass.SolrDispatchFilter.init user.dir=/mnt/ssd/jenkins/workspace/Lucene-Solr-trunk-Linux/solr/build/solr-core/test/J1
   [junit4]   2> 1299873 T6685 oass.SolrDispatchFilter.init SolrDispatchFilter.init() done
   [junit4]   2> 1300099 T6685 oasc.AbstractFullDistribZkTestBase.createJettys create jetty 5
   [junit4]   2> 1300099 T6685 oejs.Server.doStart jetty-8.1.10.v20130312
   [junit4]   2> 1300101 T6685 oejs.AbstractConnector.doStart Started SelectChannelConnector@127.0.0.1:48995
   [junit4]   2> 1300101 T6685 oass.SolrDispatchFilter.init SolrDispatchFilter.init()
   [junit4]   2> 1300102 T6685 oasc.SolrResourceLoader.locateSolrHome JNDI not configured for solr (NoInitialContextEx)
   [junit4]   2> 1300102 T6685 oasc.SolrResourceLoader.locateSolrHome using system property solr.solr.home: ../../../../../../../../../../mnt/ssd/jenkins/workspace/Lucene-Solr-trunk-Linux/solr/build/solr-core/test/J1/./temp/solr.cloud.OverseerRolesTest-7AF9794BBBA1BCA0-001/tempDir-007
   [junit4]   2> 1300102 T6685 oasc.SolrResourceLoader.<init> new SolrResourceLoader for directory: '../../../../../../../../../../mnt/ssd/jenkins/workspace/Lucene-Solr-trunk-Linux/solr/build/solr-core/test/J1/./temp/solr.cloud.OverseerRolesTest-7AF9794BBBA1BCA0-001/tempDir-007/'
   [junit4]   2> 1300112 T6685 oasc.ConfigSolr.fromFile Loading container configuration from /mnt/ssd/jenkins/workspace/Lucene-Solr-trunk-Linux/solr/build/solr-core/test/J1/../../../../../../../../../../mnt/ssd/jenkins/workspace/Lucene-Solr-trunk-Linux/solr/build/solr-core/test/J1/./temp/solr.cloud.OverseerRolesTest-7AF9794BBBA1BCA0-001/tempDir-007/solr.xml
   [junit4]   2> 1300119 T6685 oasc.CorePropertiesLocator.<init> Config-defined core root directory: /mnt/ssd/jenkins/workspace/Lucene-Solr-trunk-Linux/solr/build/solr-core/test/J1/../../../../../../../../../../mnt/ssd/jenkins/workspace/Lucene-Solr-trunk-Linux/solr/build/solr-core/test/J1/./temp/solr.cloud.OverseerRolesTest-7AF9794BBBA1BCA0-001/tempDir-007
   [junit4]   2> 1300119 T6685 oasc.CoreContainer.<init> New CoreContainer 1031526380
   [junit4]   2> 1300120 T6685 oasc.CoreContainer.load Loading cores into CoreContainer [instanceDir=../../../../../../../../../../mnt/ssd/jenkins/workspace/Lucene-Solr-trunk-Linux/solr/build/solr-core/test/J1/./temp/solr.cloud.OverseerRolesTest-7AF9794BBBA1BCA0-001/tempDir-007/]
   [junit4]   2> 1300120 T6685 oashc.HttpShardHandlerFactory.getParameter Setting socketTimeout to: 90000
   [junit4]   2> 1300120 T6685 oashc.HttpShardHandlerFactory.getParameter Setting urlScheme to: 
   [junit4]   2> 1300121 T6685 oashc.HttpShardHandlerFactory.getParameter Setting connTimeout to: 15000
   [junit4]   2> 1300121 T6685 oashc.HttpShardHandlerFactory.getParameter Setting maxConnectionsPerHost to: 20
   [junit4]   2> 1300121 T6685 oashc.HttpShardHandlerFactory.getParameter Setting corePoolSize to: 0
   [junit4]   2> 1300121 T6685 oashc.HttpShardHandlerFactory.getParameter Setting maximumPoolSize to: 2147483647
   [junit4]   2> 1300122 T6685 oashc.HttpShardHandlerFactory.getParameter Setting maxThreadIdleTime to: 5
   [junit4]   2> 1300122 T6685 oashc.HttpShardHandlerFactory.getParameter Setting sizeOfQueue to: -1
   [junit4]   2> 1300122 T6685 oashc.HttpShardHandlerFactory.getParameter Setting fairnessPolicy to: false
   [junit4]   2> 1300123 T6685 oasl.LogWatcher.createWatcher SLF4J impl is org.slf4j.impl.Log4jLoggerFactory
   [junit4]   2> 1300123 T6685 oasl.LogWatcher.newRegisteredLogWatcher Registering Log Listener [Log4j (org.slf4j.impl.Log4jLoggerFactory)]
   [junit4]   2> 1300123 T6685 oasc.CoreContainer.load Host Name: 127.0.0.1
   [junit4]   2> 1300123 T6685 oasc.ZkContainer.initZooKeeper Zookeeper client=127.0.0.1:40024/solr
   [junit4]   2> 1300124 T6685 oasc.ZkController.checkChrootPath zkHost includes chroot
   [junit4]   2> 1300124 T6685 oascc.ConnectionManager.waitForConnected Waiting for client to connect to ZooKeeper
   [junit4]   2> 1300125 T6779 oascc.ConnectionManager.process Watcher org.apache.solr.common.cloud.ConnectionManager@5f4a3baf name:ZooKeeperConnection Watcher:127.0.0.1:40024 got event WatchedEvent state:SyncConnected type:None path:null path:null type:None
   [junit4]   2> 1300125 T6685 oascc.ConnectionManager.waitForConnected Client is connected to ZooKeeper
   [junit4]   2> 1300127 T6685 oascc.ConnectionManager.waitForConnected Waiting for client to connect to ZooKeeper
   [junit4]   2> 1300128 T6781 oascc.ConnectionManager.process Watcher org.apache.solr.common.cloud.ConnectionManager@34d051b7 name:ZooKeeperConnection Watcher:127.0.0.1:40024/solr got event WatchedEvent state:SyncConnected type:None path:null path:null type:None
   [junit4]   2> 1300128 T6685 oascc.ConnectionManager.waitForConnected Client is connected to ZooKeeper
   [junit4]   2> 1300132 T6685 oascc.ZkStateReader.createClusterStateWatchersAndUpdate Updating cluster state from ZooKeeper... 
   [junit4]   2> 1301134 T6685 oasc.ZkController.createEphemeralLiveNode Register node as live in ZooKeeper:/live_nodes/127.0.0.1:48995_na%2Fma
   [junit4]   2> 1301135 T6685 oascc.SolrZkClient.makePath makePath: /live_nodes/127.0.0.1:48995_na%2Fma
   [junit4]   2> 1301145 T6685 oasc.CorePropertiesLocator.discover Looking for core definitions underneath /mnt/ssd/jenkins/workspace/Lucene-Solr-trunk-Linux/solr/build/solr-core/test/J1/../../../../../../../../../../mnt/ssd/jenkins/workspace/Lucene-Solr-trunk-Linux/solr/build/solr-core/test/J1/./temp/solr.cloud.OverseerRolesTest-7AF9794BBBA1BCA0-001/tempDir-007
   [junit4]   2> 1301151 T6685 oasc.CorePropertiesLocator.discoverUnder Found core conf in /mnt/ssd/jenkins/workspace/Lucene-Solr-trunk-Linux/solr/build/solr-core/test/J1/../../../../../../../../../../mnt/ssd/jenkins/workspace/Lucene-Solr-trunk-Linux/solr/build/solr-core/test/J1/./temp/solr.cloud.OverseerRolesTest-7AF9794BBBA1BCA0-001/tempDir-007/conf/
   [junit4]   2> 1301272 T6685 oasc.CorePropertiesLocator.discover Found 1 core definitions
   [junit4]   2> 1301273 T6685 oass.SolrDispatchFilter.init user.dir=/mnt/ssd/jenkins/workspace/Lucene-Solr-trunk-Linux/solr/build/solr-core/test/J1
   [junit4]   2> 1301273 T6685 oass.SolrDispatchFilter.init SolrDispatchFilter.init() done
   [junit4]   2> 1301501 T6685 oasc.AbstractFullDistribZkTestBase.createJettys create jetty 6
   [junit4]   2> 1301502 T6685 oejs.Server.doStart jetty-8.1.10.v20130312
   [junit4]   2> 1301504 T6685 oejs.AbstractConnector.doStart Started SelectChannelConnector@127.0.0.1:51956
   [junit4]   2> 1301504 T6685 oass.SolrDispatchFilter.init SolrDispatchFilter.init()
   [junit4]   2> 1301505 T6685 oasc.SolrResourceLoader.locateSolrHome JNDI not configured for solr (NoInitialContextEx)
   [junit4]   2> 1301505 T6685 oasc.SolrResourceLoader.locateSolrHome using system property solr.solr.home: /mnt/ssd/jenkins/workspace/Lucene-Solr-trunk-Linux/solr/build/solr-core/test/J1/./temp/solr.cloud.OverseerRolesTest-7AF9794BBBA1BCA0-001/tempDir-008
   [junit4]   2> 1301505 T6685 oasc.SolrResourceLoader.<init> new SolrResourceLoader for directory: '/mnt/ssd/jenkins/workspace/Lucene-Solr-trunk-Linux/solr/build/solr-core/test/J1/./temp/solr.cloud.OverseerRolesTest-7AF9794BBBA1BCA0-001/tempDir-008/'
   [junit4]   2> 1301515 T6685 oasc.ConfigSolr.fromFile Loading container configuration from /mnt/ssd/jenkins/workspace/Lucene-Solr-trunk-Linux/solr/build/solr-core/test/J1/./temp/solr.cloud.OverseerRolesTest-7AF9794BBBA1BCA0-001/tempDir-008/solr.xml
   [junit4]   2> 1301521 T6685 oasc.CorePropertiesLocator.<init> Config-defined core root directory: /mnt/ssd/jenkins/workspace/Lucene-Solr-trunk-Linux/solr/build/solr-core/test/J1/./temp/solr.cloud.OverseerRolesTest-7AF9794BBBA1BCA0-001/tempDir-008
   [junit4]   2> 1301522 T6685 oasc.CoreContainer.<init> New CoreContainer 1000716582
   [junit4]   2> 1301522 T6685 oasc.CoreContainer.load Loading cores into CoreContainer [instanceDir=/mnt/ssd/jenkins/workspace/Lucene-Solr-trunk-Linux/solr/build/solr-core/test/J1/./temp/solr.cloud.OverseerRolesTest-7AF9794BBBA1BCA0-001/tempDir-008/]
   [junit4]   2> 1301523 T6685 oashc.HttpShardHandlerFactory.getParameter Setting socketTimeout to: 90000
   [junit4]   2> 1301523 T6685 oashc.HttpShardHandlerFactory.getParameter Setting urlScheme to: 
   [junit4]   2> 1301523 T6685 oashc.HttpShardHandlerFactory.getParameter Setting connTimeout to: 15000
   [junit4]   2> 1301523 T6685 oashc.HttpShardHandlerFactory.getParameter Setting maxConnectionsPerHost to: 20
   [junit4]   2> 1301524 T6685 oashc.HttpShardHandlerFactory.getParameter Setting corePoolSize to: 0
   [junit4]   2> 1301524 T6685 oashc.HttpShardHandlerFactory.getParameter Setting maximumPoolSize to: 2147483647
   [junit4]   2> 1301524 T6685 oashc.HttpShardHandlerFactory.getParameter Setting maxThreadIdleTime to: 5
   [junit4]   2> 1301524 T6685 oashc.HttpShardHandlerFactory.getParameter Setting sizeOfQueue to: -1
   [junit4]   2> 1301524 T6685 oashc.HttpShardHandlerFactory.getParameter Setting fairnessPolicy to: false
   [junit4]   2> 1301525 T6685 oasl.LogWatcher.createWatcher SLF4J impl is org.slf4j.impl.Log4jLoggerFactory
   [junit4]   2> 1301525 T6685 oasl.LogWatcher.newRegisteredLogWatcher Registering Log Listener [Log4j (org.slf4j.impl.Log4jLoggerFactory)]
   [junit4]   2> 1301525 T6685 oasc.CoreContainer.load Host Name: 127.0.0.1
   [junit4]   2> 1301526 T6685 oasc.ZkContainer.initZooKeeper Zookeeper client=127.0.0.1:40024/solr
   [junit4]   2> 1301526 T6685 oasc.ZkController.checkChrootPath zkHost includes chroot
   [junit4]   2> 1301527 T6685 oascc.ConnectionManager.waitForConnected Waiting for client to connect to ZooKeeper
   [junit4]   2> 1301573 T6793 oascc.ConnectionManager.process Watcher org.apache.solr.common.cloud.ConnectionManager@518efa65 name:ZooKeeperConnection Watcher:127.0.0.1:40024 got event WatchedEvent state:SyncConnected type:None path:null path:null type:None
   [junit4]   2> 1301573 T6685 oascc.ConnectionManager.waitForConnected Client is connected to ZooKeeper
   [junit4]   2> 1301581 T6685 oascc.ConnectionManager.waitForConnected Waiting for client to connect to ZooKeeper
   [junit4]   2> 1301582 T6795 oascc.ConnectionManager.process Watcher org.apache.solr.common.cloud.ConnectionManager@317ba893 name:ZooKeeperConnection Watcher:127.0.0.1:40024/solr got event WatchedEvent state:SyncConnected type:None path:null path:null type:None
   [junit4]   2> 1301582 T6685 oascc.ConnectionManager.waitForConnected Client is connected to ZooKeeper
   [junit4]   2> 1301586 T6685 oascc.ZkStateReader.createClusterStateWatchersAndUpdate Updating cluster state from ZooKeeper... 
   [junit4]   2> 1302587 T6685 oasc.ZkController.createEphemeralLiveNode Register node as live in ZooKeeper:/live_nodes/127.0.0.1:51956_na%2Fma
   [junit4]   2> 1302588 T6685 oascc.SolrZkClient.makePath makePath: /live_nodes/127.0.0.1:51956_na%2Fma
   [junit4]   2> 1302593 T6685 oasc.CorePropertiesLocator.discover Looking for core definitions underneath /mnt/ssd/jenkins/workspace/Lucene-Solr-trunk-Linux/solr/build/solr-core/test/J1/./temp/solr.cloud.OverseerRolesTest-7AF9794BBBA1BCA0-001/tempDir-008
   [junit4]   2> 1302598 T6685 oasc.CorePropertiesLocator.discoverUnder Found core conf in /mnt/ssd/jenkins/workspace/Lucene-Solr-trunk-Linux/solr/build/solr-core/test/J1/./temp/solr.cloud.OverseerRolesTest-7AF9794BBBA1BCA0-001/tempDir-008/conf/
   [junit4]   2> 1302703 T6685 oasc.CorePropertiesLocator.discover Found 1 core definitions
   [junit4]   2> 1302704 T6685 oass.SolrDispatchFilter.init user.dir=/mnt/ssd/jenkins/workspace/Lucene-Solr-trunk-Linux/solr/build/solr-core/test/J1
   [junit4]   2> 1302704 T6685 oass.SolrDispatchFilter.init SolrDispatchFilter.init() done
   [junit4]   2> 1302705 T6685 oascc.ConnectionManager.waitForConnected Waiting for client to connect to ZooKeeper
   [junit4]   2> 1302706 T6798 oascc.ConnectionManager.process Watcher org.apache.solr.common.cloud.ConnectionManager@3ee50246 name:ZooKeeperConnection Watcher:127.0.0.1:40024/solr got event WatchedEvent state:SyncConnected type:None path:null path:null type:None
   [junit4]   2> 1302706 T6685 oascc.ConnectionManager.waitForConnected Client is connected to ZooKeeper
   [junit4]   2> 1302707 T6685 oascc.ZkStateReader.createClusterStateWatchersAndUpdate Updating cluster state from ZooKeeper... 
   [junit4]   2> 1302709 T6685 oascc.ConnectionManager.waitForConnected Waiting for client to connect to ZooKeeper
   [junit4]   2> 1302710 T6800 oascc.ConnectionManager.process Watcher org.apache.solr.common.cloud.ConnectionManager@289fe035 name:ZooKeeperConnection Watcher:127.0.0.1:40024/solr got event WatchedEvent state:SyncConnected type:None path:null path:null type:None
   [junit4]   2> 1302710 T6685 oascc.ConnectionManager.waitForConnected Client is connected to ZooKeeper
   [junit4]   2> 1302711 T6685 oascc.ZkStateReader.createClusterStateWatchersAndUpdate Updating cluster state from ZooKeeper... 
   [junit4]   2> 1302714 T6763 oasha.CollectionsHandler.handleCreateAction Creating Collection : replicationFactor=2&maxShardsPerNode=2&name=testOverseerQuit&action=CREATE&numShards=4&wt=javabin&version=2
   [junit4]   2> 1302715 T6707 oasc.DistributedQueue$LatchChildWatcher.process LatchChildWatcher fired on path: /overseer/collection-queue-work state: SyncConnected type NodeChildrenChanged
   [junit4]   2> 1302715 T6707 oasc.DistributedQueue$LatchChildWatcher.process LatchChildWatcher fired on path: /overseer/collection-queue-work state: SyncConnected type NodeChildrenChanged
   [junit4]   2> 1302716 T6707 oasc.DistributedQueue$LatchChildWatcher.process LatchChildWatcher fired on path: /overseer/collection-queue-work state: SyncConnected type NodeChildrenChanged
   [junit4]   2> 1302716 T6707 oasc.DistributedQueue$LatchChildWatcher.process LatchChildWatcher fired on path: /overseer/collection-queue-work state: SyncConnected type NodeChildrenChanged
   [junit4]   2> 1302716 T6707 oasc.DistributedQueue$LatchChildWatcher.process LatchChildWatcher fired on path: /overseer/collection-queue-work state: SyncConnected type NodeChildrenChanged
   [junit4]   2> 1302716 T6707 oasc.DistributedQueue$LatchChildWatcher.process LatchChildWatcher fired on path: /overseer/collection-queue-work state: SyncConnected type NodeChildrenChanged
   [junit4]   2> 1302717 T6707 oasc.DistributedQueue$LatchChildWatcher.process LatchChildWatcher fired on path: /overseer/collection-queue-work state: SyncConnected type NodeChildrenChanged
   [junit4]   2> 1302717 T6707 oasc.DistributedQueue$LatchChildWatcher.process LatchChildWatcher fired on path: /overseer/collection-queue-work state: SyncConnected type NodeChildrenChanged
   [junit4]   2> 1302717 T6707 oasc.DistributedQueue$LatchChildWatcher.process LatchChildWatcher fired on path: /overseer/collection-queue-work state: SyncConnected type NodeChildrenChanged
   [junit4]   2> 1302717 T6709 oasc.OverseerCollectionProcessor.run Overseer Collection Processor: Get the message id:/overseer/collection-queue-work/qn-0000000000 message:{
   [junit4]   2> 	  "operation":"createcollection",
   [junit4]   2> 	  "fromApi":"true",
   [junit4]   2> 	  "name":"testOverseerQuit",
   [junit4]   2> 	  "replicationFactor":"2",
   [junit4]   2> 	  "numShards":"4",
   [junit4]   2> 	  "maxShardsPerNode":"2"}
   [junit4]   2> 1302718 T6801 oasc.OverseerCollectionProcessor.processMessage WARN OverseerCollectionProcessor.processMessage : createcollection , {
   [junit4]   2> 	  "operation":"createcollection",
   [junit4]   2> 	  "fromApi":"true",
   [junit4]   2> 	  "name":"testOverseerQuit",
   [junit4]   2> 	  "replicationFactor":"2",
   [junit4]   2> 	  "numShards":"4",
   [junit4]   2> 	  "maxShardsPerNode":"2"}
   [junit4]   2> 1302718 T6801 oasc.OverseerCollectionProcessor.createConfNode Only one config set found in zk - using it:conf1
   [junit4]   2> 1302719 T6801 oasc.OverseerCollectionProcessor.createConfNode creating collections conf node /collections/testOverseerQuit 
   [junit4]   2> 1302719 T6801 oascc.SolrZkClient.makePath makePath: /collections/testOverseerQuit
   [junit4]   2> 1302721 T6707 oasc.DistributedQueue$LatchChildWatcher.process LatchChildWatcher fired on path: /overseer/queue state: SyncConnected type NodeChildrenChanged
   [junit4]   2> 1302721 T6708 oascc.ZkStateReader.updateClusterState Updating cloud state from ZooKeeper... 
   [junit4]   2> 1302722 T6708 oasc.Overseer$ClusterStateUpdater.buildCollection building a new collection: testOverseerQuit
   [junit4]   2> 1302722 T6708 oasc.Overseer$ClusterStateUpdater.createCollection Create collection testOverseerQuit with shards [shard1, shard2, shard3, shard4]
   [junit4]   2> 1302723 T6707 oasc.DistributedQueue$LatchChildWatcher.process LatchChildWatcher fired on path: /overseer/queue state: SyncConnected type NodeChildrenChanged
   [junit4]   2> 1302724 T6712 oascc.ZkStateReader$2.process A cluster state change: WatchedEvent state:SyncConnected type:NodeDataChanged path:/clusterstate.json, has occurred - updating... (live nodes size: 7)
   [junit4]   2> 1302724 T6707 oascc.ZkStateReader$2.process A cluster state change: WatchedEvent state:SyncConnected type:NodeDataChanged path:/clusterstate.json, has occurred - updating... (live nodes size: 7)
   [junit4]   2> 1302724 T6795 oascc.ZkStateReader$2.process A cluster state change: WatchedEvent state:SyncConnected type:NodeDataChanged path:/clusterstate.json, has occurred - updating... (live nodes size: 7)
   [junit4]   2> 1302724 T6739 oascc.ZkStateReader$2.process A cluster state change: WatchedEvent state:SyncConnected type:NodeDataChanged path:/clusterstate.json, has occurred - updating... (live nodes size: 7)
   [junit4]   2> 1302724 T6800 oascc.ZkStateReader$2.process A cluster state change: WatchedEvent state:SyncConnected type:NodeDataChanged path:/clusterstate.json, has occurred - updating... (live nodes size: 7)
   [junit4]   2> 1302724 T6781 oascc.ZkStateReader$2.process A cluster state change: WatchedEvent state:SyncConnected type:NodeDataChanged path:/clusterstate.json, has occurred - updating... (live nodes size: 7)
   [junit4]   2> 1302724 T6753 oascc.ZkStateReader$2.process A cluster state change: WatchedEvent state:SyncConnected type:NodeDataChanged path:/clusterstate.json, has occurred - updating... (live nodes size: 7)
   [junit4]   2> 1302724 T6767 oascc.ZkStateReader$2.process A cluster state change: WatchedEvent state:SyncConnected type:NodeDataChanged path:/clusterstate.json, has occurred - updating... (live nodes size: 7)
   [junit4]   2> 1302724 T6725 oascc.ZkStateReader$2.process A cluster state change: WatchedEvent state:SyncConnected type:NodeDataChanged path:/clusterstate.json, has occurred - updating... (live nodes size: 7)
   [junit4]   2> 1302724 T6798 oascc.ZkStateReader$2.process A cluster state change: WatchedEvent state:SyncConnected type:NodeDataChanged path:/clusterstate.json, has occurred - updating... (live nodes size: 7)
   [junit4]   2> 1302821 T6801 oasc.OverseerCollectionProcessor.createCollection Creating SolrCores for new collection testOverseerQuit, shardNames [shard1, shard2, shard3, shard4] , replicationFactor : 2
   [junit4]   2> 1302821 T6801 oasc.OverseerCollectionProcessor.createCollection Creating shard testOverseerQuit_shard1_replica1 as part of slice shard1 of collection testOverseerQuit on 127.0.0.1:53860_na%2Fma
   [junit4]   2> 1302822 T6801 oasc.OverseerCollectionProcessor.createCollection Creating shard testOverseerQuit_shard1_replica2 as part of slice shard1 of collection testOverseerQuit on 127.0.0.1:49898_na%2Fma
   [junit4]   2> 1302822 T6801 oasc.OverseerCollectionProcessor.createCollection Creating shard testOverseerQuit_shard2_replica1 as part of slice shard2 of collection testOverseerQuit on 127.0.0.1:49742_na%2Fma
   [junit4]   2> 1302824 T6760 oasha.CoreAdminHandler.handleCreateAction core create command qt=/admin/cores&collection.configName=conf1&name=testOverseerQuit_shard1_replica1&action=CREATE&numShards=4&collection=testOverseerQuit&shard=shard1&wt=javabin&version=2
   [junit4]   2> 1302824 T6801 oasc.OverseerCollectionProcessor.createCollection Creating shard testOverseerQuit_shard2_replica2 as part of slice shard2 of collection testOverseerQuit on 127.0.0.1:50250_na%2Fma
   [junit4]   2> 1302824 T6700 oasha.CoreAdminHandler.handleCreateAction core create command qt=/admin/cores&collection.configName=conf1&name=testOverseerQuit_shard1_replica2&action=CREATE&numShards=4&collection=testOverseerQuit&shard=shard1&wt=javabin&version=2
   [junit4]   2> 1302824 T6801 oasc.OverseerCollectionProcessor.createCollection Creating shard testOverseerQuit_shard3_replica1 as part of slice shard3 of collection testOverseerQuit on 127.0.0.1:37700_na%2Fma
   [junit4]   2> 1302825 T6760 oasc.ZkController.publish publishing core=testOverseerQuit_shard1_replica1 state=down collection=testOverseerQuit
   [junit4]   2> 1302825 T6801 oasc.OverseerCollectionProcessor.createCollection Creating shard testOverseerQuit_shard3_replica2 as part of slice shard3 of collection testOverseerQuit on 127.0.0.1:51956_na%2Fma
   [junit4]   2> 1302825 T6700 oasc.ZkController.publish publishing core=testOverseerQuit_shard1_replica2 state=down collection=testOverseerQuit
   [junit4]   2> 1302825 T6735 oasha.CoreAdminHandler.handleCreateAction core create command qt=/admin/cores&collection.configName=conf1&name=testOverseerQuit_shard2_replica2&action=CREATE&numShards=4&collection=testOverseerQuit&shard=shard2&wt=javabin&version=2
   [junit4]   2> 1302825 T6720 oasha.CoreAdminHandler.handleCreateAction core create command qt=/admin/cores&collection.configName=conf1&name=testOverseerQuit_shard2_replica1&action=CREATE&numShards=4&collection=testOverseerQuit&shard=shard2&wt=javabin&version=2
   [junit4]   2> 1302826 T6801 oasc.OverseerCollectionProcessor.createCollection Creating shard testOverseerQuit_shard4_replica1 as part of slice shard4 of collection testOverseerQuit on 127.0.0.1:48995_na%2Fma
   [junit4]   2> 1302826 T6707 oasc.DistributedQueue$LatchChildWatcher.process LatchChildWatcher fired on path: /overseer/queue state: SyncConnected type NodeChildrenChanged
   [junit4]   2> 1302827 T6791 oasha.CoreAdminHandler.handleCreateAction core create command qt=/admin/cores&collection.configName=conf1&name=testOverseerQuit_shard3_replica2&action=CREATE&numShards=4&collection=testOverseerQuit&shard=shard3&wt=javabin&version=2
   [junit4]   2> 1302827 T6720 oasc.ZkController.publish publishing core=testOverseerQuit_shard2_replica1 state=down collection=testOverseerQuit
   [junit4]   2> 1302826 T6700 oasc.ZkController.waitForCoreNodeName look for our core node name
   [junit4]   2> 1302826 T6760 oasc.ZkController.waitForCoreNodeName look for our core node name
   [junit4]   2> 1302826 T6747 oasha.CoreAdminHandler.handleCreateAction core create command qt=/admin/cores&collection.configName=conf1&name=testOverseerQuit_shard3_replica1&action=CREATE&numShards=4&collection=testOverseerQuit&shard=shard3&wt=javabin&version=2
   [junit4]   2> 1302828 T6720 oasc.ZkController.waitForCoreNodeName look for our core node name
   [junit4]   2> 1302828 T6791 oasc.ZkController.publish publishing core=testOverseerQuit_shard3_replica2 state=down collection=testOverseerQuit
   [junit4]   2> 1302828 T6707 oasc.DistributedQueue$LatchChildWatcher.process LatchChildWatcher fired on path: /overseer/queue state: SyncConnected type NodeChildrenChanged
   [junit4]   2> 1302829 T6747 oasc.ZkController.publish publishing core=testOverseerQuit_shard3_replica1 state=down collection=testOverseerQuit
   [junit4]   2> 1302829 T6791 oasc.ZkController.waitForCoreNodeName look for our core node name
   [junit4]   2> 1302828 T6777 oasha.CoreAdminHandler.handleCreateAction core create command qt=/admin/cores&collection.configName=conf1&name=testOverseerQuit_shard4_replica1&action=CREATE&numShards=4&collection=testOverseerQuit&shard=shard4&wt=javabin&version=2
   [junit4]   2> 1302829 T6747 oasc.ZkController.waitForCoreNodeName look for our core node name
   [junit4]   2> 1302828 T6708 oascc.ZkStateReader.updateClusterState Updating cloud state from ZooKeeper... 
   [junit4]   2> 1302827 T6801 oasc.OverseerCollectionProcessor.createCollection Creating shard testOverseerQuit_shard4_replica2 as part of slice shard4 of collection testOverseerQuit on 127.0.0.1:53860_na%2Fma
   [junit4]   2> 1302827 T6735 oasc.ZkController.publish publishing core=testOverseerQuit_shard2_replica2 state=down collection=testOverseerQuit
   [junit4]   2> 1302830 T6708 oasc.Overseer$ClusterStateUpdater.updateState Update state numShards=4 message={
   [junit4]   2> 	  "operation":"state",
   [junit4]   2> 	  "state":"down",
   [junit4]   2> 	  "base_url":"http://127.0.0.1:53860/na/ma",
   [junit4]   2> 	  "core":"testOverseerQuit_shard1_replica1",
   [junit4]   2> 	  "roles":null,
   [junit4]   2> 	  "node_name":"127.0.0.1:53860_na%2Fma",
   [junit4]   2> 	  "shard":"shard1",
   [junit4]   2> 	  "collection":"testOverseerQuit",
   [junit4]   2> 	  "numShards":"4",
   [junit4]   2> 	  "core_node_name":null}
   [junit4]   2> 1302830 T6777 oasc.ZkController.publish publishing core=testOverseerQuit_shard4_replica1 state=down collection=testOverseerQuit
   [junit4]   2> 1302831 T6735 oasc.ZkController.waitForCoreNodeName look for our core node name
   [junit4]   2> 1302832 T6777 oasc.ZkController.waitForCoreNodeName look for our core node name
   [junit4]   2> 1302832 T6761 oasha.CoreAdminHandler.handleCreateAction core create command qt=/admin/cores&collection.configName=conf1&name=testOverseerQuit_shard4_replica2&action=CREATE&numShards=4&collection=testOverseerQuit&shard=shard4&wt=javabin&version=2
   [junit4]   2> 1302833 T6761 oasc.ZkController.publish publishing core=testOverseerQuit_shard4_replica2 state=down collection=testOverseerQuit
   [junit4]   2> 1302833 T6708 oasc.Overseer$ClusterStateUpdater.updateState Update state numShards=4 message={
   [junit4]   2> 	  "operation":"state",
   [junit4]   2> 	  "state":"down",
   [junit4]   2> 	  "base_url":"http://127.0.0.1:49898/na/ma",
   [junit4]   2> 	  "core":"testOverseerQuit_shard1_replica2",
   [junit4]   2> 	  "roles":null,
   [junit4]   2> 	  "node_name":"127.0.0.1:49898_na%2Fma",
   [junit4]   2> 	  "shard":"shard1",
   [junit4]   2> 	  "collection":"testOverseerQuit",
   [junit4]   2> 	  "numShards":"4",
   [junit4]   2> 	  "core_node_name":null}
   [junit4]   2> 1302833 T6707 oasc.DistributedQueue$LatchChildWatcher.process LatchChildWatcher fired on path: /overseer/queue state: SyncConnected type NodeChildrenChanged
   [junit4]   2> 1302833 T6761 oasc.ZkController.waitForCoreNodeName look for our core node name
   [junit4]   2> 1302834 T6708 oasc.Overseer$ClusterStateUpdater.updateState Update state numShards=4 message={
   [junit4]   2> 	  "operation":"state",
   [junit4]   2> 	  "state":"down",
   [junit4]   2> 	  "base_url":"http://127.0.0.1:49742/na/ma",
   [junit4]   2> 	  "core":"testOverseerQuit_shard2_replica1",
   [junit4]   2> 	  "roles":null,
   [junit4]   2> 	  "node_name":"127.0.0.1:49742_na%2Fma",
   [junit4]   2> 	  "shard":"shard2",
   [junit4]   2> 	  "collection":"testOverseerQuit",
   [junit4]   2> 	  "numShards":"4",
   [junit4]   2> 	  "core_node_name":null}
   [junit4]   2> 1302837 T6707 oasc.DistributedQueue$LatchChildWatcher.process LatchChildWatcher fired on path: /overseer/queue state: SyncConnected type NodeChildrenChanged
   [junit4]   2> 1302838 T6708 oasc.Overseer$ClusterStateUpdater.updateState Update state numShards=4 message={
   [junit4]   2> 	  "operation":"state",
   [junit4]   2> 	  "state":"down",
   [junit4]   2> 	  "base_url":"http://127.0.0.1:51956/na/ma",
   [junit4]   2> 	  "core":"testOverseerQuit_shard3_replica2",
   [junit4]   2> 	  "roles":null,
   [junit4]   2> 	  "node_name":"127.0.0.1:51956_na%2Fma",
   [junit4]   2> 	  "shard":"shard3",
   [junit4]   2> 	  "collection":"testOverseerQuit",
   [junit4]   2> 	  "numShards":"4",
   [junit4]   2> 	  "core_node_name":null}
   [junit4]   2> 1302840 T6707 oasc.DistributedQueue$LatchChildWatcher.process LatchChildWatcher fired on path: /overseer/queue state: SyncConnected type NodeChildrenChanged
   [junit4]   2> 1302840 T6708 oasc.Overseer$ClusterStateUpdater.updateState Update state numShards=4 message={
   [junit4]   2> 	  "operation":"state",
   [junit4]   2> 	  "state":"down",
   [junit4]   2> 	  "base_url":"http://127.0.0.1:37700/na/ma",
   [junit4]   2> 	  "core":"testOverseerQuit_shard3_replica1",
   [junit4]   2> 	  "roles":null,
   [junit4]   2> 	  "node_name":"127.0.0.1:37700_na%2Fma",
   [junit4]   2> 	  "shard":"shard3",
   [junit4]   2> 	  "collection":"testOverseerQuit",
   [junit4]   2> 	  "numShards":"4",
   [junit4]   2> 	  "core_node_name":null}
   [junit4]   2> 1302842 T6707 oasc.DistributedQueue$LatchChildWatcher.process LatchChildWatcher fired on path: /overseer/queue state: SyncConnected type NodeChildrenChanged
   [junit4]   2> 1302842 T6708 oasc.Overseer$ClusterStateUpdater.updateState Update state numShards=4 message={
   [junit4]   2> 	  "operation":"state",
   [junit4]   2> 	  "state":"down",
   [junit4]   2> 	  "base_url":"http://127.0.0.1:50250/na/ma",
   [junit4]   2> 	  "core":"testOverseerQuit_shard2_replica2",
   [junit4]   2> 	  "roles":null,
   [junit4]   2> 	  "node_name":"127.0.0.1:50250_na%2Fma",
   [junit4]   2> 	  "shard":"shard2",
   [junit4]   2> 	  "collection":"testOverseerQuit",
   [junit4]   2> 	  "numShards":"4",
   [junit4]   2> 	  "core_node_name":null}
   [junit4]   2> 1302843 T6707 oasc.DistributedQueue$LatchChildWatcher.process LatchChildWatcher fired on path: /overseer/queue state: SyncConnected type NodeChildrenChanged
   [junit4]   2> 1302844 T6708 oasc.Overseer$ClusterStateUpdater.updateState Update state numShards=4 message={
   [junit4]   2> 	  "operation":"state",
   [junit4]   2> 	  "state":"down",
   [junit4]   2> 	  "base_url":"http://127.0.0.1:48995/na/ma",
   [junit4]   2> 	  "core":"testOverseerQuit_shard4_replica1",
   [junit4]   2> 	  "roles":null,
   [junit4]   2> 	  "node_name":"127.0.0.1:48995_na%2Fma",
   [junit4]   2> 	  "shard":"shard4",
   [junit4]   2> 	  "collection":"testOverseerQuit",
   [junit4]   2> 	  "numShards":"4",
   [junit4]   2> 	  "core_node_name":null}
   [junit4]   2> 1302845 T6707 oasc.DistributedQueue$LatchChildWatcher.process LatchChildWatcher fired on path: /overseer/queue state: SyncConnected type NodeChildrenChanged
   [junit4]   2> 1302845 T6708 oasc.Overseer$ClusterStateUpdater.updateState Update state numShards=4 message={
   [junit4]   2> 	  "operation":"state",
   [junit4]   2> 	  "state":"down",
   [junit4]   2> 	  "base_url":"http://127.0.0.1:53860/na/ma",
   [junit4]   2> 	  "core":"testOverseerQuit_shard4_replica2",
   [junit4]   2> 	  "roles":null,
   [junit4]   2> 	  "node_name":"127.0.0.1:53860_na%2Fma",
   [junit4]   2> 	  "shard":"shard4",
   [junit4]   2> 	  "collection":"testOverseerQuit",
   [junit4]   2> 	  "numShards":"4",
   [junit4]   2> 	  "core_node_name":null}
   [junit4]   2> 1302846 T6707 oasc.DistributedQueue$LatchChildWatcher.process LatchChildWatcher fired on path: /overseer/queue state: SyncConnected type NodeChildrenChanged
   [junit4]   2> 1302949 T6712 oascc.ZkStateReader$2.process A cluster state change: WatchedEvent state:SyncConnected type:NodeDataChanged path:/clusterstate.json, has occurred - updating... (live nodes size: 7)
   [junit4]   2> 1302949 T6795 oascc.ZkStateReader$2.process A cluster state change: WatchedEvent state:SyncConnected type:NodeDataChanged path:/clusterstate.json, has occurred - updating... (live nodes size: 7)
   [junit4]   2> 1302949 T6707 oascc.ZkStateReader$2.process A cluster state change: WatchedEvent state:SyncConnected type:NodeDataChanged path:/clusterstate.json, has occurred - updating... (live nodes size: 7)
   [junit4]   2> 1302949 T6739 oascc.ZkStateReader$2.process A cluster state change: WatchedEvent state:SyncConnected type:NodeDataChanged path:/clusterstate.json, has occurred - updating... (live nodes size: 7)
   [junit4]   2> 1302949 T6767 oascc.ZkStateReader$2.process A cluster state change: WatchedEvent state:SyncConnected type:NodeDataChanged path:/clusterstate.json, has occurred - updating... (live nodes size: 7)
   [junit4]   2> 1302949 T6753 oascc.ZkStateReader$2.process A cluster state change: WatchedEvent state:SyncConnected type:NodeDataChanged path:/clusterstate.json, has occurred - updating... (live nodes size: 7)
   [junit4]   2> 1302949 T6798 oascc.ZkStateReader$2.process A cluster state change: WatchedEvent state:SyncConnected type:NodeDataChanged path:/clusterstate.json, has occurred - updating... (live nodes size: 7)
   [junit4]   2> 1302949 T6725 oascc.ZkStateReader$2.process A cluster state change: WatchedEvent state:SyncConnected type:NodeDataChanged path:/clusterstate.json, has occurred - updating... (live nodes size: 7)
   [junit4]   2> 1302949 T6781 oascc.ZkStateReader$2.process A cluster state change: WatchedEvent state:SyncConnected type:NodeDataChanged path:/clusterstate.json, has occurred - updating... (live nodes size: 7)
   [junit4]   2> 1302949 T6800 oascc.ZkStateReader$2.process A cluster state change: WatchedEvent state:SyncConnected type:NodeDataChanged path:/clusterstate.json, has occurred - updating... (live nodes size: 7)
   [junit4]   2> 1303828 T6700 oasc.ZkController.waitForShardId waiting to find shard id in clusterstate for testOverseerQuit_shard1_replica2
   [junit4]   2> 1303829 T6720 oasc.ZkController.waitForShardId waiting to find shard id in clusterstate for testOverseerQuit_shard2_replica1
   [junit4]   2> 1303828 T6760 oasc.ZkController.waitForShardId waiting to find shard id in clusterstate for testOverseerQuit_shard1_replica1
   [junit4]   2> 1303829 T6700 oasc.ZkController.createCollectionZkNode Check for collection zkNode:testOverseerQuit
   [junit4]   2> 1303829 T6791 oasc.ZkController.waitForShardId waiting to find shard id in clusterstate for testOverseerQuit_shard3_replica2
   [junit4]   2> 1303829 T6720 oasc.ZkController.createCollectionZkNode Check for collection zkNode:testOverseerQuit
   [junit4]   2> 1303830 T6791 oasc.ZkController.createCollectionZkNode Check for collection zkNode:testOverseerQuit
   [junit4]   2> 1303830 T6700 oasc.ZkController.createCollectionZkNode Collection zkNode exists
   [junit4]   2> 1303831 T6700 oascc.ZkStateReader.readConfigName Load collection config from:/collections/testOverseerQuit
   [junit4]   2> 1303831 T6791 oasc.ZkController.createCollectionZkNode Collection zkNode exists
   [junit4]   2> 1303832 T6791 oascc.ZkStateReader.readConfigName Load collection config from:/collections/testOverseerQuit
   [junit4]   2> 1303830 T6760 oasc.ZkController.createCollectionZkNode Check for collection zkNode:testOverseerQuit
   [junit4]   2> 1303830 T6747 oasc.ZkController.waitForShardId waiting to find shard id in clusterstate for testOverseerQuit_shard3_replica1
   [junit4]   2> 1303833 T6791 oascc.ZkStateReader.readConfigName path=/collections/testOverseerQuit configName=conf1 specified config exists in ZooKeeper
   [junit4]   2> 1303833 T6791 oasc.SolrResourceLoader.<init> new SolrResourceLoader for directory: '/mnt/ssd/jenkins/workspace/Lucene-Solr-trunk-Linux/solr/build/solr-core/test/J1/./temp/solr.cloud.OverseerRolesTest-7AF9794BBBA1BCA0-001/tempDir-008/testOverseerQuit_shard3_replica2/'
   [junit4]   2> 1303833 T6760 oasc.ZkController.createCollectionZkNode Collection zkNode exists
   [junit4]   2> 1303833 T6760 oascc.ZkStateReader.readConfigName Load collection config from:/collections/testOverseerQuit
   [junit4]   2> 1303832 T6777 oasc.ZkController.waitForShardId waiting to find shard id in clusterstate for testOverseerQuit_shard4_replica1
   [junit4]   2> 1303832 T6700 oascc.ZkStateReader.readConfigName path=/collections/testOverseerQuit configName=conf1 specified config exists in ZooKeeper
   [junit4]   2> 1303831 T6735 oasc.ZkController.waitForShardId waiting to find shard id in clusterstate for testOverseerQuit_shard2_replica2
   [junit4]   2> 1303835 T6777 oasc.ZkController.createCollectionZkNode Check for collection zkNode:testOverseerQuit
   [junit4]   2> 1303831 T6720 oasc.ZkController.createCollectionZkNode Collection zkNode exists
   [junit4]   2> 1303835 T6720 oascc.ZkStateReader.readConfigName Load collection config from:/collections/testOverseerQuit
   [junit4]   2> 1303835 T6735 oasc.ZkController.createCollectionZkNode Check for collection zkNode:testOverseerQuit
   [junit4]   2> 1303836 T6777 oasc.ZkController.createCollectionZkNode Collection zkNode exists
   [junit4]   2> 1303836 T6777 oascc.ZkStateReader.readConfigName Load collection config from:/collections/testOverseerQuit
   [junit4]   2> 1303835 T6760 oascc.ZkStateReader.readConfigName path=/collections/testOverseerQuit configName=conf1 specified config exists in ZooKeeper
   [junit4]   2> 1303837 T6760 oasc.SolrResourceLoader.<init> new SolrResourceLoader for directory: '/mnt/ssd/jenkins/workspace/Lucene-Solr-trunk-Linux/solr/build/solr-core/test/J1/./temp/solr.cloud.OverseerRolesTest-7AF9794BBBA1BCA0-001/tempDir-006/testOverseerQuit_shard1_replica1/'
   [junit4]   2> 1303834 T6700 oasc.SolrResourceLoader.<init> new SolrResourceLoader for directory: '/mnt/ssd/jenkins/workspace/Lucene-Solr-trunk-Linux/solr/build/solr-core/test/J1/./temp/solr.cloud.OverseerRolesTest-7AF9794BBBA1BCA0-001/tempDir-002/testOverseerQuit_shard1_replica2/'
   [junit4]   2> 1303834 T6761 oasc.ZkController.waitForShardId waiting to find shard id in clusterstate for testOverseerQuit_shard4_replica2
   [junit4]   2> 1303833 T6747 oasc.ZkController.createCollectionZkNode Check for collection zkNode:testOverseerQuit
   [junit4]   2> 1303837 T6777 oascc.ZkStateReader.readConfigName path=/collections/testOverseerQuit configName=conf1 specified config exists in ZooKeeper
   [junit4]   2> 1303838 T6747 oasc.ZkController.createCollectionZkNode Collection zkNode exists
   [junit4]   2> 1303838 T6747 oascc.ZkStateReader.readConfigName Load collection config from:/collections/testOverseerQuit
   [junit4]   2> 1303836 T6735 oasc.ZkController.createCollectionZkNode Collection zkNode exists
   [junit4]   2> 1303839 T6735 oascc.ZkStateReader.readConfigName Load collection config from:/collections/testOverseerQuit
   [junit4]   2> 1303836 T6720 oascc.ZkStateReader.readConfigName path=/collections/testOverseerQuit configName=conf1 specified config exists in ZooKeeper
   [junit4]   2> 1303839 T6720 oasc.SolrResourceLoader.<init> new SolrResourceLoader for directory: '../../../../../../../../../../mnt/ssd/jenkins/workspace/Lucene-Solr-trunk-Linux/solr/build/solr-core/test/J1/./temp/solr.cloud.OverseerRolesTest-7AF9794BBBA1BCA0-001/tempDir-003/testOverseerQuit_shard2_replica1/'
   [junit4]   2> 1303840 T6735 oascc.ZkStateReader.readConfigName path=/collections/testOverseerQuit configName=conf1 specified config exists in ZooKeeper
   [junit4]   2> 1303840 T6735 oasc.SolrResourceLoader.<init> new SolrResourceLoader for directory: '/mnt/ssd/jenkins/workspace/Lucene-Solr-trunk-Linux/solr/build/solr-core/test/J1/./temp/solr.cloud.OverseerRolesTest-7AF9794BBBA1BCA0-001/tempDir-004/testOverseerQuit_shard2_replica2/'
   [junit4]   2> 1303839 T6747 oascc.ZkStateReader.readConfigName path=/collections/testOverseerQuit configName=conf1 specified config exists in ZooKeeper
   [junit4]   2> 1303838 T6777 oasc.SolrResourceLoader.<init> new SolrResourceLoader for directory: '../../../../../../../../../../mnt/ssd/jenkins/workspace/Lucene-Solr-trunk-Linux/solr/build/solr-core/test/J1/./temp/solr.cloud.OverseerRolesTest-7AF9794BBBA1BCA0-001/tempDir-007/testOverseerQuit_shard4_replica1/'
   [junit4]   2> 1303838 T6761 oasc.ZkController.createCollectionZkNode Check for collection zkNode:testOverseerQuit
   [junit4]   2> 1303841 T6747 oasc.SolrResourceLoader.<init> new SolrResourceLoader for directory: '../../../../../../../../../../mnt/ssd/jenkins/workspace/Lucene-Solr-trunk-Linux/solr/build/solr-core/test/J1/./temp/solr.cloud.OverseerRolesTest-7AF9794BBBA1BCA0-001/tempDir-005/testOverseerQuit_shard3_replica1/'
   [junit4]   2> 1303843 T6761 oasc.ZkController.createCollectionZkNode Collection zkNode exists
   [junit4]   2> 1303843 T6761 oascc.ZkStateReader.readConfigName Load collection config from:/collections/testOverseerQuit
   [junit4]   2> 1303845 T6761 oascc.ZkStateReader.readConfigName path=/collections/testOverseerQuit configName=conf1 specified config exists in ZooKeeper
   [junit4]   2> 1303845 T6761 oasc.SolrResourceLoader.<init> new SolrResourceLoader for directory: '/mnt/ssd/jenkins/workspace/Lucene-Solr-trunk-Linux/solr/build/solr-core/test/J1/./temp/solr.cloud.OverseerRolesTest-7AF9794BBBA1BCA0-001/tempDir-006/testOverseerQuit_shard4_replica2/'
   [junit4]   2> 1303858 T6760 oasc.SolrConfig.<init> Using Lucene MatchVersion: LUCENE_5_0
   [junit4]   2> 1303872 T6791 oasc.SolrConfig.<init> Using Lucene MatchVersion: LUCENE_5_0
   [junit4]   2> 1303872 T6720 oasc.SolrConfig.<init> Using Lucene MatchVersion: LUCENE_5_0
   [junit4]   2> 1303875 T6700 oasc.SolrConfig.<init> Using Lucene MatchVersion: LUCENE_5_0
   [junit4]   2> 1303877 T6760 oasc.SolrConfig.<init> Loaded SolrConfig: solrconfig.xml
   [junit4]   2> 1303891 T6700 oasc.SolrConfig.<init> Loaded SolrConfig: solrconfig.xml
   [junit4]   2> 1303892 T6720 oasc.SolrConfig.<init> Loaded SolrConfig: solrconfig.xml
   [junit4]   2> 1303893 T6700 oass.IndexSchema.readSchema Reading Solr Schema from schema.xml
   [junit4]   2> 1303894 T6747 oasc.SolrConfig.<init> Using Lucene MatchVersion: LUCENE_5_0
   [junit4]   2> 1303894 T6720 oass.IndexSchema.readSchema Reading Solr Schema from schema.xml
   [junit4]   2> 1303895 T6791 oasc.SolrConfig.<init> Loaded SolrConfig: solrconfig.xml
   [junit4]   2> 1303895 T6760 oass.IndexSchema.readSchema Reading Solr Schema from schema.xml
   [junit4]   2> 1303905 T6700 oass.IndexSchema.readSchema [testOverseerQuit_shard1_replica2] Schema name=test
   [junit4]   2> 1303907 T6720 oass.IndexSchema.readSchema [testOverseerQuit_shard2_replica1] Schema name=test
   [junit4]   2> 1303909 T6761 oasc.SolrConfig.<init> Using Lucene MatchVersion: LUCENE_5_0
   [junit4]   2> 1303909 T6735 oasc.SolrConfig.<init> Using Lucene MatchVersion: LUCENE_5_0
   [junit4]   2> 1303907 T6760 oass.IndexSchema.readSchema [testOverseerQuit_shard1_replica1] Schema name=test
   [junit4]   2> 1303912 T6791 oass.IndexSchema.readSchema Reading Solr Schema from schema.xml
   [junit4]   2> 1303913 T6747 oasc.SolrConfig.<init> Loaded SolrConfig: solrconfig.xml
   [junit4]   2> 1303926 T6777 oasc.SolrConfig.<init> Using Lucene MatchVersion: LUCENE_5_0
   [junit4]   2> 1303930 T6747 oass.IndexSchema.readSchema Reading Solr Schema from schema.xml
   [junit4]   2> 1303946 T6791 oass.IndexSchema.readSchema [testOverseerQuit_shard3_replica2] Schema name=test
   [junit4]   2> 1303948 T6735 oasc.SolrConfig.<init> Loaded SolrConfig: solrconfig.xml
   [junit4]   2> 1303952 T6761 oasc.SolrConfig.<init> Loaded SolrConfig: solrconfig.xml
   [junit4]   2> 1303954 T6747 oass.IndexSchema.readSchema [testOverseerQuit_shard3_replica1] Schema name=test
   [junit4]   2> 1303961 T6761 oass.IndexSchema.readSchema Reading Solr Schema from schema.xml
   [junit4]   2> 1303979 T6761 oass.IndexSchema.readSchema [testOverseerQuit_shard4_replica2] Schema name=test
   [junit4]   2> 1303982 T6777 oasc.SolrConfig.<init> Loaded SolrConfig: solrconfig.xml
   [junit4]   2> 1303982 T6735 oass.IndexSchema.readSchema Reading Solr Schema from schema.xml
   [junit4]   2> 1303998 T6735 oass.IndexSchema.readSchema [testOverseerQuit_shard2_replica2] Schema name=test
   [junit4]   2> 1304002 T6777 oass.IndexSchema.readSchema Reading Solr Schema from schema.xml
   [junit4]   2> 1304052 T6777 oass.IndexSchema.readSchema [testOverseerQuit_shard4_replica1] Schema name=test
   [junit4]   2> 1304158 T6700 oass.OpenExchangeRatesOrgProvider.init Initialized with rates=open-exchange-rates.json, refreshInterval=1440.
   [junit4]   2> 1304164 T6700 oass.IndexSchema.readSchema default search field in schema is text
   [junit4]   2> 1304166 T6700 oass.IndexSchema.readSchema unique key field: id
   [junit4]   2> 1304196 T6747 oass.OpenExchangeRatesOrgProvider.init Initialized with rates=open-exchange-rates.json, refreshInterval=1440.
   [junit4]   2> 1304200 T6700 oass.FileExchangeRateProvider.reload Reloading exchange rates from file currency.xml
   [junit4]   2> 1304200 T6747 oass.IndexSchema.readSchema default search field in schema is text
   [junit4]   2> 1304202 T6747 oass.IndexSchema.readSchema unique key field: id
   [junit4]   2> 1304203 T6700 oass.FileExchangeRateProvider.reload Reloading exchange rates from file currency.xml
   [junit4]   2> 1304206 T6760 oass.OpenExchangeRatesOrgProvider.init Initialized with rates=open-exchange-rates.json, refreshInterval=1440.
   [junit4]   2> 1304217 T6700 oass.OpenExchangeRatesOrgProvider.reload Reloading exchange rates from open-exchange-rates.json
   [junit4]   2> 1304218 T6700 oass.OpenExchangeRatesOrgProvider$OpenExchangeRates.<init> WARN Unknown key IMPORTANT NOTE
   [junit4]   2> 1304220 T6700 oass.OpenExchangeRatesOrgProvider$OpenExchangeRates.<init> WARN Expected key, got STRING
   [junit4]   2> 1304221 T6700 oass.OpenExchangeRatesOrgProvider.reload Reloading exchange rates from open-exchange-rates.json
   [junit4]   2> 1304222 T6747 oass.FileExchangeRateProvider.reload Reloading exchange rates from file currency.xml
   [junit4]   2> 1304222 T6700 oass.OpenExchangeRatesOrgProvider$OpenExchangeRates.<init> WARN Unknown key IMPORTANT NOTE
   [junit4]   2> 1304223 T6700 oass.OpenExchangeRatesOrgProvider$OpenExchangeRates.<init> WARN Expected key, got STRING
   [junit4]   2> 1304224 T6700 oasc.CoreContainer.create Creating SolrCore 'testOverseerQuit_shard1_replica2' using configuration from collection testOverseerQuit
   [junit4]   2> 1304224 T6700 oasc.SolrCore.initDirectoryFactory org.apache.solr.core.MockDirectoryFactory
   [junit4]   2> 1304225 T6700 oasc.SolrCore.<init> [testOverseerQuit_shard1_replica2] Opening new SolrCore at /mnt/ssd/jenkins/workspace/Lucene-Solr-trunk-Linux/solr/build/solr-core/test/J1/./temp/solr.cloud.OverseerRolesTest-7AF9794BBBA1BCA0-001/tempDir-002/testOverseerQuit_shard1_replica2/, dataDir=/mnt/ssd/jenkins/workspace/Lucene-Solr-trunk-Linux/solr/build/solr-core/test/J1/./temp/solr.cloud.OverseerRolesTest-7AF9794BBBA1BCA0-001/tempDir-002/testOverseerQuit_shard1_replica2/data/
   [junit4]   2> 1304225 T6700 oasc.JmxMonitoredMap.<init> JMX monitoring is enabled. Adding Solr mbeans to JMX Server: com.sun.jmx.mbeanserver.JmxMBeanServer@7e3a0c93
   [junit4]   2> 1304226 T6700 oasc.CachingDirectoryFactory.get return new directory for /mnt/ssd/jenkins/workspace/Lucene-Solr-trunk-Linux/solr/build/solr-core/test/J1/./temp/solr.cloud.OverseerRolesTest-7AF9794BBBA1BCA0-001/tempDir-002/testOverseerQuit_shard1_replica2/data
   [junit4]   2> 1304226 T6700 oasc.SolrCore.getNewIndexDir New index directory detected: old=null new=/mnt/ssd/jenkins/workspace/Lucene-Solr-trunk-Linux/solr/build/solr-core/test/J1/./temp/solr.cloud.OverseerRolesTest-7AF9794BBBA1BCA0-001/tempDir-002/testOverseerQuit_shard1_replica2/data/index/
   [junit4]   2> 1304226 T6700 oasc.SolrCore.initIndex WARN [testOverseerQuit_shard1_replica2] Solr index directory '/mnt/ssd/jenkins/workspace/Lucene-Solr-trunk-Linux/solr/build/solr-core/test/J1/./temp/solr.cloud.OverseerRolesTest-7AF9794BBBA1BCA0-001/tempDir-002/testOverseerQuit_shard1_replica2/data/index' doesn't exist. Creating new index...
   [junit4]   2> 1304227 T6700 oasc.CachingDirectoryFactory.get return new directory for /mnt/ssd/jenkins/workspace/Lucene-Solr-trunk-Linux/solr/build/solr-core/test/J1/./temp/solr.cloud.OverseerRolesTest-7AF9794BBBA1BCA0-001/tempDir-002/testOverseerQuit_shard1_replica2/data/index
   [junit4]   2> 1304227 T6700 oasu.RandomMergePolicy.<init> RandomMergePolicy wrapping class org.apache.lucene.index.LogByteSizeMergePolicy: [LogByteSizeMergePolicy: minMergeSize=1677721, mergeFactor=17, maxMergeSize=2147483648, maxMergeSizeForForcedMerge=9223372036854775807, calibrateSizeByDeletes=true, maxMergeDocs=2147483647, maxCFSSegmentSizeMB=8.796093022207999E12, noCFSRatio=1.0]
   [junit4]   2> 1304228 T6700 oasc.SolrDeletionPolicy.onCommit SolrDeletionPolicy.onCommit: commits: num=1
   [junit4]   2> 		commit{dir=MockDirectoryWrapper(RAMDirectory@a7d371b lockFactory=org.apache.lucene.store.SingleInstanceLockFactory@727255ef),segFN=segments_1,generation=1}
   [junit4]   2> 1304228 T6700 oasc.SolrDeletionPolicy.updateCommits newest commit generation = 1
   [junit4]   2> 1304231 T6700 oasup.UpdateRequestProces

[...truncated too long message...]

leader because creating the ephemeral registration node in ZooKeeper failed
   [junit4]   2> 		at org.apache.solr.cloud.ShardLeaderElectionContextBase.runLeaderProcess(ElectionContext.java:135)
   [junit4]   2> 		at org.apache.solr.cloud.ShardLeaderElectionContext.runLeaderProcess(ElectionContext.java:290)
   [junit4]   2> 		at org.apache.solr.cloud.LeaderElector.runIamLeaderProcess(LeaderElector.java:142)
   [junit4]   2> 		at org.apache.solr.cloud.LeaderElector.checkIfIamLeader(LeaderElector.java:110)
   [junit4]   2> 		at org.apache.solr.cloud.LeaderElector.access$200(LeaderElector.java:55)
   [junit4]   2> 		at org.apache.solr.cloud.LeaderElector$ElectionWatcher.process(LeaderElector.java:303)
   [junit4]   2> 		at org.apache.zookeeper.ClientCnxn$EventThread.processEvent(ClientCnxn.java:522)
   [junit4]   2> 		at org.apache.zookeeper.ClientCnxn$EventThread.run(ClientCnxn.java:498)
   [junit4]   2> 	Caused by: org.apache.zookeeper.KeeperException$SessionExpiredException: KeeperErrorCode = Session expired for /collections
   [junit4]   2> 		at org.apache.zookeeper.KeeperException.create(KeeperException.java:127)
   [junit4]   2> 		at org.apache.zookeeper.KeeperException.create(KeeperException.java:51)
   [junit4]   2> 		at org.apache.zookeeper.ZooKeeper.exists(ZooKeeper.java:1045)
   [junit4]   2> 		at org.apache.solr.common.cloud.SolrZkClient$3.execute(SolrZkClient.java:209)
   [junit4]   2> 		at org.apache.solr.common.cloud.SolrZkClient$3.execute(SolrZkClient.java:206)
   [junit4]   2> 		at org.apache.solr.common.cloud.ZkCmdExecutor.retryOperation(ZkCmdExecutor.java:73)
   [junit4]   2> 		at org.apache.solr.common.cloud.SolrZkClient.exists(SolrZkClient.java:206)
   [junit4]   2> 		at org.apache.solr.common.cloud.SolrZkClient.makePath(SolrZkClient.java:417)
   [junit4]   2> 		at org.apache.solr.common.cloud.SolrZkClient.makePath(SolrZkClient.java:386)
   [junit4]   2> 		at org.apache.solr.common.cloud.SolrZkClient.makePath(SolrZkClient.java:373)
   [junit4]   2> 		at org.apache.solr.cloud.ShardLeaderElectionContextBase$1.execute(ElectionContext.java:127)
   [junit4]   2> 		at org.apache.solr.common.util.RetryUtil.retryOnThrowable(RetryUtil.java:31)
   [junit4]   2> 		at org.apache.solr.cloud.ShardLeaderElectionContextBase.runLeaderProcess(ElectionContext.java:122)
   [junit4]   2> 		... 7 more
   [junit4]   2> 	
   [junit4]   2> 1332604 T6781 oasc.LeaderElector$ElectionWatcher.process WARN  org.apache.zookeeper.KeeperException$SessionExpiredException: KeeperErrorCode = Session expired for /collections/testOverseerQuit/leader_elect/shard4/election
   [junit4]   2> 	at org.apache.zookeeper.KeeperException.create(KeeperException.java:127)
   [junit4]   2> 	at org.apache.zookeeper.KeeperException.create(KeeperException.java:51)
   [junit4]   2> 	at org.apache.zookeeper.ZooKeeper.getChildren(ZooKeeper.java:1472)
   [junit4]   2> 	at org.apache.solr.common.cloud.SolrZkClient$6.execute(SolrZkClient.java:260)
   [junit4]   2> 	at org.apache.solr.common.cloud.SolrZkClient$6.execute(SolrZkClient.java:257)
   [junit4]   2> 	at org.apache.solr.common.cloud.ZkCmdExecutor.retryOperation(ZkCmdExecutor.java:73)
   [junit4]   2> 	at org.apache.solr.common.cloud.SolrZkClient.getChildren(SolrZkClient.java:257)
   [junit4]   2> 	at org.apache.solr.cloud.LeaderElector.checkIfIamLeader(LeaderElector.java:94)
   [junit4]   2> 	at org.apache.solr.cloud.LeaderElector.access$200(LeaderElector.java:55)
   [junit4]   2> 	at org.apache.solr.cloud.LeaderElector$ElectionWatcher.process(LeaderElector.java:303)
   [junit4]   2> 	at org.apache.zookeeper.ClientCnxn$EventThread.processEvent(ClientCnxn.java:522)
   [junit4]   2> 	at org.apache.zookeeper.ClientCnxn$EventThread.run(ClientCnxn.java:498)
   [junit4]   2> 
   [junit4]   2> 1332605 T6781 oascc.ZkStateReader$3.process WARN ZooKeeper watch triggered, but Solr cannot talk to ZK
   [junit4]   2> NOTE: leaving temporary files on disk at: /mnt/ssd/jenkins/workspace/Lucene-Solr-trunk-Linux/solr/build/solr-core/test/J1/./temp/solr.cloud.OverseerRolesTest-7AF9794BBBA1BCA0-001
   [junit4]   2> NOTE: test params are: codec=Asserting(Lucene46), sim=DefaultSimilarity, locale=ar_JO, timezone=Brazil/West
   [junit4]   2> NOTE: Linux 3.8.0-39-generic amd64/Oracle Corporation 1.8.0_05 (64-bit)/cpus=8,threads=1,free=227498136,total=398979072
   [junit4]   2> NOTE: All tests run in this JVM: [PluginInfoTest, PrimUtilsTest, TestHighFrequencyDictionaryFactory, ShardRoutingCustomTest, TestBinaryField, TestCloudManagedSchema, CollectionsAPIDistributedZkTest, TestQuerySenderListener, TestHashPartitioner, CurrencyFieldXmlFileTest, TestAddFieldRealTimeGet, TestComponentsName, AbstractAnalyticsStatsTest, TestRTGBase, SortByFunctionTest, TestCodecSupport, TriLevelCompositeIdRoutingTest, TestQuerySenderNoQuery, LegacyHTMLStripCharFilterTest, TestSolr4Spatial, ResponseHeaderTest, TestCSVLoader, SolrRequestParserTest, DeleteShardTest, TestAtomicUpdateErrorCases, RequiredFieldsTest, TestPhraseSuggestions, TestStressLucene, DebugComponentTest, TestSweetSpotSimilarityFactory, NoCacheHeaderTest, DocValuesMultiTest, ConvertedLegacyTest, EnumFieldTest, LeaderElectionIntegrationTest, DistribCursorPagingTest, SuggesterTSTTest, TestManagedResource, TestIndexSearcher, HardAutoCommitTest, FunctionTest, RequestHandlersTest, OpenExchangeRatesOrgProviderTest, FullSolrCloudDistribCmdsTest, BadIndexSchemaTest, StandardRequestHandlerTest, TestCoreDiscovery, DeleteInactiveReplicaTest, TestSolrXMLSerializer, TestFastOutputStream, SuggesterWFSTTest, TestRecovery, TestDistributedGrouping, TestWordDelimiterFilterFactory, CurrencyFieldOpenExchangeTest, TestRandomFaceting, AddBlockUpdateTest, TestDistributedMissingSort, XsltUpdateRequestHandlerTest, BlockDirectoryTest, TestFuzzyAnalyzedSuggestions, MultiTermTest, TestSolrQueryParserDefaultOperatorResource, TestCollapseQParserPlugin, ParsingFieldUpdateProcessorsTest, TestClassNameShortening, TermVectorComponentDistributedTest, TestSolrDeletionPolicy2, TestArbitraryIndexDir, TestStressReorder, AtomicUpdatesTest, HdfsBasicDistributedZkTest, TestFastWriter, MultiThreadedOCPTest, TestFoldingMultitermQuery, TestDocBasedVersionConstraints, TestFieldResource, TestManagedResourceStorage, SimplePostToolTest, IndexBasedSpellCheckerTest, DocValuesMissingTest, DistributedSuggestComponentTest, DisMaxRequestHandlerTest, TestOrdValues, TestUpdate, TestSchemaSimilarityResource, SpellCheckComponentTest, TestOmitPositions, TestDistributedSearch, InfoHandlerTest, JSONWriterTest, ConnectionManagerTest, DateFieldTest, DistributedExpandComponentTest, HdfsUnloadDistributedZkTest, FieldFacetTest, SuggestComponentTest, TestRecoveryHdfs, ChaosMonkeySafeLeaderTest, UnloadDistributedZkTest, OverseerTest, BasicZkTest, ZkSolrClientTest, TestZkChroot, AutoCommitTest, DistributedSpellCheckComponentTest, TestMultiCoreConfBootstrap, TestReload, TestStressVersions, DistributedTermsComponentTest, TestRangeQuery, SolrCoreTest, StatsComponentTest, SolrCmdDistributorTest, QueryElevationComponentTest, TestSort, TestFunctionQuery, TestLazyCores, DirectUpdateHandlerTest, OverseerCollectionProcessorTest, HighlighterTest, SoftAutoCommitTest, ShowFileRequestHandlerTest, AnalysisAfterCoreReloadTest, TestExtendedDismaxParser, SuggesterTest, TestTrie, SpatialFilterTest, SchemaVersionSpecificBehaviorTest, FieldMutatingUpdateProcessorTest, DirectUpdateHandlerOptimizeTest, DefaultValueUpdateProcessorTest, DistanceFunctionTest, SolrInfoMBeanTest, TestQueryUtils, DocumentAnalysisRequestHandlerTest, TermsComponentTest, DocumentBuilderTest, TestIndexingPerformance, FieldAnalysisRequestHandlerTest, FastVectorHighlighterTest, SolrPluginUtilsTest, TestCollationField, TestCSVResponseWriter, TestAnalyzedSuggestions, TestPartialUpdateDeduplication, TestPHPSerializedResponseWriter, CSVRequestHandlerTest, TestBinaryResponseWriter, HighlighterConfigTest, AlternateDirectoryTest, CopyFieldTest, TestMergePolicyConfig, SampleTest, NumericFieldsTest, MinimalSchemaTest, TestConfig, OutputWriterTest, TestSolrCoreProperties, DirectSolrConnectionTest, NotRequiredUniqueKeyTest, SpellPossibilityIteratorTest, TestCharFilters, TestXIncludeConfig, TestDFRSimilarityFactory, TestLMDirichletSimilarityFactory, TestLMJelinekMercerSimilarityFactory, TestIBSimilarityFactory, TestBM25SimilarityFactory, TestJmxMonitoredMap, ResourceLoaderTest, URLClassifyProcessorTest, TestFastLRUCache, DateMathParserTest, ChaosMonkeyNothingIsSafeTest, AssignTest, CollectionsAPIAsyncDistributedZkTest, DistribDocExpirationUpdateProcessorTest, OverseerRolesTest]
   [junit4] Completed on J1 in 55.84s, 1 test, 1 failure <<< FAILURES!

[...truncated 196 lines...]
BUILD FAILED
/mnt/ssd/jenkins/workspace/Lucene-Solr-trunk-Linux/build.xml:467: The following error occurred while executing this line:
/mnt/ssd/jenkins/workspace/Lucene-Solr-trunk-Linux/build.xml:447: The following error occurred while executing this line:
/mnt/ssd/jenkins/workspace/Lucene-Solr-trunk-Linux/build.xml:45: The following error occurred while executing this line:
/mnt/ssd/jenkins/workspace/Lucene-Solr-trunk-Linux/extra-targets.xml:37: The following error occurred while executing this line:
/mnt/ssd/jenkins/workspace/Lucene-Solr-trunk-Linux/solr/build.xml:189: The following error occurred while executing this line:
/mnt/ssd/jenkins/workspace/Lucene-Solr-trunk-Linux/solr/common-build.xml:496: The following error occurred while executing this line:
/mnt/ssd/jenkins/workspace/Lucene-Solr-trunk-Linux/lucene/common-build.xml:1296: The following error occurred while executing this line:
/mnt/ssd/jenkins/workspace/Lucene-Solr-trunk-Linux/lucene/common-build.xml:920: There were test failures: 406 suites, 1688 tests, 1 failure, 36 ignored (15 assumptions)

Total time: 66 minutes 5 seconds
Build step 'Invoke Ant' marked build as failure
Description set: Java: 64bit/jdk1.8.0_05 -XX:+UseCompressedOops -XX:+UseConcMarkSweepGC
Archiving artifacts
Recording test results
Email was triggered for: Failure
Sending email for trigger: Failure



Mime
View raw message