lucene-dev mailing list archives

Site index · List index
Message view « Date » · « Thread »
Top « Date » · « Thread »
From Policeman Jenkins Server <jenk...@thetaphi.de>
Subject [JENKINS] Lucene-Solr-4.8-Linux (64bit/jdk1.7.0_55) - Build # 142 - Still Failing!
Date Sun, 11 May 2014 01:54:07 GMT
Build: http://jenkins.thetaphi.de/job/Lucene-Solr-4.8-Linux/142/
Java: 64bit/jdk1.7.0_55 -XX:-UseCompressedOops -XX:+UseSerialGC

1 tests failed.
FAILED:  org.apache.lucene.analysis.ngram.NGramTokenizerTest.testRandomStrings

Error Message:
some thread(s) failed

Stack Trace:
java.lang.RuntimeException: some thread(s) failed
	at org.apache.lucene.analysis.BaseTokenStreamTestCase.checkRandomData(BaseTokenStreamTestCase.java:533)
	at org.apache.lucene.analysis.BaseTokenStreamTestCase.checkRandomData(BaseTokenStreamTestCase.java:435)
	at org.apache.lucene.analysis.ngram.NGramTokenizerTest.testRandomStrings(NGramTokenizerTest.java:120)
	at sun.reflect.NativeMethodAccessorImpl.invoke0(Native Method)
	at sun.reflect.NativeMethodAccessorImpl.invoke(NativeMethodAccessorImpl.java:57)
	at sun.reflect.DelegatingMethodAccessorImpl.invoke(DelegatingMethodAccessorImpl.java:43)
	at java.lang.reflect.Method.invoke(Method.java:606)
	at com.carrotsearch.randomizedtesting.RandomizedRunner.invoke(RandomizedRunner.java:1618)
	at com.carrotsearch.randomizedtesting.RandomizedRunner$6.evaluate(RandomizedRunner.java:827)
	at com.carrotsearch.randomizedtesting.RandomizedRunner$7.evaluate(RandomizedRunner.java:863)
	at com.carrotsearch.randomizedtesting.RandomizedRunner$8.evaluate(RandomizedRunner.java:877)
	at org.apache.lucene.util.TestRuleSetupTeardownChained$1.evaluate(TestRuleSetupTeardownChained.java:50)
	at org.apache.lucene.util.TestRuleFieldCacheSanity$1.evaluate(TestRuleFieldCacheSanity.java:51)
	at org.apache.lucene.util.AbstractBeforeAfterRule$1.evaluate(AbstractBeforeAfterRule.java:46)
	at com.carrotsearch.randomizedtesting.rules.SystemPropertiesInvariantRule$1.evaluate(SystemPropertiesInvariantRule.java:55)
	at org.apache.lucene.util.TestRuleThreadAndTestName$1.evaluate(TestRuleThreadAndTestName.java:49)
	at org.apache.lucene.util.TestRuleIgnoreAfterMaxFailures$1.evaluate(TestRuleIgnoreAfterMaxFailures.java:65)
	at org.apache.lucene.util.TestRuleMarkFailure$1.evaluate(TestRuleMarkFailure.java:48)
	at com.carrotsearch.randomizedtesting.rules.StatementAdapter.evaluate(StatementAdapter.java:36)
	at com.carrotsearch.randomizedtesting.ThreadLeakControl$StatementRunner.run(ThreadLeakControl.java:360)
	at com.carrotsearch.randomizedtesting.ThreadLeakControl.forkTimeoutingTask(ThreadLeakControl.java:793)
	at com.carrotsearch.randomizedtesting.ThreadLeakControl$3.evaluate(ThreadLeakControl.java:453)
	at com.carrotsearch.randomizedtesting.RandomizedRunner.runSingleTest(RandomizedRunner.java:836)
	at com.carrotsearch.randomizedtesting.RandomizedRunner$3.evaluate(RandomizedRunner.java:738)
	at com.carrotsearch.randomizedtesting.RandomizedRunner$4.evaluate(RandomizedRunner.java:772)
	at com.carrotsearch.randomizedtesting.RandomizedRunner$5.evaluate(RandomizedRunner.java:783)
	at org.apache.lucene.util.AbstractBeforeAfterRule$1.evaluate(AbstractBeforeAfterRule.java:46)
	at org.apache.lucene.util.TestRuleStoreClassName$1.evaluate(TestRuleStoreClassName.java:42)
	at com.carrotsearch.randomizedtesting.rules.SystemPropertiesInvariantRule$1.evaluate(SystemPropertiesInvariantRule.java:55)
	at com.carrotsearch.randomizedtesting.rules.NoShadowingOrOverridesOnMethodsRule$1.evaluate(NoShadowingOrOverridesOnMethodsRule.java:39)
	at com.carrotsearch.randomizedtesting.rules.NoShadowingOrOverridesOnMethodsRule$1.evaluate(NoShadowingOrOverridesOnMethodsRule.java:39)
	at com.carrotsearch.randomizedtesting.rules.StatementAdapter.evaluate(StatementAdapter.java:36)
	at com.carrotsearch.randomizedtesting.rules.StatementAdapter.evaluate(StatementAdapter.java:36)
	at org.apache.lucene.util.TestRuleAssertionsRequired$1.evaluate(TestRuleAssertionsRequired.java:43)
	at org.apache.lucene.util.TestRuleMarkFailure$1.evaluate(TestRuleMarkFailure.java:48)
	at org.apache.lucene.util.TestRuleIgnoreAfterMaxFailures$1.evaluate(TestRuleIgnoreAfterMaxFailures.java:65)
	at org.apache.lucene.util.TestRuleIgnoreTestSuites$1.evaluate(TestRuleIgnoreTestSuites.java:55)
	at com.carrotsearch.randomizedtesting.rules.StatementAdapter.evaluate(StatementAdapter.java:36)
	at com.carrotsearch.randomizedtesting.ThreadLeakControl$StatementRunner.run(ThreadLeakControl.java:360)
	at java.lang.Thread.run(Thread.java:745)




Build Log:
[...truncated 5472 lines...]
   [junit4] Suite: org.apache.lucene.analysis.ngram.NGramTokenizerTest
   [junit4]   2> TEST FAIL: useCharFilter=false text='alo nnuu    bhwtgqow-->\\ b \ud802\udf58\ud802\udf54\ud802\udf47
g?{1       <!--- km ?(| <? \u7dee\uf2a6\u4c20 \u07a8\ufe10o\u001d\u0269 idzgjc <?&#><p>
js vst xhihfa fxkfo (yz(?[xx fgb \ua570\ua51c\ua554\ua60e\ua63b\ua63c \ud8a7\ude18 \uc823\ufa43\uf4f7\u0222\u5c7f\ua19d\ue2c9\u07b0O\uda8c\udd4a
vft qhj \ua990\ua9b4\ua9a0\ua993\ua9ad\ua9bc\ua995\ua981 .{1,5}jr \u1c65\u1c5f\u1c78\u1c75\u1c59\u1c6e\u1c51\u1c7c\u1c6a
buatmx wj-qw \ud800\ude9c\ud800\ude85\ud800\ude8a\ud800\ude9f ffhsmz okeymr auy puwfk bytdy
\ua380\u4c18I \u2c7a\u2c6b\u2c6b\u2c71\u2c6a '-->&#x<p \u6af0\u6bd1 \u2297\u2250\u22d7\u2231\u2280
\ud834\ude4b\ud834\ude40\ud834\ude39 cdv kn \ud824\udecd\u014b\u001a\uff7d vwqtp'
   [junit4]   2> мај 11, 2014 2:53:23 PM com.carrotsearch.randomizedtesting.RandomizedRunner$QueueUncaughtExceptionsHandler
uncaughtException
   [junit4]   2> WARNING: Uncaught exception in thread: Thread[Thread-460,5,TGRP-NGramTokenizerTest]
   [junit4]   2> java.lang.AssertionError: actual mem: 38277980 byte, expected mem: 35859320
byte, flush mem: 14288580, active mem: 23989400, pending DWPT: 1, flushing DWPT: 0, blocked
DWPT: 0, peakDelta mem: 2304888 byte
   [junit4]   2> 	at __randomizedtesting.SeedInfo.seed([BE658539281A326C]:0)
   [junit4]   2> 	at org.apache.lucene.index.DocumentsWriterFlushControl.assertMemory(DocumentsWriterFlushControl.java:127)
   [junit4]   2> 	at org.apache.lucene.index.DocumentsWriterFlushControl.doAfterDocument(DocumentsWriterFlushControl.java:194)
   [junit4]   2> 	at org.apache.lucene.index.DocumentsWriter.updateDocument(DocumentsWriter.java:477)
   [junit4]   2> 	at org.apache.lucene.index.IndexWriter.updateDocument(IndexWriter.java:1537)
   [junit4]   2> 	at org.apache.lucene.index.IndexWriter.addDocument(IndexWriter.java:1207)
   [junit4]   2> 	at org.apache.lucene.index.RandomIndexWriter.addDocument(RandomIndexWriter.java:148)
   [junit4]   2> 	at org.apache.lucene.index.RandomIndexWriter.addDocument(RandomIndexWriter.java:109)
   [junit4]   2> 	at org.apache.lucene.analysis.BaseTokenStreamTestCase.checkRandomData(BaseTokenStreamTestCase.java:620)
   [junit4]   2> 	at org.apache.lucene.analysis.BaseTokenStreamTestCase.access$000(BaseTokenStreamTestCase.java:59)
   [junit4]   2> 	at org.apache.lucene.analysis.BaseTokenStreamTestCase$AnalysisThread.run(BaseTokenStreamTestCase.java:481)
   [junit4]   2> 
   [junit4]   2> TEST FAIL: useCharFilter=false text='iqbyyx \ua93d\ua955\ua939\ua932 \ufad1\u28d3\ud96e\udf3f\ue9d3
\ud800\uded0 \u0700\u0731\u071a t ijkid \u0d5d\u0d5f\u0d71\u0d24\u0d33\u0d13  kwali hjch \ue695\ud926\ude11)\u05fb\ud9f4\udd34
<? xrkbc dbvo z]l  \u4dcb\u4de3 {0,5 \u24eb\u248f\u24cd\u24e1\u24b9  nx \ud99e\udd6c\ud9e1\udf9f\uf4f8\u0737\u6425\u96f3
\ud802\udc43\ud802\udc57\ud802\udc4a\ud802\udc4f b uuqyp  amoubqfm m n idgkzywxywc \u1db3\u1dbf\u1d9d\u1db9\u1dbc\u1da6
zcf \u0b79\u0b2b\u0b35\u0b2a\u0b5e\u0b33 \u890ci\ud964\udfc0\ub4b8 onmcu fj wlgttg < sgc
klgtt   Qv hl twh  \ua9c5 bm \ua95e\ua947\ua94f pxr \ud802\udf3f s(q{1,5 \uf61d\u0669\uec03
\u0784 \uf272\uda5e\udfce\u029c \u31b8\u31b1\u31b1\u31bc\u31bd \uabe3\uabc7\uabe9 zckojp \udb40\udc4d\udb40\udc23\udb40\udc3c
n \u00fa\u00aa\u00ab\u0082\u009f GorZqonBV dj e g--)pb \ufb73 xgc  \uaa6b\uaa6f\uaa60\uaa77
\u2da5 \u03df jwm hnjqcjie     \u042d\u04fb\u0465\u0442 wly  wk \ud834\udd02\ud834\udde3\ud834\udded
dya \u76ee#\u04cc \ufe07\ufe03\ufe00\ufe09\ufe04\ufe08\ufe03\ufe09\ufe0a j aniyodkfwhd \u30ca\u30c5\u30e3\u30c2\u30e1\u30b7\u30aa\u30dc\u30b5\u30d5\u30e8\u30b0\u30fd
)m??o[[   \udb37\udd03\ufd00\u0001 eh sQ iw pulgaxz \u2ed1\u2ebf srneg </sTyLe&</kz>
krxhjp \u2710\\\ud9e2\udde5;Y\ucf13 trtt  {1,5 ykuigik \ud834\udf28\ud834\udf0f huaxmse pfofhze
\u4213\uea10q \ud800\udf88\ud800\udf82\ud800\udf9e\ud800\udf8c \ue684\ua712\ucb9f\uabe2* cooaoc
\ud801\udc5e\ud801\udc6a\ud801\udc7e\ud801\udc70\ud801\udc66 \ufb2d\ufb0a\ufb48\ufb18\ufb3f
\u3082\u3050\u3045\u3079\u3086\u309e xgyz  meiaxp c pmplk aft c)at{ q\u2a1c rb  uqfv \ud980\udeb1]
\ud802\udc47 \u00e2q\u07ea \u5f65\u24fd\u176b\uf322\u265d \u2de8\u2de6\u2de9\u2df7 uz kvynj
crM  sbghb qwbq \u0989\u09ea\u09ac\u09b1\u09c6 zxaxs \ud83c\udc11\ud83c\udc20 -->\\ gl
\u40abs\ue652i \u073d\uda88\udc00\u056e\ufc48 mwoii fxlclaq  \u31e6\u31c2\u31e8 \ufaa1\ufa86\ufa7a\uf9ac\uf936\ufa2c\uf9b3
lsh \uef44\ud987\ude5d\u0703 \u1da6\u1db4\u1dbb\u1d87 \u13f8\u13d1\u13e0\u13c7\u13c4\u13cc
ssxkuxg n \ud83c\ude60\ud83c\ude33 icfpqm v -z{1,5 \ud834\udf79 \u06bd\u047a\u247e\ubab6\u017c\u00ab
T|H yklmiwi \u2fa0\u2fca\u2f9b\u2f1a n \u7a0c/,\ue88f\ue7d9\ue90f\udbb6\udcdf msiloiz \u02c2\u8f0a\u0551\u0005\u0003
ihhcjwj \ua878\ua845 \u139d\u139f\u1380\u138e\u1387\u139d \udba6\udcee\udbb6\udcd4   \u31cd\u31d1\u31e8\u31c8\u31ef
\u2977\u2922\u2937\u2914\u2917\u2945\u293f\u290a \ua948\ua956\ua93e\ua94e\ua93d\ua934 efohfen
\uabf3\uf34a\u7973\u2026 yeyhubrm '-->? emyj aysgj   n \ue359 \u84a7\u06eeK\u2560\u046a\u8de0
zn \u0536\u38ea wmx aeihwkif trqgt '
   [junit4]   2> мај 11, 2014 2:53:23 PM com.carrotsearch.randomizedtesting.RandomizedRunner$QueueUncaughtExceptionsHandler
uncaughtException
   [junit4]   2> WARNING: Uncaught exception in thread: Thread[Thread-458,5,TGRP-NGramTokenizerTest]
   [junit4]   2> java.lang.AssertionError: actual mem: 38638428 byte, expected mem: 38164208
byte, flush mem: 23370100, active mem: 15268328, pending DWPT: 2, flushing DWPT: 0, blocked
DWPT: 0, peakDelta mem: 2304888 byte
   [junit4]   2> 	at __randomizedtesting.SeedInfo.seed([BE658539281A326C]:0)
   [junit4]   2> 	at org.apache.lucene.index.DocumentsWriterFlushControl.assertMemory(DocumentsWriterFlushControl.java:127)
   [junit4]   2> 	at org.apache.lucene.index.DocumentsWriterFlushControl.setFlushPending(DocumentsWriterFlushControl.java:271)
   [junit4]   2> 	at org.apache.lucene.index.FlushByRamOrCountsPolicy.markLargestWriterPending(FlushByRamOrCountsPolicy.java:105)
   [junit4]   2> 	at org.apache.lucene.index.FlushByRamOrCountsPolicy.onInsert(FlushByRamOrCountsPolicy.java:94)
   [junit4]   2> 	at org.apache.lucene.index.DocumentsWriterFlushControl.doAfterDocument(DocumentsWriterFlushControl.java:172)
   [junit4]   2> 	at org.apache.lucene.index.DocumentsWriter.updateDocument(DocumentsWriter.java:477)
   [junit4]   2> 	at org.apache.lucene.index.IndexWriter.updateDocument(IndexWriter.java:1537)
   [junit4]   2> 	at org.apache.lucene.index.IndexWriter.addDocument(IndexWriter.java:1207)
   [junit4]   2> 	at org.apache.lucene.index.RandomIndexWriter.addDocument(RandomIndexWriter.java:148)
   [junit4]   2> 	at org.apache.lucene.index.RandomIndexWriter.addDocument(RandomIndexWriter.java:109)
   [junit4]   2> 	at org.apache.lucene.analysis.BaseTokenStreamTestCase.checkRandomData(BaseTokenStreamTestCase.java:620)
   [junit4]   2> 	at org.apache.lucene.analysis.BaseTokenStreamTestCase.access$000(BaseTokenStreamTestCase.java:59)
   [junit4]   2> 	at org.apache.lucene.analysis.BaseTokenStreamTestCase$AnalysisThread.run(BaseTokenStreamTestCase.java:481)
   [junit4]   2> 
   [junit4]   2> NOTE: reproduce with: ant test  -Dtestcase=NGramTokenizerTest -Dtests.method=testRandomStrings
-Dtests.seed=BE658539281A326C -Dtests.multiplier=3 -Dtests.slow=true -Dtests.locale=sr -Dtests.timezone=Pacific/Fakaofo
-Dtests.file.encoding=UTF-8
   [junit4] ERROR   14.7s J0 | NGramTokenizerTest.testRandomStrings <<<
   [junit4]    > Throwable #1: java.lang.RuntimeException: some thread(s) failed
   [junit4]    > 	at org.apache.lucene.analysis.BaseTokenStreamTestCase.checkRandomData(BaseTokenStreamTestCase.java:533)
   [junit4]    > 	at org.apache.lucene.analysis.BaseTokenStreamTestCase.checkRandomData(BaseTokenStreamTestCase.java:435)
   [junit4]    > 	at org.apache.lucene.analysis.ngram.NGramTokenizerTest.testRandomStrings(NGramTokenizerTest.java:120)
   [junit4]    > 	at java.lang.Thread.run(Thread.java:745)Throwable #2: com.carrotsearch.randomizedtesting.UncaughtExceptionError:
Captured an uncaught exception in thread: Thread[id=616, name=Thread-460, state=RUNNABLE,
group=TGRP-NGramTokenizerTest]
   [junit4]    > Caused by: java.lang.AssertionError: actual mem: 38277980 byte, expected
mem: 35859320 byte, flush mem: 14288580, active mem: 23989400, pending DWPT: 1, flushing DWPT:
0, blocked DWPT: 0, peakDelta mem: 2304888 byte
   [junit4]    > 	at __randomizedtesting.SeedInfo.seed([BE658539281A326C]:0)
   [junit4]    > 	at org.apache.lucene.index.DocumentsWriterFlushControl.assertMemory(DocumentsWriterFlushControl.java:127)
   [junit4]    > 	at org.apache.lucene.index.DocumentsWriterFlushControl.doAfterDocument(DocumentsWriterFlushControl.java:194)
   [junit4]    > 	at org.apache.lucene.index.DocumentsWriter.updateDocument(DocumentsWriter.java:477)
   [junit4]    > 	at org.apache.lucene.index.IndexWriter.updateDocument(IndexWriter.java:1537)
   [junit4]    > 	at org.apache.lucene.index.IndexWriter.addDocument(IndexWriter.java:1207)
   [junit4]    > 	at org.apache.lucene.index.RandomIndexWriter.addDocument(RandomIndexWriter.java:148)
   [junit4]    > 	at org.apache.lucene.index.RandomIndexWriter.addDocument(RandomIndexWriter.java:109)
   [junit4]    > 	at org.apache.lucene.analysis.BaseTokenStreamTestCase.checkRandomData(BaseTokenStreamTestCase.java:620)
   [junit4]    > 	at org.apache.lucene.analysis.BaseTokenStreamTestCase.access$000(BaseTokenStreamTestCase.java:59)
   [junit4]    > 	at org.apache.lucene.analysis.BaseTokenStreamTestCase$AnalysisThread.run(BaseTokenStreamTestCase.java:481)Throwable
#3: com.carrotsearch.randomizedtesting.UncaughtExceptionError: Captured an uncaught exception
in thread: Thread[id=614, name=Thread-458, state=RUNNABLE, group=TGRP-NGramTokenizerTest]
   [junit4]    > Caused by: java.lang.AssertionError: actual mem: 38638428 byte, expected
mem: 38164208 byte, flush mem: 23370100, active mem: 15268328, pending DWPT: 2, flushing DWPT:
0, blocked DWPT: 0, peakDelta mem: 2304888 byte
   [junit4]    > 	at __randomizedtesting.SeedInfo.seed([BE658539281A326C]:0)
   [junit4]    > 	at org.apache.lucene.index.DocumentsWriterFlushControl.assertMemory(DocumentsWriterFlushControl.java:127)
   [junit4]    > 	at org.apache.lucene.index.DocumentsWriterFlushControl.setFlushPending(DocumentsWriterFlushControl.java:271)
   [junit4]    > 	at org.apache.lucene.index.FlushByRamOrCountsPolicy.markLargestWriterPending(FlushByRamOrCountsPolicy.java:105)
   [junit4]    > 	at org.apache.lucene.index.FlushByRamOrCountsPolicy.onInsert(FlushByRamOrCountsPolicy.java:94)
   [junit4]    > 	at org.apache.lucene.index.DocumentsWriterFlushControl.doAfterDocument(DocumentsWriterFlushControl.java:172)
   [junit4]    > 	at org.apache.lucene.index.DocumentsWriter.updateDocument(DocumentsWriter.java:477)
   [junit4]    > 	at org.apache.lucene.index.IndexWriter.updateDocument(IndexWriter.java:1537)
   [junit4]    > 	at org.apache.lucene.index.IndexWriter.addDocument(IndexWriter.java:1207)
   [junit4]    > 	at org.apache.lucene.index.RandomIndexWriter.addDocument(RandomIndexWriter.java:148)
   [junit4]    > 	at org.apache.lucene.index.RandomIndexWriter.addDocument(RandomIndexWriter.java:109)
   [junit4]    > 	at org.apache.lucene.analysis.BaseTokenStreamTestCase.checkRandomData(BaseTokenStreamTestCase.java:620)
   [junit4]    > 	at org.apache.lucene.analysis.BaseTokenStreamTestCase.access$000(BaseTokenStreamTestCase.java:59)
   [junit4]    > 	at org.apache.lucene.analysis.BaseTokenStreamTestCase$AnalysisThread.run(BaseTokenStreamTestCase.java:481)
   [junit4]   2> NOTE: leaving temporary files on disk at: /mnt/ssd/jenkins/workspace/Lucene-Solr-4.8-Linux/lucene/build/analysis/common/test/J0/./lucene.analysis.ngram.NGramTokenizerTest-BE658539281A326C-001
   [junit4]   2> NOTE: test params are: codec=Lucene3x, sim=RandomSimilarityProvider(queryNorm=true,coord=yes):
{}, locale=sr, timezone=Pacific/Fakaofo
   [junit4]   2> NOTE: Linux 3.8.0-39-generic amd64/Oracle Corporation 1.7.0_55 (64-bit)/cpus=8,threads=1,free=106672744,total=194691072
   [junit4]   2> NOTE: All tests run in this JVM: [TestCzechAnalyzer, TestRemoveDuplicatesTokenFilterFactory,
TestElisionFilterFactory, TestIrishAnalyzer, TestLengthFilter, TestScandinavianFoldingFilterFactory,
TestTrimFilter, WikipediaTokenizerTest, TestCzechStemFilterFactory, TestPorterStemFilter,
TestStemmerOverrideFilter, TestArabicNormalizationFilter, TestPatternReplaceCharFilterFactory,
TestWikipediaTokenizerFactory, TestGermanNormalizationFilterFactory, TestGermanNormalizationFilter,
TestIrishLowerCaseFilterFactory, TestChineseFilterFactory, TestArabicStemFilter, TestNorwegianAnalyzer,
TestFlagLong, TestBasqueAnalyzer, TestDelimitedPayloadTokenFilterFactory, TestScandinavianNormalizationFilter,
TestLatvianAnalyzer, TestReverseStringFilterFactory, TestTruncateTokenFilter, TestIndicNormalizer,
TestPathHierarchyTokenizer, TestGermanStemFilter, TestThaiAnalyzer, TestIndonesianAnalyzer,
TestTurkishLowerCaseFilterFactory, TestCatalanAnalyzer, TestHyphenatedWordsFilter, TestSynonymFilterFactory,
TestRomanianAnalyzer, TestSnowballVocab, TestPatternTokenizer, TestGermanLightStemFilterFactory,
TestLatvianStemFilterFactory, TestPortugueseMinimalStemFilterFactory, TestPersianNormalizationFilterFactory,
TestStopAnalyzer, TestIndonesianStemFilterFactory, TestShingleFilterFactory, TestChineseTokenizer,
TestPatternCaptureGroupTokenFilter, TestTeeSinkTokenFilter, TestIndonesianStemmer, TestWordDelimiterFilter,
TestMultiWordSynonyms, TestLimitTokenCountAnalyzer, TestBulgarianAnalyzer, TestHungarianAnalyzer,
TestUAX29URLEmailTokenizerFactory, TestThaiWordFilterFactory, TestMappingCharFilter, TestScandinavianFoldingFilter,
TestUAX29URLEmailAnalyzer, TestBrazilianStemFilterFactory, TestCapitalizationFilterFactory,
TestStemmer, TestDuelingAnalyzers, TestCJKAnalyzer, TestIgnore, TestAnalyzers, TestPatternReplaceCharFilter,
TestStandardAnalyzer, TestRemoveDuplicatesTokenFilter, TestClassicAnalyzer, TestUAX29URLEmailTokenizer,
TestAllAnalyzersHaveFactories, NGramTokenizerTest]
   [junit4] Completed on J0 in 18.77s, 14 tests, 1 error <<< FAILURES!

[...truncated 349 lines...]
BUILD FAILED
/mnt/ssd/jenkins/workspace/Lucene-Solr-4.8-Linux/build.xml:467: The following error occurred
while executing this line:
/mnt/ssd/jenkins/workspace/Lucene-Solr-4.8-Linux/build.xml:447: The following error occurred
while executing this line:
/mnt/ssd/jenkins/workspace/Lucene-Solr-4.8-Linux/build.xml:45: The following error occurred
while executing this line:
/mnt/ssd/jenkins/workspace/Lucene-Solr-4.8-Linux/extra-targets.xml:37: The following error
occurred while executing this line:
/mnt/ssd/jenkins/workspace/Lucene-Solr-4.8-Linux/lucene/build.xml:539: The following error
occurred while executing this line:
/mnt/ssd/jenkins/workspace/Lucene-Solr-4.8-Linux/lucene/common-build.xml:2013: The following
error occurred while executing this line:
/mnt/ssd/jenkins/workspace/Lucene-Solr-4.8-Linux/lucene/analysis/build.xml:106: The following
error occurred while executing this line:
/mnt/ssd/jenkins/workspace/Lucene-Solr-4.8-Linux/lucene/analysis/build.xml:38: The following
error occurred while executing this line:
/mnt/ssd/jenkins/workspace/Lucene-Solr-4.8-Linux/lucene/module-build.xml:60: The following
error occurred while executing this line:
/mnt/ssd/jenkins/workspace/Lucene-Solr-4.8-Linux/lucene/common-build.xml:1293: The following
error occurred while executing this line:
/mnt/ssd/jenkins/workspace/Lucene-Solr-4.8-Linux/lucene/common-build.xml:919: There were test
failures: 266 suites, 1451 tests, 1 error, 1 ignored

Total time: 19 minutes 19 seconds
Build step 'Invoke Ant' marked build as failure
Description set: Java: 64bit/jdk1.7.0_55 -XX:-UseCompressedOops -XX:+UseSerialGC
Archiving artifacts
Recording test results
Email was triggered for: Failure
Sending email for trigger: Failure



Mime
View raw message