lucene-dev mailing list archives

Site index · List index
Message view « Date » · « Thread »
Top « Date » · « Thread »
From Policeman Jenkins Server <jenk...@thetaphi.de>
Subject [JENKINS] Lucene-Solr-trunk-Linux (64bit/jdk1.7.0_55) - Build # 10288 - Still Failing!
Date Mon, 12 May 2014 18:16:13 GMT
Build: http://jenkins.thetaphi.de/job/Lucene-Solr-trunk-Linux/10288/
Java: 64bit/jdk1.7.0_55 -XX:+UseCompressedOops -XX:+UseParallelGC

2 tests failed.
FAILED:  org.apache.solr.morphlines.cell.SolrCellMorphlineTest.testSolrCellDocumentTypes

Error Message:
key:ignored_creation_date expected:<[2011-09-02T10:11:00Z]> but was:<[२०११-०९-०२T१०:११:००Z]>

Stack Trace:
java.lang.AssertionError: key:ignored_creation_date expected:<[2011-09-02T10:11:00Z]> but was:<[२०११-०९-०२T१०:११:००Z]>
	at __randomizedtesting.SeedInfo.seed([553E8FCE4C45E8D:9F904B62811F0058]:0)
	at org.junit.Assert.fail(Assert.java:93)
	at org.junit.Assert.failNotEquals(Assert.java:647)
	at org.junit.Assert.assertEquals(Assert.java:128)
	at org.apache.solr.morphlines.solr.AbstractSolrMorphlineTestBase.testDocumentTypesInternal(AbstractSolrMorphlineTestBase.java:170)
	at org.apache.solr.morphlines.cell.SolrCellMorphlineTest.testSolrCellDocumentTypes(SolrCellMorphlineTest.java:193)
	at sun.reflect.NativeMethodAccessorImpl.invoke0(Native Method)
	at sun.reflect.NativeMethodAccessorImpl.invoke(NativeMethodAccessorImpl.java:57)
	at sun.reflect.DelegatingMethodAccessorImpl.invoke(DelegatingMethodAccessorImpl.java:43)
	at java.lang.reflect.Method.invoke(Method.java:606)
	at com.carrotsearch.randomizedtesting.RandomizedRunner.invoke(RandomizedRunner.java:1618)
	at com.carrotsearch.randomizedtesting.RandomizedRunner$6.evaluate(RandomizedRunner.java:827)
	at com.carrotsearch.randomizedtesting.RandomizedRunner$7.evaluate(RandomizedRunner.java:863)
	at com.carrotsearch.randomizedtesting.RandomizedRunner$8.evaluate(RandomizedRunner.java:877)
	at com.carrotsearch.randomizedtesting.rules.SystemPropertiesRestoreRule$1.evaluate(SystemPropertiesRestoreRule.java:53)
	at org.apache.lucene.util.TestRuleSetupTeardownChained$1.evaluate(TestRuleSetupTeardownChained.java:50)
	at org.apache.lucene.util.TestRuleFieldCacheSanity$1.evaluate(TestRuleFieldCacheSanity.java:51)
	at org.apache.lucene.util.AbstractBeforeAfterRule$1.evaluate(AbstractBeforeAfterRule.java:46)
	at com.carrotsearch.randomizedtesting.rules.SystemPropertiesInvariantRule$1.evaluate(SystemPropertiesInvariantRule.java:55)
	at org.apache.lucene.util.TestRuleThreadAndTestName$1.evaluate(TestRuleThreadAndTestName.java:49)
	at org.apache.lucene.util.TestRuleIgnoreAfterMaxFailures$1.evaluate(TestRuleIgnoreAfterMaxFailures.java:65)
	at org.apache.lucene.util.TestRuleMarkFailure$1.evaluate(TestRuleMarkFailure.java:48)
	at com.carrotsearch.randomizedtesting.rules.StatementAdapter.evaluate(StatementAdapter.java:36)
	at com.carrotsearch.randomizedtesting.ThreadLeakControl$StatementRunner.run(ThreadLeakControl.java:360)
	at com.carrotsearch.randomizedtesting.ThreadLeakControl.forkTimeoutingTask(ThreadLeakControl.java:793)
	at com.carrotsearch.randomizedtesting.ThreadLeakControl$3.evaluate(ThreadLeakControl.java:453)
	at com.carrotsearch.randomizedtesting.RandomizedRunner.runSingleTest(RandomizedRunner.java:836)
	at com.carrotsearch.randomizedtesting.RandomizedRunner$3.evaluate(RandomizedRunner.java:738)
	at com.carrotsearch.randomizedtesting.RandomizedRunner$4.evaluate(RandomizedRunner.java:772)
	at com.carrotsearch.randomizedtesting.RandomizedRunner$5.evaluate(RandomizedRunner.java:783)
	at com.carrotsearch.randomizedtesting.rules.StatementAdapter.evaluate(StatementAdapter.java:36)
	at com.carrotsearch.randomizedtesting.rules.SystemPropertiesRestoreRule$1.evaluate(SystemPropertiesRestoreRule.java:53)
	at org.apache.lucene.util.AbstractBeforeAfterRule$1.evaluate(AbstractBeforeAfterRule.java:46)
	at org.apache.lucene.util.TestRuleStoreClassName$1.evaluate(TestRuleStoreClassName.java:42)
	at com.carrotsearch.randomizedtesting.rules.SystemPropertiesInvariantRule$1.evaluate(SystemPropertiesInvariantRule.java:55)
	at com.carrotsearch.randomizedtesting.rules.NoShadowingOrOverridesOnMethodsRule$1.evaluate(NoShadowingOrOverridesOnMethodsRule.java:39)
	at com.carrotsearch.randomizedtesting.rules.NoShadowingOrOverridesOnMethodsRule$1.evaluate(NoShadowingOrOverridesOnMethodsRule.java:39)
	at com.carrotsearch.randomizedtesting.rules.StatementAdapter.evaluate(StatementAdapter.java:36)
	at com.carrotsearch.randomizedtesting.rules.StatementAdapter.evaluate(StatementAdapter.java:36)
	at com.carrotsearch.randomizedtesting.rules.StatementAdapter.evaluate(StatementAdapter.java:36)
	at org.apache.lucene.util.TestRuleAssertionsRequired$1.evaluate(TestRuleAssertionsRequired.java:43)
	at org.apache.lucene.util.TestRuleMarkFailure$1.evaluate(TestRuleMarkFailure.java:48)
	at org.apache.lucene.util.TestRuleIgnoreAfterMaxFailures$1.evaluate(TestRuleIgnoreAfterMaxFailures.java:65)
	at org.apache.lucene.util.TestRuleIgnoreTestSuites$1.evaluate(TestRuleIgnoreTestSuites.java:55)
	at com.carrotsearch.randomizedtesting.rules.StatementAdapter.evaluate(StatementAdapter.java:36)
	at com.carrotsearch.randomizedtesting.ThreadLeakControl$StatementRunner.run(ThreadLeakControl.java:360)
	at java.lang.Thread.run(Thread.java:745)


FAILED:  org.apache.solr.morphlines.cell.SolrCellMorphlineTest.testSolrCellDocumentTypes2

Error Message:
key:ignored_creation_date expected:<[2007-10-01T16:13:56Z]> but was:<[२००७-१०-०१T१६:१३:५६Z]>

Stack Trace:
java.lang.AssertionError: key:ignored_creation_date expected:<[2007-10-01T16:13:56Z]> but was:<[२००७-१०-०१T१६:१३:५६Z]>
	at __randomizedtesting.SeedInfo.seed([553E8FCE4C45E8D:8ED3531CE332CD73]:0)
	at org.junit.Assert.fail(Assert.java:93)
	at org.junit.Assert.failNotEquals(Assert.java:647)
	at org.junit.Assert.assertEquals(Assert.java:128)
	at org.apache.solr.morphlines.solr.AbstractSolrMorphlineTestBase.testDocumentTypesInternal(AbstractSolrMorphlineTestBase.java:170)
	at org.apache.solr.morphlines.cell.SolrCellMorphlineTest.testSolrCellDocumentTypes2(SolrCellMorphlineTest.java:255)
	at sun.reflect.NativeMethodAccessorImpl.invoke0(Native Method)
	at sun.reflect.NativeMethodAccessorImpl.invoke(NativeMethodAccessorImpl.java:57)
	at sun.reflect.DelegatingMethodAccessorImpl.invoke(DelegatingMethodAccessorImpl.java:43)
	at java.lang.reflect.Method.invoke(Method.java:606)
	at com.carrotsearch.randomizedtesting.RandomizedRunner.invoke(RandomizedRunner.java:1618)
	at com.carrotsearch.randomizedtesting.RandomizedRunner$6.evaluate(RandomizedRunner.java:827)
	at com.carrotsearch.randomizedtesting.RandomizedRunner$7.evaluate(RandomizedRunner.java:863)
	at com.carrotsearch.randomizedtesting.RandomizedRunner$8.evaluate(RandomizedRunner.java:877)
	at com.carrotsearch.randomizedtesting.rules.SystemPropertiesRestoreRule$1.evaluate(SystemPropertiesRestoreRule.java:53)
	at org.apache.lucene.util.TestRuleSetupTeardownChained$1.evaluate(TestRuleSetupTeardownChained.java:50)
	at org.apache.lucene.util.TestRuleFieldCacheSanity$1.evaluate(TestRuleFieldCacheSanity.java:51)
	at org.apache.lucene.util.AbstractBeforeAfterRule$1.evaluate(AbstractBeforeAfterRule.java:46)
	at com.carrotsearch.randomizedtesting.rules.SystemPropertiesInvariantRule$1.evaluate(SystemPropertiesInvariantRule.java:55)
	at org.apache.lucene.util.TestRuleThreadAndTestName$1.evaluate(TestRuleThreadAndTestName.java:49)
	at org.apache.lucene.util.TestRuleIgnoreAfterMaxFailures$1.evaluate(TestRuleIgnoreAfterMaxFailures.java:65)
	at org.apache.lucene.util.TestRuleMarkFailure$1.evaluate(TestRuleMarkFailure.java:48)
	at com.carrotsearch.randomizedtesting.rules.StatementAdapter.evaluate(StatementAdapter.java:36)
	at com.carrotsearch.randomizedtesting.ThreadLeakControl$StatementRunner.run(ThreadLeakControl.java:360)
	at com.carrotsearch.randomizedtesting.ThreadLeakControl.forkTimeoutingTask(ThreadLeakControl.java:793)
	at com.carrotsearch.randomizedtesting.ThreadLeakControl$3.evaluate(ThreadLeakControl.java:453)
	at com.carrotsearch.randomizedtesting.RandomizedRunner.runSingleTest(RandomizedRunner.java:836)
	at com.carrotsearch.randomizedtesting.RandomizedRunner$3.evaluate(RandomizedRunner.java:738)
	at com.carrotsearch.randomizedtesting.RandomizedRunner$4.evaluate(RandomizedRunner.java:772)
	at com.carrotsearch.randomizedtesting.RandomizedRunner$5.evaluate(RandomizedRunner.java:783)
	at com.carrotsearch.randomizedtesting.rules.StatementAdapter.evaluate(StatementAdapter.java:36)
	at com.carrotsearch.randomizedtesting.rules.SystemPropertiesRestoreRule$1.evaluate(SystemPropertiesRestoreRule.java:53)
	at org.apache.lucene.util.AbstractBeforeAfterRule$1.evaluate(AbstractBeforeAfterRule.java:46)
	at org.apache.lucene.util.TestRuleStoreClassName$1.evaluate(TestRuleStoreClassName.java:42)
	at com.carrotsearch.randomizedtesting.rules.SystemPropertiesInvariantRule$1.evaluate(SystemPropertiesInvariantRule.java:55)
	at com.carrotsearch.randomizedtesting.rules.NoShadowingOrOverridesOnMethodsRule$1.evaluate(NoShadowingOrOverridesOnMethodsRule.java:39)
	at com.carrotsearch.randomizedtesting.rules.NoShadowingOrOverridesOnMethodsRule$1.evaluate(NoShadowingOrOverridesOnMethodsRule.java:39)
	at com.carrotsearch.randomizedtesting.rules.StatementAdapter.evaluate(StatementAdapter.java:36)
	at com.carrotsearch.randomizedtesting.rules.StatementAdapter.evaluate(StatementAdapter.java:36)
	at com.carrotsearch.randomizedtesting.rules.StatementAdapter.evaluate(StatementAdapter.java:36)
	at org.apache.lucene.util.TestRuleAssertionsRequired$1.evaluate(TestRuleAssertionsRequired.java:43)
	at org.apache.lucene.util.TestRuleMarkFailure$1.evaluate(TestRuleMarkFailure.java:48)
	at org.apache.lucene.util.TestRuleIgnoreAfterMaxFailures$1.evaluate(TestRuleIgnoreAfterMaxFailures.java:65)
	at org.apache.lucene.util.TestRuleIgnoreTestSuites$1.evaluate(TestRuleIgnoreTestSuites.java:55)
	at com.carrotsearch.randomizedtesting.rules.StatementAdapter.evaluate(StatementAdapter.java:36)
	at com.carrotsearch.randomizedtesting.ThreadLeakControl$StatementRunner.run(ThreadLeakControl.java:360)
	at java.lang.Thread.run(Thread.java:745)




Build Log:
[...truncated 18951 lines...]
   [junit4] Suite: org.apache.solr.morphlines.cell.SolrCellMorphlineTest
   [junit4]   2> log4j:WARN No such property [conversionPattern] in org.apache.solr.util.SolrLogLayout.
   [junit4]   2> Creating dataDir: /mnt/ssd/jenkins/workspace/Lucene-Solr-trunk-Linux/solr/build/contrib/solr-morphlines-cell/test/J0/./solr.morphlines.cell.SolrCellMorphlineTest-553E8FCE4C45E8D-001/init-core-data-001
   [junit4]   2> 717 T10 oas.SolrTestCaseJ4.buildSSLConfig Randomized ssl (false) and clientAuth (true)
   [junit4]   2> 757 T10 oas.SolrTestCaseJ4.initCore ####initCore
   [junit4]   2> 789 T10 oasc.SolrResourceLoader.<init> new SolrResourceLoader for directory: '/mnt/ssd/jenkins/workspace/Lucene-Solr-trunk-Linux/solr/contrib/morphlines-core/src/test-files/solr/collection1/'
   [junit4]   2> 1358 T10 oasc.SolrConfig.initLibs Adding specified lib dirs to ClassLoader
   [junit4]   2> 1360 T10 oasc.SolrResourceLoader.addToClassLoader WARN Can't find (or read) directory to add to classloader: ../../../contrib/extraction/lib (resolved as: /mnt/ssd/jenkins/workspace/Lucene-Solr-trunk-Linux/solr/contrib/morphlines-core/src/test-files/solr/collection1/../../../contrib/extraction/lib).
   [junit4]   2> 1361 T10 oasc.SolrResourceLoader.addToClassLoader WARN Can't find (or read) directory to add to classloader: ../../../dist/ (resolved as: /mnt/ssd/jenkins/workspace/Lucene-Solr-trunk-Linux/solr/contrib/morphlines-core/src/test-files/solr/collection1/../../../dist).
   [junit4]   2> 1362 T10 oasc.SolrResourceLoader.addToClassLoader WARN Can't find (or read) directory to add to classloader: ../../../contrib/clustering/lib/ (resolved as: /mnt/ssd/jenkins/workspace/Lucene-Solr-trunk-Linux/solr/contrib/morphlines-core/src/test-files/solr/collection1/../../../contrib/clustering/lib).
   [junit4]   2> 1363 T10 oasc.SolrResourceLoader.addToClassLoader WARN Can't find (or read) directory to add to classloader: ../../../dist/ (resolved as: /mnt/ssd/jenkins/workspace/Lucene-Solr-trunk-Linux/solr/contrib/morphlines-core/src/test-files/solr/collection1/../../../dist).
   [junit4]   2> 1364 T10 oasc.SolrResourceLoader.addToClassLoader WARN Can't find (or read) directory to add to classloader: ../../../contrib/langid/lib/ (resolved as: /mnt/ssd/jenkins/workspace/Lucene-Solr-trunk-Linux/solr/contrib/morphlines-core/src/test-files/solr/collection1/../../../contrib/langid/lib).
   [junit4]   2> 1365 T10 oasc.SolrResourceLoader.addToClassLoader WARN Can't find (or read) directory to add to classloader: ../../../dist/ (resolved as: /mnt/ssd/jenkins/workspace/Lucene-Solr-trunk-Linux/solr/contrib/morphlines-core/src/test-files/solr/collection1/../../../dist).
   [junit4]   2> 1366 T10 oasc.SolrResourceLoader.addToClassLoader WARN Can't find (or read) directory to add to classloader: ../../../contrib/velocity/lib (resolved as: /mnt/ssd/jenkins/workspace/Lucene-Solr-trunk-Linux/solr/contrib/morphlines-core/src/test-files/solr/collection1/../../../contrib/velocity/lib).
   [junit4]   2> 1367 T10 oasc.SolrResourceLoader.addToClassLoader WARN Can't find (or read) directory to add to classloader: ../../../dist/ (resolved as: /mnt/ssd/jenkins/workspace/Lucene-Solr-trunk-Linux/solr/contrib/morphlines-core/src/test-files/solr/collection1/../../../dist).
   [junit4]   2> 1368 T10 oasc.SolrResourceLoader.addToClassLoader WARN Can't find (or read) directory to add to classloader: /non/existent/dir/yields/warning (resolved as: /non/existent/dir/yields/warning).
   [junit4]   2> 1536 T10 oasc.SolrConfig.<init> Using Lucene MatchVersion: LUCENE_5_0
   [junit4]   2> 1798 T10 oasc.SolrConfig.<init> Loaded SolrConfig: solrconfig.xml
   [junit4]   2> 1807 T10 oass.IndexSchema.readSchema Reading Solr Schema from schema.xml
   [junit4]   2> 1911 T10 oass.IndexSchema.readSchema [null] Schema name=example
   [junit4]   2> 2705 T10 oasc.SolrResourceLoader.findClass WARN Solr loaded a deprecated plugin/analysis class [solr.ThaiWordFilterFactory]. Please consult documentation how to replace it accordingly.
   [junit4]   2> 2748 T10 oass.IndexSchema.readSchema unique key field: id
   [junit4]   2> 2916 T10 oass.FileExchangeRateProvider.reload Reloading exchange rates from file currency.xml
   [junit4]   2> 2932 T10 oass.FileExchangeRateProvider.reload Reloading exchange rates from file currency.xml
   [junit4]   2> 3075 T10 oasc.SolrResourceLoader.locateSolrHome JNDI not configured for solr (NoInitialContextEx)
   [junit4]   2> 3076 T10 oasc.SolrResourceLoader.locateSolrHome using system property solr.solr.home: /mnt/ssd/jenkins/workspace/Lucene-Solr-trunk-Linux/solr/contrib/morphlines-core/src/test-files/solr
   [junit4]   2> 3076 T10 oasc.SolrResourceLoader.<init> new SolrResourceLoader for directory: '/mnt/ssd/jenkins/workspace/Lucene-Solr-trunk-Linux/solr/contrib/morphlines-core/src/test-files/solr/'
   [junit4]   2> 3178 T10 oasc.CoreContainer.<init> New CoreContainer 2077661395
   [junit4]   2> 3179 T10 oasc.CoreContainer.load Loading cores into CoreContainer [instanceDir=/mnt/ssd/jenkins/workspace/Lucene-Solr-trunk-Linux/solr/contrib/morphlines-core/src/test-files/solr/]
   [junit4]   2> 3196 T10 oashc.HttpShardHandlerFactory.getParameter Setting socketTimeout to: 0
   [junit4]   2> 3197 T10 oashc.HttpShardHandlerFactory.getParameter Setting urlScheme to: null
   [junit4]   2> 3203 T10 oashc.HttpShardHandlerFactory.getParameter Setting connTimeout to: 0
   [junit4]   2> 3204 T10 oashc.HttpShardHandlerFactory.getParameter Setting maxConnectionsPerHost to: 20
   [junit4]   2> 3205 T10 oashc.HttpShardHandlerFactory.getParameter Setting corePoolSize to: 0
   [junit4]   2> 3205 T10 oashc.HttpShardHandlerFactory.getParameter Setting maximumPoolSize to: 2147483647
   [junit4]   2> 3206 T10 oashc.HttpShardHandlerFactory.getParameter Setting maxThreadIdleTime to: 5
   [junit4]   2> 3207 T10 oashc.HttpShardHandlerFactory.getParameter Setting sizeOfQueue to: -1
   [junit4]   2> 3207 T10 oashc.HttpShardHandlerFactory.getParameter Setting fairnessPolicy to: false
   [junit4]   2> 3433 T10 oasl.LogWatcher.createWatcher SLF4J impl is org.slf4j.impl.Log4jLoggerFactory
   [junit4]   2> 3434 T10 oasl.LogWatcher.newRegisteredLogWatcher Registering Log Listener [Log4j (org.slf4j.impl.Log4jLoggerFactory)]
   [junit4]   2> 3437 T10 oasc.CoreContainer.load Host Name: 
   [junit4]   2> 3527 T11 oasc.SolrResourceLoader.<init> new SolrResourceLoader for directory: '/mnt/ssd/jenkins/workspace/Lucene-Solr-trunk-Linux/solr/contrib/morphlines-core/src/test-files/solr/collection1/'
   [junit4]   2> 3604 T11 oasc.SolrConfig.initLibs Adding specified lib dirs to ClassLoader
   [junit4]   2> 3605 T11 oasc.SolrResourceLoader.addToClassLoader WARN Can't find (or read) directory to add to classloader: ../../../contrib/extraction/lib (resolved as: /mnt/ssd/jenkins/workspace/Lucene-Solr-trunk-Linux/solr/contrib/morphlines-core/src/test-files/solr/collection1/../../../contrib/extraction/lib).
   [junit4]   2> 3606 T11 oasc.SolrResourceLoader.addToClassLoader WARN Can't find (or read) directory to add to classloader: ../../../dist/ (resolved as: /mnt/ssd/jenkins/workspace/Lucene-Solr-trunk-Linux/solr/contrib/morphlines-core/src/test-files/solr/collection1/../../../dist).
   [junit4]   2> 3607 T11 oasc.SolrResourceLoader.addToClassLoader WARN Can't find (or read) directory to add to classloader: ../../../contrib/clustering/lib/ (resolved as: /mnt/ssd/jenkins/workspace/Lucene-Solr-trunk-Linux/solr/contrib/morphlines-core/src/test-files/solr/collection1/../../../contrib/clustering/lib).
   [junit4]   2> 3608 T11 oasc.SolrResourceLoader.addToClassLoader WARN Can't find (or read) directory to add to classloader: ../../../dist/ (resolved as: /mnt/ssd/jenkins/workspace/Lucene-Solr-trunk-Linux/solr/contrib/morphlines-core/src/test-files/solr/collection1/../../../dist).
   [junit4]   2> 3609 T11 oasc.SolrResourceLoader.addToClassLoader WARN Can't find (or read) directory to add to classloader: ../../../contrib/langid/lib/ (resolved as: /mnt/ssd/jenkins/workspace/Lucene-Solr-trunk-Linux/solr/contrib/morphlines-core/src/test-files/solr/collection1/../../../contrib/langid/lib).
   [junit4]   2> 3610 T11 oasc.SolrResourceLoader.addToClassLoader WARN Can't find (or read) directory to add to classloader: ../../../dist/ (resolved as: /mnt/ssd/jenkins/workspace/Lucene-Solr-trunk-Linux/solr/contrib/morphlines-core/src/test-files/solr/collection1/../../../dist).
   [junit4]   2> 3611 T11 oasc.SolrResourceLoader.addToClassLoader WARN Can't find (or read) directory to add to classloader: ../../../contrib/velocity/lib (resolved as: /mnt/ssd/jenkins/workspace/Lucene-Solr-trunk-Linux/solr/contrib/morphlines-core/src/test-files/solr/collection1/../../../contrib/velocity/lib).
   [junit4]   2> 3612 T11 oasc.SolrResourceLoader.addToClassLoader WARN Can't find (or read) directory to add to classloader: ../../../dist/ (resolved as: /mnt/ssd/jenkins/workspace/Lucene-Solr-trunk-Linux/solr/contrib/morphlines-core/src/test-files/solr/collection1/../../../dist).
   [junit4]   2> 3613 T11 oasc.SolrResourceLoader.addToClassLoader WARN Can't find (or read) directory to add to classloader: /non/existent/dir/yields/warning (resolved as: /non/existent/dir/yields/warning).
   [junit4]   2> 3674 T11 oasc.SolrConfig.<init> Using Lucene MatchVersion: LUCENE_5_0
   [junit4]   2> 3760 T11 oasc.SolrConfig.<init> Loaded SolrConfig: solrconfig.xml
   [junit4]   2> 3761 T11 oass.IndexSchema.readSchema Reading Solr Schema from schema.xml
   [junit4]   2> 3817 T11 oass.IndexSchema.readSchema [collection1] Schema name=example
   [junit4]   2> 4335 T11 oass.IndexSchema.readSchema unique key field: id
   [junit4]   2> 4363 T11 oass.FileExchangeRateProvider.reload Reloading exchange rates from file currency.xml
   [junit4]   2> 4371 T11 oass.FileExchangeRateProvider.reload Reloading exchange rates from file currency.xml
   [junit4]   2> 4432 T11 oasc.CoreContainer.create Creating SolrCore 'collection1' using configuration from instancedir /mnt/ssd/jenkins/workspace/Lucene-Solr-trunk-Linux/solr/contrib/morphlines-core/src/test-files/solr/collection1/
   [junit4]   2> 4455 T11 oasc.SolrCore.initDirectoryFactory org.apache.solr.core.MockDirectoryFactory
   [junit4]   2> 4464 T11 oasc.SolrCore.<init> [collection1] Opening new SolrCore at /mnt/ssd/jenkins/workspace/Lucene-Solr-trunk-Linux/solr/contrib/morphlines-core/src/test-files/solr/collection1/, dataDir=/mnt/ssd/jenkins/workspace/Lucene-Solr-trunk-Linux/solr/build/contrib/solr-morphlines-cell/test/J0/./solr.morphlines.cell.SolrCellMorphlineTest-553E8FCE4C45E8D-001/init-core-data-001/
   [junit4]   2> 4466 T11 oasc.JmxMonitoredMap.<init> No JMX servers found, not exposing Solr information with JMX.
   [junit4]   2> 4476 T11 oasc.SolrCore.initListeners [collection1] Added SolrEventListener for newSearcher: org.apache.solr.core.QuerySenderListener{queries=[]}
   [junit4]   2> 4477 T11 oasc.SolrCore.initListeners [collection1] Added SolrEventListener for firstSearcher: org.apache.solr.core.QuerySenderListener{queries=[{q=static firstSearcher warming in solrconfig.xml}]}
   [junit4]   2> 4508 T11 oasc.CachingDirectoryFactory.get return new directory for /mnt/ssd/jenkins/workspace/Lucene-Solr-trunk-Linux/solr/build/contrib/solr-morphlines-cell/test/J0/./solr.morphlines.cell.SolrCellMorphlineTest-553E8FCE4C45E8D-001/init-core-data-001
   [junit4]   2> 4508 T11 oasc.SolrCore.getNewIndexDir New index directory detected: old=null new=/mnt/ssd/jenkins/workspace/Lucene-Solr-trunk-Linux/solr/build/contrib/solr-morphlines-cell/test/J0/./solr.morphlines.cell.SolrCellMorphlineTest-553E8FCE4C45E8D-001/init-core-data-001/index/
   [junit4]   2> 4509 T11 oasc.SolrCore.initIndex WARN [collection1] Solr index directory '/mnt/ssd/jenkins/workspace/Lucene-Solr-trunk-Linux/solr/build/contrib/solr-morphlines-cell/test/J0/./solr.morphlines.cell.SolrCellMorphlineTest-553E8FCE4C45E8D-001/init-core-data-001/index' doesn't exist. Creating new index...
   [junit4]   2> 4517 T11 oasc.CachingDirectoryFactory.get return new directory for /mnt/ssd/jenkins/workspace/Lucene-Solr-trunk-Linux/solr/build/contrib/solr-morphlines-cell/test/J0/./solr.morphlines.cell.SolrCellMorphlineTest-553E8FCE4C45E8D-001/init-core-data-001/index
   [junit4]   2> 4558 T11 oasc.SolrDeletionPolicy.onCommit SolrDeletionPolicy.onCommit: commits: num=1
   [junit4]   2> 		commit{dir=MockDirectoryWrapper(RAMDirectory@1416e4cd lockFactory=NativeFSLockFactory@/mnt/ssd/jenkins/workspace/Lucene-Solr-trunk-Linux/solr/build/contrib/solr-morphlines-cell/test/J0/./solr.morphlines.cell.SolrCellMorphlineTest-553E8FCE4C45E8D-001/init-core-data-001/index),segFN=segments_1,generation=1}
   [junit4]   2> 4559 T11 oasc.SolrDeletionPolicy.updateCommits newest commit generation = 1
   [junit4]   2> 4569 T11 oasc.SolrCore.initWriters created json: solr.JSONResponseWriter
   [junit4]   2> 4570 T11 oasc.SolrCore.initWriters adding lazy queryResponseWriter: solr.VelocityResponseWriter
   [junit4]   2> 4571 T11 oasc.SolrCore.initWriters created velocity: solr.VelocityResponseWriter
   [junit4]   2> 4580 T11 oasc.SolrCore.initWriters created xslt: solr.XSLTResponseWriter
   [junit4]   2> 4580 T11 oasr.XSLTResponseWriter.init xsltCacheLifetimeSeconds=5
   [junit4]   2> 4815 T11 oasc.SolrCore.loadUpdateProcessorChains no updateRequestProcessorChain defined as default, creating implicit default
   [junit4]   2> 4837 T11 oasc.RequestHandlers.initHandlersFromConfig created /select: solr.SearchHandler
   [junit4]   2> 4838 T11 oasc.RequestHandlers.initHandlersFromConfig created /query: solr.SearchHandler
   [junit4]   2> 4843 T11 oasc.RequestHandlers.initHandlersFromConfig created /get: solr.RealTimeGetHandler
   [junit4]   2> 4843 T11 oasc.RequestHandlers.initHandlersFromConfig created /browse: solr.SearchHandler
   [junit4]   2> 4851 T11 oasc.RequestHandlers.initHandlersFromConfig created /update: solr.UpdateRequestHandler
   [junit4]   2> 4856 T11 oasc.SolrResourceLoader.findClass WARN Solr loaded a deprecated plugin/analysis class [solr.JsonUpdateRequestHandler]. Please consult documentation how to replace it accordingly.
   [junit4]   2> 4856 T11 oasc.RequestHandlers.initHandlersFromConfig created /update/json: solr.JsonUpdateRequestHandler
   [junit4]   2> 4861 T11 oasc.SolrResourceLoader.findClass WARN Solr loaded a deprecated plugin/analysis class [solr.CSVRequestHandler]. Please consult documentation how to replace it accordingly.
   [junit4]   2> 4862 T11 oasc.RequestHandlers.initHandlersFromConfig created /update/csv: solr.CSVRequestHandler
   [junit4]   2> 4862 T11 oasc.RequestHandlers.initHandlersFromConfig adding lazy requestHandler: solr.FieldAnalysisRequestHandler
   [junit4]   2> 4863 T11 oasc.RequestHandlers.initHandlersFromConfig created /analysis/field: solr.FieldAnalysisRequestHandler
   [junit4]   2> 4864 T11 oasc.RequestHandlers.initHandlersFromConfig adding lazy requestHandler: solr.DocumentAnalysisRequestHandler
   [junit4]   2> 4864 T11 oasc.RequestHandlers.initHandlersFromConfig created /analysis/document: solr.DocumentAnalysisRequestHandler
   [junit4]   2> 4869 T11 oasc.RequestHandlers.initHandlersFromConfig created /admin/: solr.admin.AdminHandlers
   [junit4]   2> 4874 T11 oasc.RequestHandlers.initHandlersFromConfig created /admin/ping: solr.PingRequestHandler
   [junit4]   2> 4879 T11 oasc.RequestHandlers.initHandlersFromConfig created /debug/dump: solr.DumpRequestHandler
   [junit4]   2> 4893 T11 oasc.RequestHandlers.initHandlersFromConfig created /replication: solr.ReplicationHandler
   [junit4]   2> 4893 T11 oasc.RequestHandlers.initHandlersFromConfig adding lazy requestHandler: solr.SearchHandler
   [junit4]   2> 4893 T11 oasc.RequestHandlers.initHandlersFromConfig created /spell: solr.SearchHandler
   [junit4]   2> 4894 T11 oasc.RequestHandlers.initHandlersFromConfig adding lazy requestHandler: solr.SearchHandler
   [junit4]   2> 4894 T11 oasc.RequestHandlers.initHandlersFromConfig created /tvrh: solr.SearchHandler
   [junit4]   2> 4895 T11 oasc.RequestHandlers.initHandlersFromConfig adding lazy requestHandler: solr.SearchHandler
   [junit4]   2> 4895 T11 oasc.RequestHandlers.initHandlersFromConfig created /terms: solr.SearchHandler
   [junit4]   2> 4895 T11 oasc.RequestHandlers.initHandlersFromConfig adding lazy requestHandler: solr.SearchHandler
   [junit4]   2> 4896 T11 oasc.RequestHandlers.initHandlersFromConfig created /elevate: solr.SearchHandler
   [junit4]   2> 4927 T11 oashl.XMLLoader.init xsltCacheLifetimeSeconds=60
   [junit4]   2> 4931 T11 oashl.XMLLoader.init xsltCacheLifetimeSeconds=60
   [junit4]   2> 4932 T11 oashl.XMLLoader.init xsltCacheLifetimeSeconds=60
   [junit4]   2> 4958 T11 oasu.CommitTracker.<init> Hard AutoCommit: if uncommited for 60000ms; 
   [junit4]   2> 4958 T11 oasu.CommitTracker.<init> Soft AutoCommit: if uncommited for 1000ms; 
   [junit4]   2> 4960 T11 oasc.SolrDeletionPolicy.onInit SolrDeletionPolicy.onInit: commits: num=1
   [junit4]   2> 		commit{dir=MockDirectoryWrapper(RAMDirectory@1416e4cd lockFactory=NativeFSLockFactory@/mnt/ssd/jenkins/workspace/Lucene-Solr-trunk-Linux/solr/build/contrib/solr-morphlines-cell/test/J0/./solr.morphlines.cell.SolrCellMorphlineTest-553E8FCE4C45E8D-001/init-core-data-001/index),segFN=segments_1,generation=1}
   [junit4]   2> 4961 T11 oasc.SolrDeletionPolicy.updateCommits newest commit generation = 1
   [junit4]   2> 4973 T11 oass.SolrIndexSearcher.<init> Opening Searcher@134bfb2f[collection1] main
   [junit4]   2> 4985 T11 oasr.ManagedResourceStorage$FileStorageIO.configure File-based storage initialized to use dir: /mnt/ssd/jenkins/workspace/Lucene-Solr-trunk-Linux/solr/contrib/morphlines-core/src/test-files/solr/collection1/conf
   [junit4]   2> 4986 T11 oasr.RestManager.init Initializing RestManager with initArgs: {storageDir=/mnt/ssd/jenkins/workspace/Lucene-Solr-trunk-Linux/solr/contrib/morphlines-core/src/test-files/solr/collection1/conf/}
   [junit4]   2> 5004 T11 oasr.ManagedResourceStorage.load Reading _rest_managed.json using file:dir=/mnt/ssd/jenkins/workspace/Lucene-Solr-trunk-Linux/solr/contrib/morphlines-core/src/test-files/solr/collection1/conf
   [junit4]   2> 5005 T11 oasr.ManagedResource.reloadFromStorage WARN No stored data found for /rest/managed
   [junit4]   2> 5005 T11 oasr.ManagedResource.notifyObserversDuringInit WARN No registered observers for /rest/managed
   [junit4]   2> 5006 T11 oasr.RestManager.init Initializing 0 registered ManagedResources
   [junit4]   2> 5006 T11 oashc.SpellCheckComponent.inform Initializing spell checkers
   [junit4]   2> 5024 T11 oass.DirectSolrSpellChecker.init init: {name=default,field=name,classname=solr.DirectSolrSpellChecker,distanceMeasure=internal,accuracy=0.5,maxEdits=2,minPrefix=1,maxInspections=5,minQueryLength=4,maxQueryFrequency=0.01}
   [junit4]   2> 5041 T11 oashc.SpellCheckComponent.inform No queryConverter defined, using default converter
   [junit4]   2> 5045 T11 oashc.QueryElevationComponent.inform Loading QueryElevation from: /mnt/ssd/jenkins/workspace/Lucene-Solr-trunk-Linux/solr/contrib/morphlines-core/src/test-files/solr/collection1/conf/elevate.xml
   [junit4]   2> 5121 T11 oash.ReplicationHandler.inform Commits will be reserved for  10000
   [junit4]   2> 5122 T12 oasc.QuerySenderListener.newSearcher QuerySenderListener sending requests to Searcher@134bfb2f[collection1] main{StandardDirectoryReader(segments_1:1:nrt)}
   [junit4]   2> 5123 T11 oasc.CoreContainer.registerCore registering core: collection1
   [junit4]   2> 5129 T10 oas.SolrTestCaseJ4.initCore ####initCore end
   [junit4]   2> 5153 T10 oas.SolrTestCaseJ4.setUp ###Starting testSolrCellDocumentTypes
   [junit4]   2> ASYNC  NEW_CORE C0 name=collection1 org.apache.solr.core.SolrCore@51e7a255
   [junit4]   2> 5205 T12 C0 oasc.SolrCore.execute [collection1] webapp=null path=null params={q=static+firstSearcher+warming+in+solrconfig.xml&distrib=false&event=firstSearcher} hits=0 status=0 QTime=78 
   [junit4]   2> 5207 T12 oasc.QuerySenderListener.newSearcher QuerySenderListener done.
   [junit4]   2> 5207 T12 oashc.SpellCheckComponent$SpellCheckerListener.newSearcher Loading spell index for spellchecker: default
   [junit4]   2> 5208 T12 oashc.SpellCheckComponent$SpellCheckerListener.newSearcher Loading spell index for spellchecker: wordbreak
   [junit4]   2> 5208 T12 oasc.SolrCore.registerSearcher [collection1] Registered new searcher Searcher@134bfb2f[collection1] main{StandardDirectoryReader(segments_1:1:nrt)}
   [junit4]   2> 5298 T10 C0 oasup.LogUpdateProcessor.finish [collection1] webapp=null path=/update params={} {deleteByQuery=*:* (-1467920980516012032)} 0 132
   [junit4]   2> 5300 T10 C0 oasu.DirectUpdateHandler2.commit start commit{,optimize=false,openSearcher=true,waitSearcher=true,expungeDeletes=false,softCommit=false,prepareCommit=false}
   [junit4]   2> 5301 T10 C0 oasu.DirectUpdateHandler2.commit No uncommitted changes. Skipping IW.commit.
   [junit4]   2> 5302 T10 C0 oasc.SolrCore.openNewSearcher SolrIndexSearcher has not changed - not re-opening: org.apache.solr.search.SolrIndexSearcher
   [junit4]   2> 5302 T10 C0 oasu.DirectUpdateHandler2.commit end_commit_flush
   [junit4]   2> 5303 T10 C0 oasup.LogUpdateProcessor.finish [collection1] webapp=null path=/update params={commit=true&softCommit=false&waitSearcher=true} {commit=} 0 3
   [junit4]   2> 5531 T10 okma.MorphlineContext.importCommandBuilders Importing commands
   [junit4]   2> 6678 T10 okma.MorphlineContext.importCommandBuilders Done importing commands
   [junit4]   2> 8511 T10 oasc.SolrResourceLoader.<init> new SolrResourceLoader for directory: '/mnt/ssd/jenkins/workspace/Lucene-Solr-trunk-Linux/solr/contrib/morphlines-core/src/test-files/solr/collection1/'
   [junit4]   2> 8566 T10 oasc.SolrConfig.initLibs Adding specified lib dirs to ClassLoader
   [junit4]   2> 8567 T10 oasc.SolrResourceLoader.addToClassLoader WARN Can't find (or read) directory to add to classloader: ../../../contrib/extraction/lib (resolved as: /mnt/ssd/jenkins/workspace/Lucene-Solr-trunk-Linux/solr/contrib/morphlines-core/src/test-files/solr/collection1/../../../contrib/extraction/lib).
   [junit4]   2> 8569 T10 oasc.SolrResourceLoader.addToClassLoader WARN Can't find (or read) directory to add to classloader: ../../../dist/ (resolved as: /mnt/ssd/jenkins/workspace/Lucene-Solr-trunk-Linux/solr/contrib/morphlines-core/src/test-files/solr/collection1/../../../dist).
   [junit4]   2> 8570 T10 oasc.SolrResourceLoader.addToClassLoader WARN Can't find (or read) directory to add to classloader: ../../../contrib/clustering/lib/ (resolved as: /mnt/ssd/jenkins/workspace/Lucene-Solr-trunk-Linux/solr/contrib/morphlines-core/src/test-files/solr/collection1/../../../contrib/clustering/lib).
   [junit4]   2> 8571 T10 oasc.SolrResourceLoader.addToClassLoader WARN Can't find (or read) directory to add to classloader: ../../../dist/ (resolved as: /mnt/ssd/jenkins/workspace/Lucene-Solr-trunk-Linux/solr/contrib/morphlines-core/src/test-files/solr/collection1/../../../dist).
   [junit4]   2> 8572 T10 oasc.SolrResourceLoader.addToClassLoader WARN Can't find (or read) directory to add to classloader: ../../../contrib/langid/lib/ (resolved as: /mnt/ssd/jenkins/workspace/Lucene-Solr-trunk-Linux/solr/contrib/morphlines-core/src/test-files/solr/collection1/../../../contrib/langid/lib).
   [junit4]   2> 8573 T10 oasc.SolrResourceLoader.addToClassLoader WARN Can't find (or read) directory to add to classloader: ../../../dist/ (resolved as: /mnt/ssd/jenkins/workspace/Lucene-Solr-trunk-Linux/solr/contrib/morphlines-core/src/test-files/solr/collection1/../../../dist).
   [junit4]   2> 8574 T10 oasc.SolrResourceLoader.addToClassLoader WARN Can't find (or read) directory to add to classloader: ../../../contrib/velocity/lib (resolved as: /mnt/ssd/jenkins/workspace/Lucene-Solr-trunk-Linux/solr/contrib/morphlines-core/src/test-files/solr/collection1/../../../contrib/velocity/lib).
   [junit4]   2> 8575 T10 oasc.SolrResourceLoader.addToClassLoader WARN Can't find (or read) directory to add to classloader: ../../../dist/ (resolved as: /mnt/ssd/jenkins/workspace/Lucene-Solr-trunk-Linux/solr/contrib/morphlines-core/src/test-files/solr/collection1/../../../dist).
   [junit4]   2> 8576 T10 oasc.SolrResourceLoader.addToClassLoader WARN Can't find (or read) directory to add to classloader: /non/existent/dir/yields/warning (resolved as: /non/existent/dir/yields/warning).
   [junit4]   2> 8628 T10 oasc.SolrConfig.<init> Using Lucene MatchVersion: LUCENE_5_0
   [junit4]   2> 8717 T10 oasc.SolrConfig.<init> Loaded SolrConfig: solrconfig.xml
   [junit4]   2> 8719 T10 oass.IndexSchema.readSchema Reading Solr Schema from schema.xml
   [junit4]   2> 8764 T10 oass.IndexSchema.readSchema [null] Schema name=example
   [junit4]   2> 9302 T10 oass.IndexSchema.readSchema unique key field: id
   [junit4]   2> 9328 T10 oass.FileExchangeRateProvider.reload Reloading exchange rates from file currency.xml
   [junit4]   2> 9338 T10 oass.FileExchangeRateProvider.reload Reloading exchange rates from file currency.xml
   [junit4]   2> 9397 T10 oasc.SolrResourceLoader.<init> new SolrResourceLoader for directory: '/mnt/ssd/jenkins/workspace/Lucene-Solr-trunk-Linux/solr/contrib/morphlines-core/src/test-files/solr/collection1/'
   [junit4]   2> 9444 T10 oasc.SolrConfig.initLibs Adding specified lib dirs to ClassLoader
   [junit4]   2> 9445 T10 oasc.SolrResourceLoader.addToClassLoader WARN Can't find (or read) directory to add to classloader: ../../../contrib/extraction/lib (resolved as: /mnt/ssd/jenkins/workspace/Lucene-Solr-trunk-Linux/solr/contrib/morphlines-core/src/test-files/solr/collection1/../../../contrib/extraction/lib).
   [junit4]   2> 9446 T10 oasc.SolrResourceLoader.addToClassLoader WARN Can't find (or read) directory to add to classloader: ../../../dist/ (resolved as: /mnt/ssd/jenkins/workspace/Lucene-Solr-trunk-Linux/solr/contrib/morphlines-core/src/test-files/solr/collection1/../../../dist).
   [junit4]   2> 9447 T10 oasc.SolrResourceLoader.addToClassLoader WARN Can't find (or read) directory to add to classloader: ../../../contrib/clustering/lib/ (resolved as: /mnt/ssd/jenkins/workspace/Lucene-Solr-trunk-Linux/solr/contrib/morphlines-core/src/test-files/solr/collection1/../../../contrib/clustering/lib).
   [junit4]   2> 9448 T10 oasc.SolrResourceLoader.addToClassLoader WARN Can't find (or read) directory to add to classloader: ../../../dist/ (resolved as: /mnt/ssd/jenkins/workspace/Lucene-Solr-trunk-Linux/solr/contrib/morphlines-core/src/test-files/solr/collection1/../../../dist).
   [junit4]   2> 9448 T10 oasc.SolrResourceLoader.addToClassLoader WARN Can't find (or read) directory to add to classloader: ../../../contrib/langid/lib/ (resolved as: /mnt/ssd/jenkins/workspace/Lucene-Solr-trunk-Linux/solr/contrib/morphlines-core/src/test-files/solr/collection1/../../../contrib/langid/lib).
   [junit4]   2> 9449 T10 oasc.SolrResourceLoader.addToClassLoader WARN Can't find (or read) directory to add to classloader: ../../../dist/ (resolved as: /mnt/ssd/jenkins/workspace/Lucene-Solr-trunk-Linux/solr/contrib/morphlines-core/src/test-files/solr/collection1/../../../dist).
   [junit4]   2> 9450 T10 oasc.SolrResourceLoader.addToClassLoader WARN Can't find (or read) directory to add to classloader: ../../../contrib/velocity/lib (resolved as: /mnt/ssd/jenkins/workspace/Lucene-Solr-trunk-Linux/solr/contrib/morphlines-core/src/test-files/solr/collection1/../../../contrib/velocity/lib).
   [junit4]   2> 9451 T10 oasc.SolrResourceLoader.addToClassLoader WARN Can't find (or read) directory to add to classloader: ../../../dist/ (resolved as: /mnt/ssd/jenkins/workspace/Lucene-Solr-trunk-Linux/solr/contrib/morphlines-core/src/test-files/solr/collection1/../../../dist).
   [junit4]   2> 9451 T10 oasc.SolrResourceLoader.addToClassLoader WARN Can't find (or read) directory to add to classloader: /non/existent/dir/yields/warning (resolved as: /non/existent/dir/yields/warning).
   [junit4]   2> 9494 T10 oasc.SolrConfig.<init> Using Lucene MatchVersion: LUCENE_5_0
   [junit4]   2> 9582 T10 oasc.SolrConfig.<init> Loaded SolrConfig: solrconfig.xml
   [junit4]   2> 9583 T10 oass.IndexSchema.readSchema Reading Solr Schema from schema.xml
   [junit4]   2> 9623 T10 oass.IndexSchema.readSchema [null] Schema name=example
   [junit4]   2> 10091 T10 oass.IndexSchema.readSchema unique key field: id
   [junit4]   2> 10117 T10 oass.FileExchangeRateProvider.reload Reloading exchange rates from file currency.xml
   [junit4]   2> 10123 T10 oass.FileExchangeRateProvider.reload Reloading exchange rates from file currency.xml
   [junit4]   2> 10620 T10 oasc.SolrResourceLoader.<init> new SolrResourceLoader for directory: '/mnt/ssd/jenkins/workspace/Lucene-Solr-trunk-Linux/solr/contrib/morphlines-core/src/test-files/solr/collection1/'
   [junit4]   2> 10656 T10 oasc.SolrConfig.initLibs Adding specified lib dirs to ClassLoader
   [junit4]   2> 10657 T10 oasc.SolrResourceLoader.addToClassLoader WARN Can't find (or read) directory to add to classloader: ../../../contrib/extraction/lib (resolved as: /mnt/ssd/jenkins/workspace/Lucene-Solr-trunk-Linux/solr/contrib/morphlines-core/src/test-files/solr/collection1/../../../contrib/extraction/lib).
   [junit4]   2> 10657 T10 oasc.SolrResourceLoader.addToClassLoader WARN Can't find (or read) directory to add to classloader: ../../../dist/ (resolved as: /mnt/ssd/jenkins/workspace/Lucene-Solr-trunk-Linux/solr/contrib/morphlines-core/src/test-files/solr/collection1/../../../dist).
   [junit4]   2> 10658 T10 oasc.SolrResourceLoader.addToClassLoader WARN Can't find (or read) directory to add to classloader: ../../../contrib/clustering/lib/ (resolved as: /mnt/ssd/jenkins/workspace/Lucene-Solr-trunk-Linux/solr/contrib/morphlines-core/src/test-files/solr/collection1/../../../contrib/clustering/lib).
   [junit4]   2> 10658 T10 oasc.SolrResourceLoader.addToClassLoader WARN Can't find (or read) directory to add to classloader: ../../../dist/ (resolved as: /mnt/ssd/jenkins/workspace/Lucene-Solr-trunk-Linux/solr/contrib/morphlines-core/src/test-files/solr/collection1/../../../dist).
   [junit4]   2> 10659 T10 oasc.SolrResourceLoader.addToClassLoader WARN Can't find (or read) directory to add to classloader: ../../../contrib/langid/lib/ (resolved as: /mnt/ssd/jenkins/workspace/Lucene-Solr-trunk-Linux/solr/contrib/morphlines-core/src/test-files/solr/collection1/../../../contrib/langid/lib).
   [junit4]   2> 10660 T10 oasc.SolrResourceLoader.addToClassLoader WARN Can't find (or read) directory to add to classloader: ../../../dist/ (resolved as: /mnt/ssd/jenkins/workspace/Lucene-Solr-trunk-Linux/solr/contrib/morphlines-core/src/test-files/solr/collection1/../../../dist).
   [junit4]   2> 10660 T10 oasc.SolrResourceLoader.addToClassLoader WARN Can't find (or read) directory to add to classloader: ../../../contrib/velocity/lib (resolved as: /mnt/ssd/jenkins/workspace/Lucene-Solr-trunk-Linux/solr/contrib/morphlines-core/src/test-files/solr/collection1/../../../contrib/velocity/lib).
   [junit4]   2> 10661 T10 oasc.SolrResourceLoader.addToClassLoader WARN Can't find (or read) directory to add to classloader: ../../../dist/ (resolved as: /mnt/ssd/jenkins/workspace/Lucene-Solr-trunk-Linux/solr/contrib/morphlines-core/src/test-files/solr/collection1/../../../dist).
   [junit4]   2> 10661 T10 oasc.SolrResourceLoader.addToClassLoader WARN Can't find (or read) directory to add to classloader: /non/existent/dir/yields/warning (resolved as: /non/existent/dir/yields/warning).
   [junit4]   2> 10697 T10 oasc.SolrConfig.<init> Using Lucene MatchVersion: LUCENE_5_0
   [junit4]   2> 10765 T10 oasc.SolrConfig.<init> Loaded SolrConfig: solrconfig.xml
   [junit4]   2> 10766 T10 oass.IndexSchema.readSchema Reading Solr Schema from schema.xml
   [junit4]   2> 10799 T10 oass.IndexSchema.readSchema [null] Schema name=example
   [junit4]   2> 11262 T10 oass.IndexSchema.readSchema unique key field: id
   [junit4]   2> 11284 T10 oass.FileExchangeRateProvider.reload Reloading exchange rates from file currency.xml
   [junit4]   2> 11291 T10 oass.FileExchangeRateProvider.reload Reloading exchange rates from file currency.xml
   [junit4]   2> 11323 T10 oasc.SolrResourceLoader.<init> new SolrResourceLoader for directory: '/mnt/ssd/jenkins/workspace/Lucene-Solr-trunk-Linux/solr/contrib/morphlines-core/src/test-files/solr/collection1/'
   [junit4]   2> 11359 T10 oasc.SolrConfig.initLibs Adding specified lib dirs to ClassLoader
   [junit4]   2> 11360 T10 oasc.SolrResourceLoader.addToClassLoader WARN Can't find (or read) directory to add to classloader: ../../../contrib/extraction/lib (resolved as: /mnt/ssd/jenkins/workspace/Lucene-Solr-trunk-Linux/solr/contrib/morphlines-core/src/test-files/solr/collection1/../../../contrib/extraction/lib).
   [junit4]   2> 11360 T10 oasc.SolrResourceLoader.addToClassLoader WARN Can't find (or read) directory to add to classloader: ../../../dist/ (resolved as: /mnt/ssd/jenkins/workspace/Lucene-Solr-trunk-Linux/solr/contrib/morphlines-core/src/test-files/solr/collection1/../../../dist).
   [junit4]   2> 11361 T10 oasc.SolrResourceLoader.addToClassLoader WARN Can't find (or read) directory to add to classloader: ../../../contrib/clustering/lib/ (resolved as: /mnt/ssd/jenkins/workspace/Lucene-Solr-trunk-Linux/solr/contrib/morphlines-core/src/test-files/solr/collection1/../../../contrib/clustering/lib).
   [junit4]   2> 11361 T10 oasc.SolrResourceLoader.addToClassLoader WARN Can't find (or read) directory to add to classloader: ../../../dist/ (resolved as: /mnt/ssd/jenkins/workspace/Lucene-Solr-trunk-Linux/solr/contrib/morphlines-core/src/test-files/solr/collection1/../../../dist).
   [junit4]   2> 11362 T10 oasc.SolrResourceLoader.addToClassLoader WARN Can't find (or read) directory to add to classloader: ../../../contrib/langid/lib/ (resolved as: /mnt/ssd/jenkins/workspace/Lucene-Solr-trunk-Linux/solr/contrib/morphlines-core/src/test-files/solr/collection1/../../../contrib/langid/lib).
   [junit4]   2> 11362 T10 oasc.SolrResourceLoader.addToClassLoader WARN Can't find (or read) directory to add to classloader: ../../../dist/ (resolved as: /mnt/ssd/jenkins/workspace/Lucene-Solr-trunk-Linux/solr/contrib/morphlines-core/src/test-files/solr/collection1/../../../dist).
   [junit4]   2> 11363 T10 oasc.SolrResourceLoader.addToClassLoader WARN Can't find (or read) directory to add to classloader: ../../../contrib/velocity/lib (resolved as: /mnt/ssd/jenkins/workspace/Lucene-Solr-trunk-Linux/solr/contrib/morphlines-core/src/test-files/solr/collection1/../../../contrib/velocity/lib).
   [junit4]   2> 11364 T10 oasc.SolrResourceLoader.addToClassLoader WARN Can't find (or read) directory to add to classloader: ../../../dist/ (resolved as: /mnt/ssd/jenkins/workspace/Lucene-Solr-trunk-Linux/solr/contrib/morphlines-core/src/test-files/solr/collection1/../../../dist).
   [junit4]   2> 11364 T10 oasc.SolrResourceLoader.addToClassLoader WARN Can't find (or read) directory to add to classloader: /non/existent/dir/yields/warning (resolved as: /non/existent/dir/yields/warning).
   [junit4]   2> 11400 T10 oasc.SolrConfig.<init> Using Lucene MatchVersion: LUCENE_5_0
   [junit4]   2> 11467 T10 oasc.SolrConfig.<init> Loaded SolrConfig: solrconfig.xml
   [junit4]   2> 11468 T10 oass.IndexSchema.readSchema Reading Solr Schema from schema.xml
   [junit4]   2> 11489 T10 oass.IndexSchema.readSchema [null] Schema name=example
   [junit4]   2> 11928 T10 oass.IndexSchema.readSchema unique key field: id
   [junit4]   2> 11951 T10 oass.FileExchangeRateProvider.reload Reloading exchange rates from file currency.xml
   [junit4]   2> 11957 T10 oass.FileExchangeRateProvider.reload Reloading exchange rates from file currency.xml
   [junit4]   2> 12152 T10 oasc.SolrResourceLoader.<init> new SolrResourceLoader for directory: '/mnt/ssd/jenkins/workspace/Lucene-Solr-trunk-Linux/solr/contrib/morphlines-core/src/test-files/solr/collection1/'
   [junit4]   2> 12186 T10 oasc.SolrConfig.initLibs Adding specified lib dirs to ClassLoader
   [junit4]   2> 12187 T10 oasc.SolrResourceLoader.addToClassLoader WARN Can't find (or read) directory to add to classloader: ../../../contrib/extraction/lib (resolved as: /mnt/ssd/jenkins/workspace/Lucene-Solr-trunk-Linux/solr/contrib/morphlines-core/src/test-files/solr/collection1/../../../contrib/extraction/lib).
   [junit4]   2> 12187 T10 oasc.SolrResourceLoader.addToClassLoader WARN Can't find (or read) directory to add to classloader: ../../../dist/ (resolved as: /mnt/ssd/jenkins/workspace/Lucene-Solr-trunk-Linux/solr/contrib/morphlines-core/src/test-files/solr/collection1/../../../dist).
   [junit4]   2> 12188 T10 oasc.SolrResourceLoader.addToClassLoader WARN Can't find (or read) directory to add to classloader: ../../../contrib/clustering/lib/ (resolved as: /mnt/ssd/jenkins/workspace/Lucene-Solr-trunk-Linux/solr/contrib/morphlines-core/src/test-files/solr/collection1/../../../contrib/clustering/lib).
   [junit4]   2> 12188 T10 oasc.SolrResourceLoader.addToClassLoader WARN Can't find (or read) directory to add to classloader: ../../../dist/ (resolved as: /mnt/ssd/jenkins/workspace/Lucene-Solr-trunk-Linux/solr/contrib/morphlines-core/src/test-files/solr/collection1/../../../dist).
   [junit4]   2> 12189 T10 oasc.SolrResourceLoader.addToClassLoader WARN Can't find (or read) directory to add to classloader: ../../../contrib/langid/lib/ (resolved as: /mnt/ssd/jenkins/workspace/Lucene-Solr-trunk-Linux/solr/contrib/morphlines-core/src/test-files/solr/collection1/../../../contrib/langid/lib).
   [junit4]   2> 12190 T10 oasc.SolrResourceLoader.addToClassLoader WARN Can't find (or read) directory to add to classloader: ../../../dist/ (resolved as: /mnt/ssd/jenkins/workspace/Lucene-Solr-trunk-Linux/solr/contrib/morphlines-core/src/test-files/solr/collection1/../../../dist).
   [junit4]   2> 12190 T10 oasc.SolrResourceLoader.addToClassLoader WARN Can't find (or read) directory to add to classloader: ../../../contrib/velocity/lib (resolved as: /mnt/ssd/jenkins/workspace/Lucene-Solr-trunk-Linux/solr/contrib/morphlines-core/src/test-files/solr/collection1/../../../contrib/velocity/lib).
   [junit4]   2> 12191 T10 oasc.SolrResourceLoader.addToClassLoader WARN Can't find (or read) directory to add to classloader: ../../../dist/ (resolved as: /mnt/ssd/jenkins/workspace/Lucene-Solr-trunk-Linux/solr/contrib/morphlines-core/src/test-files/solr/collection1/../../../dist).
   [junit4]   2> 12191 T10 oasc.SolrResourceLoader.addToClassLoader WARN Can't find (or read) directory to add to classloader: /non/existent/dir/yields/warning (resolved as: /non/existent/dir/yields/warning).
   [junit4]   2> 12236 T10 oasc.SolrConfig.<init> Using Lucene MatchVersion: LUCENE_5_0
   [junit4]   2> 12306 T10 oasc.SolrConfig.<init> Loaded SolrConfig: solrconfig.xml
   [junit4]   2> 12307 T10 oass.IndexSchema.readSchema Reading Solr Schema from schema.xml
   [junit4]   2> 12325 T10 oass.IndexSchema.readSchema [null] Schema name=example
   [junit4]   2> 12755 T10 oass.IndexSchema.readSchema unique key field: id
   [junit4]   2> 12776 T10 oass.FileExchangeRateProvider.reload Reloading exchange rates from file currency.xml
   [junit4]   2> 12781 T10 oass.FileExchangeRateProvider.reload Reloading exchange rates from file currency.xml
   [junit4]   2> ASYNC  NEW_CORE C1 name=collection1 org.apache.solr.core.SolrCore@51e7a255
   [junit4]   2> 12808 T10 C1 oasup.LogUpdateProcessor.finish [collection1] webapp=null path=/update params={} {deleteByQuery=*:* (-1467920988453732352)} 0 2
   [junit4]   2> 12808 T10 C1 oasu.DirectUpdateHandler2.commit start commit{,optimize=false,openSearcher=true,waitSearcher=true,expungeDeletes=false,softCommit=false,prepareCommit=false}
   [junit4]   2> 12809 T10 C1 oasu.DirectUpdateHandler2.commit No uncommitted changes. Skipping IW.commit.
   [junit4]   2> 12809 T10 C1 oasc.SolrCore.openNewSearcher SolrIndexSearcher has not changed - not re-opening: org.apache.solr.search.SolrIndexSearcher
   [junit4]   2> 12810 T10 C1 oasu.DirectUpdateHandler2.commit end_commit_flush
   [junit4]   2> 12810 T10 C1 oasup.LogUpdateProcessor.finish [collection1] webapp=null path=/update params={commit=true&softCommit=false&waitSearcher=true} {commit=} 0 2
   [junit4]   2> 13141 T10 C1 oasup.LogUpdateProcessor.finish [collection1] webapp=null path=/update params={} {add=[testBMPfp.txt#0 (1467920988747333632)]} 0 56
   [junit4]   2> 13144 T10 C1 oasu.DirectUpdateHandler2.commit start commit{,optimize=false,openSearcher=true,waitSearcher=true,expungeDeletes=false,softCommit=true,prepareCommit=false}
   [junit4]   2> 13223 T10 C1 oass.SolrIndexSearcher.<init> Opening Searcher@6ce139a0[collection1] main
   [junit4]   2> 13225 T10 C1 oasu.DirectUpdateHandler2.commit end_commit_flush
   [junit4]   2> 13225 T12 oasc.QuerySenderListener.newSearcher QuerySenderListener sending requests to Searcher@6ce139a0[collection1] main{StandardDirectoryReader(segments_1:3:nrt _0(5.0):C1)}
   [junit4]   2> 13226 T12 oasc.QuerySenderListener.newSearcher QuerySenderListener done.
   [junit4]   2> 13227 T12 oasc.SolrCore.registerSearcher [collection1] Registered new searcher Searcher@6ce139a0[collection1] main{StandardDirectoryReader(segments_1:3:nrt _0(5.0):C1)}
   [junit4]   2> 13229 T10 C1 oasup.LogUpdateProcessor.finish [collection1] webapp=null path=/update params={commit=true&softCommit=true&waitSearcher=true} {commit=} 0 85
   [junit4]   2> 13238 T10 C1 oasc.SolrCore.execute [collection1] webapp=null path=/select params={q=*%3A*&rows=2147483647} hits=1 status=0 QTime=7 
   [junit4]   2> 13335 T10 C1 oasup.LogUpdateProcessor.finish [collection1] webapp=null path=/update params={} {add=[boilerplate.html#0 (1467920989004234752)]} 0 3
   [junit4]   2> 13336 T10 C1 oasu.DirectUpdateHandler2.commit start commit{,optimize=false,openSearcher=true,waitSearcher=true,expungeDeletes=false,softCommit=true,prepareCommit=false}
   [junit4]   2> 13358 T10 C1 oass.SolrIndexSearcher.<init> Opening Searcher@6c64fe67[collection1] main
   [junit4]   2> 13359 T10 C1 oasu.DirectUpdateHandler2.commit end_commit_flush
   [junit4]   2> 13359 T12 oasc.QuerySenderListener.newSearcher QuerySenderListener sending requests to Searcher@6c64fe67[collection1] main{StandardDirectoryReader(segments_1:5:nrt _0(5.0):C1 _1(5.0):C1)}
   [junit4]   2> 13360 T12 oasc.QuerySenderListener.newSearcher QuerySenderListener done.
   [junit4]   2> 13361 T12 oasc.SolrCore.registerSearcher [collection1] Registered new searcher Searcher@6c64fe67[collection1] main{StandardDirectoryReader(segments_1:5:nrt _0(5.0):C1 _1(5.0):C1)}
   [junit4]   2> 13362 T10 C1 oasup.LogUpdateProcessor.finish [collection1] webapp=null path=/update params={commit=true&softCommit=true&waitSearcher=true} {commit=} 0 27
   [junit4]   2> 13363 T10 C1 oasc.SolrCore.execute [collection1] webapp=null path=/select params={q=*%3A*&rows=2147483647} hits=2 status=0 QTime=0 
   [junit4]   2> ASYNC  NEW_CORE C2 name=collection1 org.apache.solr.core.SolrCore@51e7a255
   [junit4]   2> 14408 T10 C2 oasup.LogUpdateProcessor.finish [collection1] webapp=null path=/update params={} {add=[NullHeader.docx#0 (1467920990117822464)]} 0 15
   [junit4]   2> 14409 T10 C2 oasu.DirectUpdateHandler2.commit start commit{,optimize=false,openSearcher=true,waitSearcher=true,expungeDeletes=false,softCommit=true,prepareCommit=false}
   [junit4]   2> 14450 T10 C2 oass.SolrIndexSearcher.<init> Opening Searcher@6e255c56[collection1] main
   [junit4]   2> 14451 T10 C2 oasu.DirectUpdateHandler2.commit end_commit_flush
   [junit4]   2> 14451 T12 oasc.QuerySenderListener.newSearcher QuerySenderListener sending requests to Searcher@6e255c56[collection1] main{StandardDirectoryReader(segments_1:7:nrt _0(5.0):C1 _1(5.0):C1 _2(5.0):C1)}
   [junit4]   2> 14452 T12 oasc.QuerySenderListener.newSearcher QuerySenderListener done.
   [junit4]   2> 14452 T12 oasc.SolrCore.registerSearcher [collection1] Registered new searcher Searcher@6e255c56[collection1] main{StandardDirectoryReader(segments_1:7:nrt _0(5.0):C1 _1(5.0):C1 _2(5.0):C1)}
   [junit4]   2> 14453 T10 C2 oasup.LogUpdateProcessor.finish [collection1] webapp=null path=/update params={commit=true&softCommit=true&waitSearcher=true} {commit=} 0 44
   [junit4]   2> 14454 T10 C2 oasc.SolrCore.execute [collection1] webapp=null path=/select params={q=*%3A*&rows=2147483647} hits=3 status=0 QTime=0 
   [junit4]   2> 14857 T10 C2 oasup.LogUpdateProcessor.finish [collection1] webapp=null path=/update params={} {add=[testWORD_various.doc#0 (1467920990594924544)]} 0 10
   [junit4]   2> 14858 T10 C2 oasu.DirectUpdateHandler2.commit start commit{,optimize=false,openSearcher=true,waitSearcher=true,expungeDeletes=false,softCommit=true,prepareCommit=false}
   [junit4]   2> 14871 T10 C2 oass.SolrIndexSearcher.<init> Opening Searcher@15407a26[collection1] main
   [junit4]   2> 14871 T10 C2 oasu.DirectUpdateHandler2.commit end_commit_flush
   [junit4]   2> 14872 T12 oasc.QuerySenderListener.newSearcher QuerySenderListener sending requests to Searcher@15407a26[collection1] main{StandardDirectoryReader(segments_1:9:nrt _0(5.0):C1 _1(5.0):C1 _2(5.0):C1 _3(5.0):C1)}
   [junit4]   2> 14872 T12 oasc.QuerySenderListener.newSearcher QuerySenderListener done.
   [junit4]   2> 14873 T12 oasc.SolrCore.registerSearcher [collection1] Registered new searcher Searcher@15407a26[collection1] main{StandardDirectoryReader(segments_1:9:nrt _0(5.0):C1 _1(5.0):C1 _2(5.0):C1 _3(5.0):C1)}
   [junit4]   2> 14874 T10 C2 oasup.LogUpdateProcessor.finish [collection1] webapp=null path=/update params={commit=true&softCommit=true&waitSearcher=true} {commit=} 0 16
   [junit4]   2> 14875 T10 C2 oasc.SolrCore.execute [collection1] webapp=null path=/select params={q=*%3A*&rows=2147483647} hits=4 status=0 QTime=0 
   [junit4]   2> 14880 T10 oas.SolrTestCaseJ4.tearDown ###Ending testSolrCellDocumentTypes
   [junit4]   2> NOTE: reproduce with: ant test  -Dtestcase=SolrCellMorphlineTest -Dtests.method=testSolrCellDocumentTypes -Dtests.seed=553E8FCE4C45E8D -Dtests.multiplier=3 -Dtests.slow=true -Dtests.locale=hi_IN -Dtests.timezone=Atlantic/Canary -Dtests.file.encoding=UTF-8
   [junit4] FAILURE 9.78s | SolrCellMorphlineTest.testSolrCellDocumentTypes <<<
   [junit4]    > Throwable #1: java.lang.AssertionError: key:ignored_creation_date expected:<[2011-09-02T10:11:00Z]> but was:<[२०११-०९-०२T१०:११:००Z]>
   [junit4]    > 	at __randomizedtesting.SeedInfo.seed([553E8FCE4C45E8D:9F904B62811F0058]:0)
   [junit4]    > 	at org.apache.solr.morphlines.solr.AbstractSolrMorphlineTestBase.testDocumentTypesInternal(AbstractSolrMorphlineTestBase.java:170)
   [junit4]    > 	at org.apache.solr.morphlines.cell.SolrCellMorphlineTest.testSolrCellDocumentTypes(SolrCellMorphlineTest.java:193)
   [junit4]    > 	at java.lang.Thread.run(Thread.java:745)
   [junit4]   2> 14928 T10 oas.SolrTestCaseJ4.setUp ###Starting testTransformValue
   [junit4]   2> 14957 T10 C2 oass.SolrIndexSearcher.<init> Opening Searcher@a732f2d[collection1] realtime
   [junit4]   2> 14958 T10 C2 oasup.LogUpdateProcessor.finish [collection1] webapp=null path=/update params={} {deleteByQuery=*:* (-1467920990678810624)} 0 30
   [junit4]   2> 14959 T10 C2 oasu.DirectUpdateHandler2.commit start commit{,optimize=false,openSearcher=true,waitSearcher=true,expungeDeletes=false,softCommit=false,prepareCommit=false}
   [junit4]   2> 14960 T10 C2 oasc.SolrDeletionPolicy.onCommit SolrDeletionPolicy.onCommit: commits: num=2
   [junit4]   2> 		commit{dir=MockDirectoryWrapper(RAMDirectory@1416e4cd lockFactory=NativeFSLockFactory@/mnt/ssd/jenkins/workspace/Lucene-Solr-trunk-Linux/solr/build/contrib/solr-morphlines-cell/test/J0/./solr.morphlines.cell.SolrCellMorphlineTest-553E8FCE4C45E8D-001/init-core-data-001/index),segFN=segments_1,generation=1}
   [junit4]   2> 		commit{dir=MockDirectoryWrapper(RAMDirectory@1416e4cd lockFactory=NativeFSLockFactory@/mnt/ssd/jenkins/workspace/Lucene-Solr-trunk-Linux/solr/build/contrib/solr-morphlines-cell/test/J0/./solr.morphlines.cell.SolrCellMorphlineTest-553E8FCE4C45E8D-001/init-core-data-001/index),segFN=segments_2,generation=2}
   [junit4]   2> 14960 T10 C2 oasc.SolrDeletionPolicy.updateCommits newest commit generation = 2
   [junit4]   2> 14961 T10 C2 oass.SolrIndexSearcher.<init> Opening Searcher@26655ffd[collection1] main
   [junit4]   2> 14962 T10 C2 oasu.DirectUpdateHandler2.commit end_commit_flush
   [junit4]   2> 14962 T12 oasc.QuerySenderListener.newSearcher QuerySenderListener sending requests to Searcher@26655ffd[collection1] main{StandardDirectoryReader(segments_1:11:nrt)}
   [junit4]   2> 14963 T12 oasc.QuerySenderListener.newSearcher QuerySenderListener done.
   [junit4]   2> 14963 T12 oasc.SolrCore.registerSearcher [collection1] Registered new searcher Searcher@26655ffd[collection1] main{StandardDirectoryReader(segments_1:11:nrt)}
   [junit4]   2> 14965 T10 C2 oasup.LogUpdateProcessor.finish [collection1] webapp=null path=/update params={commit=true&softCommit=false&waitSearcher=true} {commit=} 0 7
   [junit4]   2> 14968 T10 oas.SolrTestCaseJ4.tearDown ###Ending testTransformValue
   [junit4]   2> 14982 T10 oas.SolrTestCaseJ4.setUp ###Starting testSolrCellJPGCompressed
   [junit4]   2> 14984 T10 C2 oasup.LogUpdateProcessor.finish [collection1] webapp=null path=/update params={} {deleteByQuery=*:* (-1467920990735433728)} 0 1
   [junit4]   2> 14985 T10 C2 oasu.DirectUpdateHandler2.commit start commit{,optimize=false,openSearcher=true,waitSearcher=true,expungeDeletes=false,softCommit=false,prepareCommit=false}
   [junit4]   2> 14985 T10 C2 oasu.DirectUpdateHandler2.commit No uncommitted changes. Skipping IW.commit.
   [junit4]   2> 14986 T10 C2 oasc.SolrCore.openNewSearcher SolrIndexSearcher has not changed - not re-opening: org.apache.solr.search.SolrIndexSearcher
   [junit4]   2> 14986 T10 C2 oasu.DirectUpdateHandler2.commit end_commit_flush
   [junit4]   2> 14987 T10 C2 oasup.LogUpdateProcessor.finish [collection1] webapp=null path=/update params={commit=true&softCommit=false&waitSearcher=true} {commit=} 0 2
   [junit4]   2> 15004 T10 okma.MorphlineContext.importCommandBuilders Importing commands
   [junit4]   2> 15639 T10 okma.MorphlineContext.importCommandBuilders Done importing commands
   [junit4]   2> 16026 T10 oasc.SolrResourceLoader.<init> new SolrResourceLoader for directory: '/mnt/ssd/jenkins/workspace/Lucene-Solr-trunk-Linux/solr/contrib/morphlines-core/src/test-files/solr/collection1/'
   [junit4]   2> 16062 T10 oasc.SolrConfig.initLibs Adding specified lib dirs to ClassLoader
   [junit4]   2> 16063 T10 oasc.SolrResourceLoader.addToClassLoader WARN Can't find (or read) directory to add to classloader: ../../../contrib/extraction/lib (resolved as: /mnt/ssd/jenkins/workspace/Lucene-Solr-trunk-Linux/solr/contrib/morphlines-core/src/test-files/solr/collection1/../../../contrib/extraction/lib).
   [junit4]   2> 16064 T10 oasc.SolrResourceLoader.addToClassLoader WARN Can't find (or read) directory to add to classloader: ../../../dist/ (resolved as: /mnt/ssd/jenkins/workspace/Lucene-Solr-trunk-Linux/solr/contrib/morphlines-core/src/test-files/solr/collection1/../../../dist).
   [junit4]   2> 16064 T10 oasc.SolrResourceLoader.addToClassLoader WARN Can't find (or read) directory to add to classloader: ../../../contrib/clustering/lib/ (resolved as: /mnt/ssd/jenkins/workspace/Lucene-Solr-trunk-Linux/solr/contrib/morphlines-core/src/test-files/solr/collection1/../../../contrib/clustering/lib).
   [junit4]   2> 16065 T10 oasc.SolrResourceLoader.addToClassLoader WARN Can't find (or read) directory to add to classloader: ../../../dist/ (resolved as: /mnt/ssd/jenkins/workspace/Lucene-Solr-trunk-Linux/solr/contrib/morphlines-core/src/test-files/solr/collection1/../../../dist).
   [junit4]   2> 16065 T10 oasc.SolrResourceLoader.addToClassLoader WARN Can't find (or read) directory to add to classloader: ../../../contrib/langid/lib/ (resolved as: /mnt/ssd/jenkins/workspace/Lucene-Solr-trunk-Linux/solr/contrib/morphlines-core/src/test-files/solr/collection1/../../../contrib/langid/lib).
   [junit4]   2> 16066 T10 oasc.SolrResourceLoader.addToClassLoader WARN Can't find (or read) directory to add to classloader: ../../../dist/ (resolved as: /mnt/ssd/jenkins/workspace/Lucene-Solr-trunk-Linux/solr/contrib/morphlines-core/src/test-files/solr/collection1/../../../dist).
   [junit4]   2> 16066 T10 oasc.SolrResourceLoader.addToClassLoader WARN Can't find (or read) directory to add to classloader: ../../../contrib/velocity/lib (resolved as: /mnt/ssd/jenkins/workspace/Lucene-Solr-trunk-Linux/solr/contrib/morphlines-core/src/test-files/solr/collection1/../../../contrib/velocity/lib).
   [junit4]   2> 16067 T10 oasc.SolrResourceLoader.addToClassLoader WARN Can't find (or read) directory to add to classloader: ../../../dist/ (resolved as: /mnt/ssd/jenkins/workspace/Lucene-Solr-trunk-Linux/solr/contrib/morphlines-core/src/test-files/solr/collection1/../../../dist).
   [junit4]   2> 16067 T10 oasc.SolrResourceLoader.addToClassLoader WARN Can't find (or read) directory to add to classloader: /non/existent/dir/yields/warning (resolved as: /non/existent/dir/yields/warning).
   [junit4]   2> 16109 T10 oasc.SolrConfig.<init> Using Lucene MatchVersion: LUCENE_5_0
   [junit4]   2> 16188 T10 oasc.SolrConfig.<init> Loaded SolrConfig: solrconfig.xml
   [junit4]   2> 16188 T10 oass.IndexSchema.readSchema Reading Solr Schema from schema.xml
   [junit4]   2> 16205 T10 oass.IndexSchema.readSchema [null] Schema name=example
   [junit4]   2> 16672 T10 oass.IndexSchema.readSchema unique key field: id
   [junit4]   2> 16693 T10 oass.FileExchangeRateProvider.reload Reloading exchange rates from file currency.xml
   [junit4]   2> 16698 T10 oass.FileExchangeRateProvider.reload Reloading exchange rates from file currency.xml
   [junit4]   2> 16739 T10 oasc.SolrResourceLoader.<init> new SolrResourceLoader for directory: '/mnt/ssd/jenkins/workspace/Lucene-Solr-trunk-Linux/solr/contrib/morphlines-core/src/test-files/solr/collection1/'
   [junit4]   2> 16766 T10 oasc.SolrConfig.initLibs Adding specified lib dirs to ClassLoader
   [junit4]   2> 16766 T10 oasc.SolrResourceLoader.addToClassLoader WARN Can't find (or read) directory to add to classloader: ../../../contrib/extraction/lib (resolved as: /mnt/ssd/jenkins/workspace/Lucene-Solr-trunk-Linux/solr/contrib/morphlines-core/src/test-files/solr/collection1/../../../contrib/extraction/lib).
   [junit4]   2> 16767 T10 oasc.SolrResourceLoader.addToClassLoader WARN Can't find (or read) directory to add to classloader: ../../../dist/ (resolved as: /mnt/ssd/jenkins/workspace/Lucene-Solr-trunk-Linux/solr/contrib/morphlines-core/src/test-files/solr/collection1/../../../dist).
   [junit4]   2> 16767 T10 oasc.SolrResourceLoader.addToClassLoader WARN Can't find (or read) directory to add to classloader: ../../../contrib/clustering/lib/ (resolved as: /mnt/ssd/jenkins/workspace/Lucene-Solr-trunk-Linux/solr/contrib/morphlines-core/src/test-files/solr/collection1/../../../contrib/clustering/lib).
   [junit4]   2> 16768 T10 oasc.SolrResourceLoader.addToClassLoader WARN Can't find (or read) directory to add to classloader: ../../../dist/ (resolved as: /mnt/ssd/jenkins/workspace/Lucene-Solr-trunk-Linux/solr/contrib/morphlines-core/src/test-files/solr/collection1/../../../dist).
   [junit4]   2> 16768 T10 oasc.SolrResourceLoader.addToClassLoader WARN Can't find (or read) directory to add to classloader: ../../../contrib/langid/lib/ (resolved as: /mnt/ssd/jenkins/workspace/Lucene-Solr-trunk-Linux/solr/contrib/morphlines-core/src/test-files/solr/collection1/../../../contrib/langid/lib).
   [junit4]   2> 16769 T10 oasc.SolrResourceLoader.addToClassLoader WARN Can't find (or read) directory to add to classloader: ../../../dist/ (resolved as: /mnt/ssd/jenkins/workspace/Lucene-Solr-trunk-Linux/solr/contrib/morphlines-core/src/test-files/solr/collection1/../../../dist).
   [junit4]   2> 16769 T10 oasc.SolrResourceLoader.addToClassLoader WARN Can't find (or read) directory to add to classloader: ../../../contrib/velocity/lib (resolved as: /mnt/ssd/jenkins/workspace/Lucene-Solr-trunk-Linux/solr/contrib/morphlines-core/src/test-files/solr/collection1/../../../contrib/velocity/lib).
   [junit4]   2> 16770 T10 oasc.SolrResourceLoader.addToClassLoader WARN Can't find (or read) directory to add to classloader: ../../../dist/ (resolved as: /mnt/ssd/jenkins/workspace/Lucene-Solr-trunk-Linux/solr/contrib/morphlines-core/src/test-files/solr/collection1/../../../dist).
   [junit4]   2> 16770 T10 oasc.SolrResourceLoader.addToClassLoader WARN Can't find (or read) directory to add to classloader: /non/existent/dir/yields/warning (resolved as: /non/existent/dir/yields/warning).
   [junit4]   2> 16808 T10 oasc.SolrConfig.<init> Using Lucene MatchVersion: LUCENE_5_0
   [junit4]   2> 16884 T10 oasc.SolrConfig.<init> Loaded SolrConfig: solrconfig.xml
   [junit4]   2> 16885 T10 oass.IndexSchema.readSchema Reading Solr Schema from schema.xml
   [junit4]   2> 16897 T10 oass.IndexSchema.readSchema [null] Schema name=example
   [junit4]   2> 17346 T10 oass.IndexSchema.readSchema unique key field: id
   [junit4]   2> 17367 T10 oass.FileExchangeRateProvider.reload Reloading exchange rates from file currency.xml
   [junit4]   2> 17372 T10 oass.FileExchangeRateProvider.reload Reloading exchange rates from file currency.xml
   [junit4]   2> ASYNC  NEW_CORE C3 name=collection1 org.apache.solr.core.SolrCore@51e7a255
   [junit4]   2> 17394 T10 C3 oasup.LogUpdateProcessor.finish [collection1] webapp=null path=/update params={} {deleteByQuery=*:* (-1467920993262501888)} 0 1
   [junit4]   2> 17395 T10 C3 oasu.DirectUpdateHandler2.commit start commit{,optimize=false,openSearcher=true,waitSearcher=true,expungeDeletes=false,softCommit=false,prepareCommit=false}
   [junit4]   2> 17396 T10 C3 oasu.DirectUpdateHandler2.commit No uncommitted changes. Skipping IW.commit.
   [junit4]   2> 17396 T10 C3 oasc.SolrCore.openNewSearcher SolrIndexSearcher has not changed - not re-opening: org.apache.solr.search.SolrIndexSearcher
   [junit4]   2> 17397 T10 C3 oasu.DirectUpdateHandler2.commit end_commit_flush
   [junit4]   2> 17397 T10 C3 oasup.LogUpdateProcessor.finish [collection1] webapp=null path=/update params={commit=true&softCommit=false&waitSearcher=true} {commit=} 0 2
   [junit4]   2> 17533 T10 C3 oasup.LogUpdateProcessor.finish [collection1] webapp=null path=/update params={} {add=[testJPEG_EXIF.jpg#0 (1467920993407205376)]} 0 5
   [junit4]   2> 17534 T10 C3 oasu.DirectUpdateHandler2.commit start commit{,optimize=false,openSearcher=true,waitSearcher=true,expungeDeletes=false,softCommit=true,prepareCommit=false}
   [junit4]   2> 17539 T10 C3 oass.SolrIndexSearcher.<init> Opening Searcher@10b04117[collection1] main
   [junit4]   2> 17540 T10 C3 oasu.DirectUpdateHandler2.commit end_commit_flush
   [junit4]   2> 17540 T12 oasc.QuerySenderListener.newSearcher QuerySenderListener sending requests to Searcher@10b04117[collection1] main{StandardDirectoryReader(segments_2:13:nrt _4(5.0):C1)}
   [junit4]   2> 17541 T12 oasc.QuerySenderListener.newSearcher QuerySenderListener done.
   [junit4]   2> 17541 T12 oasc.SolrCore.registerSearcher [collection1] Registered new searcher Searcher@10b04117[collection1] main{StandardDirectoryReader(segments_2:13:nrt _4(5.0):C1)}
   [junit4]   2> 17542 T10 C3 oasup.LogUpdateProcessor.finish [collection1] webapp=null path=/update params={commit=true&softCommit=true&waitSearcher=true} {commit=} 0 8
   [junit4]   2> 17543 T10 C3 oasc.SolrCore.execute [collection1] webapp=null path=/select params={q=*%3A*&rows=2147483647} hits=1 status=0 QTime=0 
   [junit4]   2> 17582 T10 C3 oasup.LogUpdateProcessor.finish [collection1] webapp=null path=/update params={} {add=[testJPEG_EXIF.jpg.gz#0 (1467920993458585600)]} 0 5
   [junit4]   2> 17583 T10 C3 oasu.DirectUpdateHandler2.commit start commit{,optimize=false,openSearcher=true,waitSearcher=true,expungeDeletes=false,softCommit=true,prepareCommit=false}
   [junit4]   2> 17587 T10 C3 oass.SolrIndexSearcher.<init> Opening Searcher@5118a73a[collection1] main
   [junit4]   2> 17588 T10 C3 oasu.DirectUpdateHandler2.commit end_commit_flush
   [junit4]   2> 17588 T12 oasc.QuerySenderListener.newSearcher QuerySenderListener sending requests to Searcher@5118a73a[collection1] main{StandardDirectoryReader(segments_2:15:nrt _4(5.0):C1 _5(5.0):C1)}
   [junit4]   2> 17589 T12 oasc.QuerySenderListener.newSearcher QuerySenderListener done.
   [junit4]   2> 17589 T12 oasc.SolrCore.registerSearcher [collection1] Registered new searcher Searcher@5118a73a[collection1] main{StandardDirectoryReader(segments_2:15:nrt _4(5.0):C1 _5(5.0):C1)}
   [junit4]   2> 17590 T10 C3 oasup.LogUpdateProcessor.finish [collection1] webapp=null path=/update params={commit=true&softCommit=true&waitSearcher=true} {commit=} 0 7
   [junit4]   2> 17591 T10 C3 oasc.SolrCore.execute [collection1] webapp=null path=/select params={q=*%3A*&rows=2147483647} hits=2 status=0 QTime=1 
   [junit4]   2> 17617 T10 C3 oasup.LogUpdateProcessor.finish [collection1] webapp=null path=/update params={} {add=[e5dd23ad-3e86-48ac-8b17-b325360b31dd#0 (1467920993496334336)]} 0 5
   [junit4]   2> 17618 T10 C3 oasu.DirectUpdateHandler2.commit start commit{,optimize=false,openSearcher=true,waitSearcher=true,expungeDeletes=false,softCommit=true,prepareCommit=false}
   [junit4]   2> 17623 T10 C3 oass.SolrIndexSearcher.<init> Opening Searcher@6dfdf179[collection1] main
   [junit4]   2> 17624 T10 C3 oasu.DirectUpdateHandler2.commit end_commit_flush
   [junit4]   2> 17624 T12 oasc.QuerySenderListener.newSearcher QuerySenderListener sending requests to Searcher@6dfdf179[collection1] main{StandardDirectoryReader(segments_2:17:nrt _4(5.0):C1 _5(5.0):C1 _6(5.0):C1)}
   [junit4]   2> 17625 T12 oasc.QuerySenderListener.newSearcher QuerySenderListener done.
   [junit4]   2> 17625 T12 oasc.SolrCore.registerSearcher [collection1] Registered new searcher Searcher@6dfdf179[collection1] main{StandardDirectoryReader(segments_2:17:nrt _4(5.0):C1 _5(5.0):C1 _6(5.0):C1)}
   [junit4]   2> 17627 T10 C3 oasup.LogUpdateProcessor.finish [collection1] webapp=null path=/update params={commit=true&softCommit=true&waitSearcher=true} {commit=} 0 9
   [junit4]   2> 17628 T10 C3 oasc.SolrCore.execute [collection1] webapp=null path=/select params={q=*%3A*&rows=2147483647} hits=3 status=0 QTime=0 
   [junit4]   2> 17628 T10 C3 oasu.DirectUpdateHandler2.commit start commit{,optimize=false,openSearcher=true,waitSearcher=true,expungeDeletes=false,softCommit=true,prepareCommit=false}
   [junit4]   2> 17629 T10 C3 oasc.SolrCore.openNewSearcher SolrIndexSearcher has not changed - not re-opening: org.apache.solr.search.SolrIndexSearcher
   [junit4]   2> 17629 T10 C3 oasu.DirectUpdateHandler2.commit end_commit_flush
   [junit4]   2> 17630 T10 C3 oasup.LogUpdateProcessor.finish [collection1] webapp=null path=/update params={commit=true&softCommit=true&waitSearcher=true} {commit=} 0 2
   [junit4]   2> 17630 T10 C3 oasc.SolrCore.execute [collection1] webapp=null path=/select params={q=*%3A*&rows=2147483647} hits=3 status=0 QTime=0 
   [junit4]   2> 17631 T10 oas.SolrTestCaseJ4.tearDown ###Ending testSolrCellJPGCompressed
   [junit4]   2> 17643 T10 oas.SolrTestCaseJ4.setUp ###Starting testSolrCellDocumentTypes2
   [junit4]   2> 17645 T10 C3 oass.SolrIndexSearcher.<init> Opening Searcher@5d086a3e[collection1] realtime
   [junit4]   2> 17646 T10 C3 oasup.LogUpdateProcessor.finish [collection1] webapp=null path=/update params={} {deleteByQuery=*:* (-1467920993525694464)} 0 2
   [junit4]   2> 17646 T10 C3 oasu.DirectUpdateHandler2.commit start commit{,optimize=false,openSearcher=true,waitSearcher=true,expungeDeletes=false,softCommit=false,prepareCommit=false}
   [junit4]   2> 17647 T10 C3 oasc.SolrDeletionPolicy.onCommit SolrDeletionPolicy.onCommit: commits: num=2
   [junit4]   2> 		commit{dir=MockDirectoryWrapper(RAMDirectory@1416e4cd lockFactory=NativeFSLockFactory@/mnt/ssd/jenkins/workspace/Lucene-Solr-trunk-Linux/solr/build/contrib/solr-morphlines-cell/test/J0/./solr.morphlines.cell.SolrCellMorphlineTest-553E8FCE4C45E8D-001/init-core-data-001/index),segFN=segments_2,generation=2}
   [junit4]   2> 		commit{dir=MockDirectoryWrapper(RAMDirectory@1416e4cd lockFactory=NativeFSLockFactory@/mnt/ssd/jenkins/workspace/Lucene-Solr-trunk-Linux/solr/build/contrib/solr-morphlines-cell/test/J0/./solr.morphlines.cell.SolrCellMorphlineTest-553E8FCE4C45E8D-001/init-core-data-001/index),segFN=segments_3,generation=3}
   [junit4]   2> 17648 T10 C3 oasc.SolrDeletionPolicy.updateCommits newest commit generation = 3
   [junit4]   2> 17648 T10 C3 oass.SolrIndexSearcher.<init> Opening Searcher@7cddbd0d[collection1] main
   [junit4]   2> 17649 T10 C3 oasu.DirectUpdateHandler2.commit end_commit_flush
   [junit4]   2> 17649 T12 oasc.QuerySenderListener.newSearcher QuerySenderListener sending requests to Searcher@7cddbd0d[collection1] main{StandardDirectoryReader(segments_2:19:nrt)}
   [junit4]   2> 17650 T12 oasc.QuerySenderListener.newSearcher QuerySenderListener done.
   [junit4]   2> 17650 T12 oasc.SolrCore.registerSearcher [collection1] Registered new searcher Searcher@7cddbd0d[collection1] main{StandardDirectoryReader(segments_2:19:nrt)}
   [junit4]   2> 17653 T10 C3 oasup.LogUpdateProcessor.finish [collection1] webapp=null path=/update params={commit=true&softCommit=false&waitSearcher=true} {commit=} 0 7
   [junit4]   2> 17678 T10 okma.MorphlineContext.importCommandBuilders Importing commands
   [junit4]   2> 18063 T10 okma.MorphlineContext.importCommandBuilders Done importing commands
   [junit4]   2> 18472 T10 oasc.SolrResourceLoader.<init> new SolrResourceLoader for directory: '/mnt/ssd/jenkins/workspace/Lucene-Solr-trunk-Linux/solr/contrib/morphlines-core/src/test-files/solr/collection1/'
   [junit4]   2> 18499 T10 oasc.SolrConfig.initLibs Adding specified lib dirs to ClassLoader
   [junit4]   2> 18499 T10 oasc.SolrResourceLoader.addToClassLoader WARN Can't find (or read) directory to add to classloader: ../../../contrib/extraction/lib (resolved as: /mnt/ssd/jenkins/workspace/Lucene-Solr-trunk-Linux/solr/contrib/morphlines-core/src/test-files/solr/collection1/../../../contrib/extraction/lib).
   [junit4]   2> 18500 T10 oasc.SolrResourceLoader.addToClassLoader WARN Can't find (or read) directory to add to classloader: ../../../dist/ (resolved as: /mnt/ssd/jenkins/workspace/Lucene-Solr-trunk-Linux/solr/contrib/morphlines-core/src/test-files/solr/collection1/../../../dist).
   [junit4]   2> 18500 T10 oasc.SolrResourceLoader.addToClassLoader WARN Can't find (or read) directory to add to classloader: ../../../contrib/clustering/lib/ (resolved as: /mnt/ssd/jenkins/workspace/Lucene-Solr-trunk-Linux/solr/contrib/morphlines-core/src/test-files/solr/collection1/../../../contrib/clustering/lib).
   [junit4]   2> 18501 T10 oasc.SolrResourceLoader.addToClassLoader WARN Can't find (or read) directory to add to classloader: ../../../dist/ (resolved as: /mnt/ssd/jenkins/workspace/Lucene-Solr-trunk-Linux/solr/contrib/morphlines-core/src/test-files/solr/collection1/../../../dist).
   [junit4]   2> 18501 T10 oasc.SolrResourceLoader.addToClassLoader WARN Can't find (or read) directory to add to classloader: ../../../contrib/langid/lib/ (resolved as: /mnt/ssd/jenkins/workspace/Lucene-Solr-trunk-Linux/solr/contrib/morphlines-core/src/test-files/solr/collection1/../../../contrib/langid/lib).
   [junit4]   2> 18502 T10 oasc.SolrResourceLoader.addToClassLoader WARN Can't find (or read) directory to add to classloader: ../../../dist/ (resolved as: /mnt/ssd/jenkins/workspace/Lucene-Solr-trunk-Linux/solr/contrib/morphlines-core/src/test-files/solr/collection1/../../../dist).
   [junit4]   2> 18502 T10 oasc.SolrResourceLoader.addToClassLoader WARN Can't find (or read) directory to add to classloader: ../../../contrib/velocity/lib (resolved as: /mnt/ssd/jenkins/workspace/Lucene-Solr-trunk-Linux/solr/contrib/morphlines-core/src/test-files/solr/collection1/../../../contrib/velocity/lib).
   [junit4]   2> 18503 T10 oasc.SolrResourceLoader.addToClassLoader WARN Can't find (or read) directory to add to classloader: ../../../dist/ (resolved as: /mnt/ssd/jenkins/workspace/Lucene-Solr-trunk-Linux/solr/contrib/morphlines-core/src/test-files/solr/collection1/../../../dist).
   [junit4]   2> 18503 T10 oasc.SolrResourceLoader.addToClassLoader WARN Can't find (or read) directory to add to classloader: /non/existent/dir/yields/warning (resolved as: /non/existent/dir/yields/warning).
   [junit4]   2> 18540 T10 oasc.SolrConfig.<init> Using Lucene MatchVersion: LUCENE_5_0
   [junit4]   2> 18610 T10 oasc.SolrConfig.<init> Loaded SolrConfig: solrconfig.xml
   [junit4]   2> 18611 T10 oass.IndexSchema.readSchema Reading Solr Schema from schema.xml
   [junit4]   2> 18623 T10 oass.IndexSchema.readSchema [null] Schema name=example
   [junit4]   2> 19070 T10 oass.IndexSchema.readSchema unique key field: id
   [junit4]   2> 19090 T10 oass.FileExchangeRateProvider.reload Reloading exchange rates from file currency.xml
   [junit4]   2> 19095 T10 oass.FileExchangeRateProvider.reload Reloading exchange rates from file currency.xml
   [junit4]   2> 19114 T10 oasc.SolrResourceLoader.<init> new SolrResourceLoader for directory: '/mnt/ssd/jenkins/workspace/Lucene-Solr-trunk-Linux/solr/contrib/morphlines-core/src/test-files/solr/collection1/'
   [junit4]   2> 19151 T10 oasc.SolrConfig.initLibs Adding specified lib dirs to ClassLoader
   [junit4]   2> 19152 T10 oasc.SolrResourceLoader.addToClassLoader WARN Can't find (or read) directory to add to classloader: ../../../contrib/extraction/lib (resolved as: /mnt/ssd/jenkins/workspace/Lucene-Solr-trunk-Linux/solr/contrib/morphlines-core/src/test-files/solr/collection1/../../../contrib/extraction/lib).
   [junit4]   2> 19152 T10 oasc.SolrResourceLoader.addToClassLoader WARN Can't find (or read) directory to add to classloader: ../../../dist/ (resolved as: /mnt/ssd/jenkins/workspace/Lucene-Solr-trunk-Linux/solr/contrib/morphlines-core/src/test-files/solr/collection1/../../../dist).
   [junit4]   2> 19153 T10 oasc.SolrResourceLoader.addToClassLoader WARN Can't find (or read) directory to add to classloader: ../../../contrib/clustering/lib/ (resolved as: /mnt/ssd/jenkins/workspace/Lucene-Solr-trunk-Linux/solr/contrib/morphlines-core/src/test-files/solr/collection1/../../../contrib/clustering/lib).
   [junit4]   2> 19153 T10 oasc.SolrResourceLoader.addToClassLoader WARN Can't find (or read) directory to add to classloader: ../../../dist/ (resolved as: /mnt/ssd/jenkins/workspace/Lucene-Solr-trunk-Linux/solr/contrib/morphlines-core/src/test-files/solr/collection1/../../../dist).
   [junit4]   2> 19154 T10 oasc.SolrResourceLoader.addToClassLoader WARN Can't find (or read) directory to add to classloader: ../../../contrib/langid/lib/ (resolved as: /mnt/ssd/jenkins/workspace/Lucene-Solr-trunk-Linux/solr/contrib/morphlines-core/src/test-files/solr/collection1/../../../contrib/langid/lib).
   [junit4]   2> 19154 T10 oasc.SolrResourceLoader.addToClassLoader WARN Can't find (or read) directory to add to classloader: ../../../dist/ (resolved as: /mnt/ssd/jenkins/workspace/Lucene-Solr-trunk-Linux/solr/contrib/morphlines-core/src/test-files/solr/collection1/../../../dist).
   [junit4]   2> 19155 T10 oasc.SolrResourceLoader.addToClassLoader WARN Can't find (or read) directory to add to classloader: ../../../contrib/velocity/lib (resolved as: /mnt/ssd/jenkins/workspace/Lucene-Solr-trunk-Linux/solr/contrib/morphlines-core/src/test-files/solr/collection1/../../../contrib/velocity/lib).
   [junit4]   2> 19155 T10 oasc.SolrResourceLoader.addToClassLoader WARN Can't find (or read) directory to add to classloader: ../../../dist/ (resolved as: /mnt/ssd/jenkins/workspace/Lucene-Solr-trunk-Linux/solr/contrib/morphlines-core/src/test-files/solr/collection1/../../../dist).
   [junit4]   2> 19156 T10 oasc.SolrResourceLoader.addToClassLoader WARN Can't find (or read) directory to add to classloader: /non/existent/dir/yields/warning (resolved as: /non/existent/dir/yields/warning).
   [junit4]   2> 19193 T10 oasc.SolrConfig.<init> Using Lucene MatchVersion: LUCENE_5_0
   [junit4]   2> 19266 T10 oasc.SolrConfig.<init> Loaded SolrConfig: solrconfig.xml
   [junit4]   2> 19267 T10 oass.IndexSchema.readSchema Reading Solr Schema from schema.xml
   [junit4]   2> 19277 T10 oass.IndexSchema.readSchema [null] Schema name=example
   [junit4]   2> 19714 T10 oass.IndexSchema.readSchema unique key field: id
   [junit4]   2> 19732 T10 oass.FileExchangeRateProvider.reload Reloading exchange rates from file currency.xml
   [junit4]   2> 19737 T10 oass.FileExchangeRateProvider.reload Reloading exchange rates from file currency.xml
   [junit4]   2> 19756 T10 oasc.SolrResourceLoader.<init> new SolrResourceLoader for directory: '/mnt/ssd/jenkins/workspace/Lucene-Solr-trunk-Linux/solr/contrib/morphlines-core/src/test-files/solr/collection1/'
   [junit4]   2> 19782 T10 oasc.SolrConfig.initLibs Adding specified lib dirs to ClassLoader
   [junit4]   2> 19783 T10 oasc.SolrResourceLoader.addToClassLoader WARN Can't find (or read) directory to add to classloader: ../../../contrib/extraction/lib (resolved as: /mnt/ssd/jenkins/workspace/Lucene-Solr-trunk-Linux/solr/contrib/morphlines-core/src/test-files/solr/collection1/../../../contrib/extraction/lib).
   [junit4]   2> 19784 T10 oasc.SolrResourceLoader.addToClassLoader WARN Can't find (or read) directory to add to classloader: ../../../dist/ (resolved as: /mnt/ssd/jenkins/workspace/Lucene-Solr-trunk-Linux/solr/contrib/morphlines-core/src/test-files/solr/collection1/../../../dist).
   [junit4]   2> 19784 T10 oasc.SolrResourceLoader.addToClassLoader WARN Can't find (or read) directory to add to classloader: ../../../contrib/clustering/lib/ (resolved as: /mnt/ssd/jenkins/workspace/Lucene-Solr-trunk-Linux/solr/contrib/morphlines-core/src/test-files/solr/collection1/../../../contrib/clustering/lib).
   [junit4]   2> 19784 T10 oasc.SolrResourceLoader.addToClassLoader WARN Can't find (or read) directory to add to classloader: ../../../dist/ (resolved as: /mnt/ssd/jenkins/workspace/Lucene-Solr-trunk-Linux/solr/contrib/morphlines-core/src/test-files/solr/collection1/../../../dist).
   [junit4]   2> 19785 T10 oasc.SolrResourceLoader.addToClassLoader WARN Can't find (or read) directory to add to classloader: ../../../contrib/langid/lib/ (resolved as: /mnt/ssd/jenkins/workspace/Lucene-Solr-trunk-Linux/solr/contrib/morphlines-core/src/test-files/solr/collection1/../../../contrib/langid/lib).
   [junit4]   2> 19785 T10 oasc.SolrResourceLoader.addToClassLoader WARN Can't find (or read) directory to add to classloader: ../../../dist/ (resolved as: /mnt/ssd/jenkins/workspace/Lucene-Solr-trunk-Linux/solr/contrib/morphlines-core/src/test-files/solr/collection1/../../../dist).
   [junit4]   2> 19786 T10 oasc.SolrResourceLoader.addToClassLoader WARN Can't find (or read) directory to add to classloader: ../../../contrib/velocity/lib (resolved as: /mnt/ssd/jenkins/workspace/Lucene-Solr-trunk-Linux/solr/contrib/morphlines-core/src/test-files/solr/collection1/../../../contrib/velocity/lib).
   [junit4]   2> 19786 T10 oasc.SolrResourceLoader.addToClassLoader WARN Can't find (or read) directory to add to classloader: ../../../dist/ (resolved as: /mnt/ssd/jenkins/workspace/Lucene-Solr-trunk-Linux/solr/contrib/morphlines-core/src/test-files/solr/collection1/../../../dist).
   [junit4]   2> 19787 T10 oasc.SolrResourceLoader.addToClassLoader WARN Can't find (or read) directory to add to classloader: /non/existent/dir/yields/warning (resolved as: /non/existent/dir/yields/warning).
   [junit4]   2> 19828 T10 oasc.SolrConfig.<init> Using Lucene MatchVersion: LUCENE_5_0
   [junit4]   2> 19899 T10 oasc.SolrConfig.<init> Loaded SolrConfig: solrconfig.xml
   [junit4]   2> 19900 T10 oass.IndexSchema.readSchema Reading Solr Schema from schema.xml
   [junit4]   2> 19909 T10 oass.IndexSchema.readSchema [null] Schema name=example
   [junit4]   2> 20322 T10 oass.IndexSchema.readSchema unique key field: id
   [junit4]   2> 20346 T10 oass.FileExchangeRateProvider.reload Reloading exchange rates from file currency.xml
   [junit4]   2> 20352 T10 oass.FileExchangeRateProvider.reload Reloading exchange rates from file currency.xml
   [junit4]   2> 20382 T10 oasc.SolrResourceLoader.<init> new SolrResourceLoader for directory: '/mnt/ssd/jenkins/workspace/Lucene-Solr-trunk-Linux/solr/contrib/morphlines-core/src/test-files/solr/collection1/'
   [junit4]   2> 20405 T10 oasc.SolrConfig.initLibs Adding specified lib dirs to ClassLoader
   [junit4]   2> 20406 T10 oasc.SolrResourceLoader.addToClassLoader WARN Can't find (or read) directory to add to classloader: ../../../contrib/extraction/lib (resolved as: /mnt/ssd/jenkins/workspace/Lucene-Solr-trunk-Linux/solr/contrib/morphlines-core/src/test-files/solr/collection1/../../../contrib/extraction/lib).
   [junit4]   2> 20406 T10 oasc.SolrResourceLoader.addToClassLoader WARN Can't find (or read) directory to add to classloader: ../../../dist/ (resolved as: /mnt/ssd/jenkins/workspace/Lucene-Solr-trunk-Linux/solr/contrib/morphlines-core/src/test-files/solr/collection1/../../../dist).
   [junit4]   2> 20407 T10 oasc.SolrResourceLoader.addToClassLoader WARN Can't find (or read) directory to add to classloader: ../../../contrib/clustering/lib/ (resolved as: /mnt/ssd/jenkins/workspace/Lucene-Solr-trunk-Linux/solr/contrib/morphlines-core/src/test-files/solr/collection1/../../../contrib/clustering/lib).
   [junit4]   2> 20407 T10 oasc.SolrResourceLoader.addToClassLoader WARN Can't find (or read) directory to add to classloader: ../../../dist/ (resolved as: /mnt/ssd/jenkins/workspace/Lucene-Solr-trunk-Linux/solr/contrib/morphlines-core/src/test-files/solr/collection1/../../../dist).
   [junit4]   2> 20408 T10 oasc.SolrResourceLoader.addToClassLoader WARN Can't find (or read) directory to add to classloader: ../../../contrib/langid/lib/ (resolved as: /mnt/ssd/jenkins/workspace/Lucene-Solr-trunk-Linux/solr/contrib/morphlines-core/src/test-files/solr/collection1/../../../contrib/langid/lib).
   [junit4]   2> 20408 T10 oasc.SolrResourceLoader.addToClassLoader WARN Can't find (or read) directory to add to classloader: ../../../dist/ (resolved as: /mnt/ssd/jenkins/workspace/Lucene-Solr-trunk-Linux/solr/contrib/morphlines-core/src/test-files/solr/collection1/../../../dist).
   [junit4]   2> 20409 T10 oasc.SolrResourceLoader.addToClassLoader WARN Can't find (or read) directory to add to classloader: ../../../contrib/velocity/lib (resolved as: /mnt/ssd/jenkins/workspace/Lucene-Solr-trunk-Linux/solr/contrib/morphlines-core/src/test-files/solr/collection1/../../../contrib/velocity/lib).
   [junit4]   2> 20409 T10 oasc.SolrResourceLoader.addToClassLoader WARN Can't find (or read) directory to add to classloader: ../../../dist/ (resolved as: /mnt/ssd/jenkins/workspace/Lucene-Solr-trunk-Linux/solr/contrib/morphlines-core/src/test-files/solr/collection1/../../../dist).
   [junit4]   2> 20410 T10 oasc.SolrResourceLoader.addToClassLoader WARN Can't find (or read) directory to add to classloader: /non/existent/dir/yields/warning (resolved as: /non/existent/dir/yields/warning).
   [junit4]   2> 20443 T10 oasc.SolrConfig.<init> Using Lucene MatchVersion: LUCENE_5_0
   [junit4]   2> 20512 T10 oasc.SolrConfig.<init> Loaded SolrConfig: solrconfig.xml
   [junit4]   2> 20512 T10 oass.IndexSchema.readSchema Reading Solr Schema from schema.xml
   [junit4]   2> 20521 T10 oass.IndexSchema.readSchema [null] Schema name=example
   [junit4]   2> 20927 T10 oass.IndexSchema.readSchema unique key field: id
   [junit4]   2> 20943 T10 oass.FileExchangeRateProvider.reload Reloading exchange rates from file currency.xml
   [junit4]   2> 20947 T10 oass.FileExchangeRateProvider.reload Reloading exchange rates from file currency.xml
   [junit4]   2> 20968 T10 oasc.SolrResourceLoader.<init> new SolrResourceLoader for directory: '/mnt/ssd/jenkins/workspace/Lucene-Solr-trunk-Linux/solr/contrib/morphlines-core/src/test-files/solr/collection1/'
   [junit4]   2> 20992 T10 oasc.SolrConfig.initLibs Adding specified lib dirs to ClassLoader
   [junit4]   2> 20992 T10 oasc.SolrResourceLoader.addToClassLoader WARN Can't find (or read) directory t

[...truncated too long message...]

../../dist/ (resolved as: /mnt/ssd/jenkins/workspace/Lucene-Solr-trunk-Linux/solr/contrib/morphlines-core/src/test-files/solr/collection1/../../../dist).
   [junit4]   2> 24297 T10 oasc.SolrResourceLoader.addToClassLoader WARN Can't find (or read) directory to add to classloader: /non/existent/dir/yields/warning (resolved as: /non/existent/dir/yields/warning).
   [junit4]   2> 24329 T10 oasc.SolrConfig.<init> Using Lucene MatchVersion: LUCENE_5_0
   [junit4]   2> 24390 T10 oasc.SolrConfig.<init> Loaded SolrConfig: solrconfig.xml
   [junit4]   2> 24391 T10 oass.IndexSchema.readSchema Reading Solr Schema from schema.xml
   [junit4]   2> 24399 T10 oass.IndexSchema.readSchema [null] Schema name=example
   [junit4]   2> 24812 T10 oass.IndexSchema.readSchema unique key field: id
   [junit4]   2> 24828 T10 oass.FileExchangeRateProvider.reload Reloading exchange rates from file currency.xml
   [junit4]   2> 24832 T10 oass.FileExchangeRateProvider.reload Reloading exchange rates from file currency.xml
   [junit4]   2> ASYNC  NEW_CORE C5 name=collection1 org.apache.solr.core.SolrCore@51e7a255
   [junit4]   2> 24853 T10 C5 oasup.LogUpdateProcessor.finish [collection1] webapp=null path=/update params={} {deleteByQuery=*:* (-1467921001083830272)} 0 1
   [junit4]   2> 24854 T10 C5 oasu.DirectUpdateHandler2.commit start commit{,optimize=false,openSearcher=true,waitSearcher=true,expungeDeletes=false,softCommit=false,prepareCommit=false}
   [junit4]   2> 24854 T10 C5 oasu.DirectUpdateHandler2.commit No uncommitted changes. Skipping IW.commit.
   [junit4]   2> 24854 T10 C5 oasc.SolrCore.openNewSearcher SolrIndexSearcher has not changed - not re-opening: org.apache.solr.search.SolrIndexSearcher
   [junit4]   2> 24855 T10 C5 oasu.DirectUpdateHandler2.commit end_commit_flush
   [junit4]   2> 24855 T10 C5 oasup.LogUpdateProcessor.finish [collection1] webapp=null path=/update params={commit=true&softCommit=false&waitSearcher=true} {commit=} 0 2
   [junit4]   2> 24866 T10 C5 oasup.LogUpdateProcessor.finish [collection1] webapp=null path=/update params={} {add=[testXML2.xml#0 (1467921001097461760)]} 0 2
   [junit4]   2> 24867 T10 C5 oasu.DirectUpdateHandler2.commit start commit{,optimize=false,openSearcher=true,waitSearcher=true,expungeDeletes=false,softCommit=true,prepareCommit=false}
   [junit4]   2> 24871 T10 C5 oass.SolrIndexSearcher.<init> Opening Searcher@7a47dfaa[collection1] main
   [junit4]   2> 24872 T10 C5 oasu.DirectUpdateHandler2.commit end_commit_flush
   [junit4]   2> 24872 T12 oasc.QuerySenderListener.newSearcher QuerySenderListener sending requests to Searcher@7a47dfaa[collection1] main{StandardDirectoryReader(segments_4:29:nrt _a(5.0):C1)}
   [junit4]   2> 24873 T12 oasc.QuerySenderListener.newSearcher QuerySenderListener done.
   [junit4]   2> 24873 T12 oasc.SolrCore.registerSearcher [collection1] Registered new searcher Searcher@7a47dfaa[collection1] main{StandardDirectoryReader(segments_4:29:nrt _a(5.0):C1)}
   [junit4]   2> 24874 T10 C5 oasup.LogUpdateProcessor.finish [collection1] webapp=null path=/update params={commit=true&softCommit=true&waitSearcher=true} {commit=} 0 7
   [junit4]   2> 24875 T10 C5 oasc.SolrCore.execute [collection1] webapp=null path=/select params={q=*%3A*&rows=2147483647} hits=1 status=0 QTime=1 
   [junit4]   2> 24876 T10 C5 oasu.DirectUpdateHandler2.commit start commit{,optimize=false,openSearcher=true,waitSearcher=true,expungeDeletes=false,softCommit=true,prepareCommit=false}
   [junit4]   2> 24876 T10 C5 oasc.SolrCore.openNewSearcher SolrIndexSearcher has not changed - not re-opening: org.apache.solr.search.SolrIndexSearcher
   [junit4]   2> 24877 T10 C5 oasu.DirectUpdateHandler2.commit end_commit_flush
   [junit4]   2> 24877 T10 C5 oasup.LogUpdateProcessor.finish [collection1] webapp=null path=/update params={commit=true&softCommit=true&waitSearcher=true} {commit=} 0 1
   [junit4]   2> 24878 T10 C5 oasc.SolrCore.execute [collection1] webapp=null path=/select params={q=*%3A*&rows=2147483647} hits=1 status=0 QTime=1 
   [junit4]   2> 24878 T10 oas.SolrTestCaseJ4.tearDown ###Ending testSolrCellXML
   [junit4]   2> 24881 T10 oas.SolrTestCaseJ4.deleteCore ###deleteCore
   [junit4]   2> 24882 T10 oasc.CoreContainer.shutdown Shutting down CoreContainer instance=2077661395
   [junit4]   2> 24882 T10 oasc.SolrCore.close [collection1]  CLOSING SolrCore org.apache.solr.core.SolrCore@51e7a255
   [junit4]   2> 24883 T10 oasu.DirectUpdateHandler2.close closing DirectUpdateHandler2{commits=22,autocommit maxTime=60000ms,autocommits=0,soft autocommit maxTime=1000ms,soft autocommits=0,optimizes=0,rollbacks=0,expungeDeletes=0,docsPending=1,adds=0,deletesById=0,deletesByQuery=0,errors=0,cumulative_adds=11,cumulative_deletesById=0,cumulative_deletesByQuery=9,cumulative_errors=0,transaction_logs_total_size=33595,transaction_logs_total_number=9}
   [junit4]   2> 24884 T10 oasu.SolrCoreState.decrefSolrCoreState Closing SolrCoreState
   [junit4]   2> 24884 T10 oasu.DefaultSolrCoreState.closeIndexWriter SolrCoreState ref count has reached 0 - closing IndexWriter
   [junit4]   2> 24884 T10 oasu.DefaultSolrCoreState.closeIndexWriter closing IndexWriter with IndexWriterCloser
   [junit4]   2> 24885 T10 C5 oasu.DirectUpdateHandler2.closeWriter Committing on IndexWriter close.
   [junit4]   2> 24886 T10 C5 oasc.SolrDeletionPolicy.onCommit SolrDeletionPolicy.onCommit: commits: num=2
   [junit4]   2> 		commit{dir=MockDirectoryWrapper(RAMDirectory@1416e4cd lockFactory=NativeFSLockFactory@/mnt/ssd/jenkins/workspace/Lucene-Solr-trunk-Linux/solr/build/contrib/solr-morphlines-cell/test/J0/./solr.morphlines.cell.SolrCellMorphlineTest-553E8FCE4C45E8D-001/init-core-data-001/index),segFN=segments_4,generation=4}
   [junit4]   2> 		commit{dir=MockDirectoryWrapper(RAMDirectory@1416e4cd lockFactory=NativeFSLockFactory@/mnt/ssd/jenkins/workspace/Lucene-Solr-trunk-Linux/solr/build/contrib/solr-morphlines-cell/test/J0/./solr.morphlines.cell.SolrCellMorphlineTest-553E8FCE4C45E8D-001/init-core-data-001/index),segFN=segments_5,generation=5}
   [junit4]   2> 24886 T10 C5 oasc.SolrDeletionPolicy.updateCommits newest commit generation = 5
   [junit4]   2> 24888 T10 oasc.SolrCore.closeSearcher [collection1] Closing main searcher on request.
   [junit4]   2> 24888 T10 oasc.CachingDirectoryFactory.close Closing MockDirectoryFactory - 2 directories currently being tracked
   [junit4]   2> 24889 T10 oasc.CachingDirectoryFactory.closeCacheValue looking to close /mnt/ssd/jenkins/workspace/Lucene-Solr-trunk-Linux/solr/build/contrib/solr-morphlines-cell/test/J0/./solr.morphlines.cell.SolrCellMorphlineTest-553E8FCE4C45E8D-001/init-core-data-001 [CachedDir<<refCount=0;path=/mnt/ssd/jenkins/workspace/Lucene-Solr-trunk-Linux/solr/build/contrib/solr-morphlines-cell/test/J0/./solr.morphlines.cell.SolrCellMorphlineTest-553E8FCE4C45E8D-001/init-core-data-001;done=false>>]
   [junit4]   2> 24889 T10 oasc.CachingDirectoryFactory.close Closing directory: /mnt/ssd/jenkins/workspace/Lucene-Solr-trunk-Linux/solr/build/contrib/solr-morphlines-cell/test/J0/./solr.morphlines.cell.SolrCellMorphlineTest-553E8FCE4C45E8D-001/init-core-data-001
   [junit4]   2> 24890 T10 oasc.CachingDirectoryFactory.closeCacheValue looking to close /mnt/ssd/jenkins/workspace/Lucene-Solr-trunk-Linux/solr/build/contrib/solr-morphlines-cell/test/J0/./solr.morphlines.cell.SolrCellMorphlineTest-553E8FCE4C45E8D-001/init-core-data-001/index [CachedDir<<refCount=0;path=/mnt/ssd/jenkins/workspace/Lucene-Solr-trunk-Linux/solr/build/contrib/solr-morphlines-cell/test/J0/./solr.morphlines.cell.SolrCellMorphlineTest-553E8FCE4C45E8D-001/init-core-data-001/index;done=false>>]
   [junit4]   2> 24890 T10 oasc.CachingDirectoryFactory.close Closing directory: /mnt/ssd/jenkins/workspace/Lucene-Solr-trunk-Linux/solr/build/contrib/solr-morphlines-cell/test/J0/./solr.morphlines.cell.SolrCellMorphlineTest-553E8FCE4C45E8D-001/init-core-data-001/index
   [junit4]   2> NOTE: leaving temporary files on disk at: /mnt/ssd/jenkins/workspace/Lucene-Solr-trunk-Linux/solr/build/contrib/solr-morphlines-cell/test/J0/./solr.morphlines.cell.SolrCellMorphlineTest-553E8FCE4C45E8D-001
   [junit4]   2> NOTE: test params are: codec=Lucene42, sim=DefaultSimilarity, locale=hi_IN, timezone=Atlantic/Canary
   [junit4]   2> NOTE: Linux 3.8.0-39-generic amd64/Oracle Corporation 1.7.0_55 (64-bit)/cpus=8,threads=1,free=102795992,total=285212672
   [junit4]   2> NOTE: All tests run in this JVM: [SolrCellMorphlineTest]
   [junit4] Completed in 25.08s, 5 tests, 2 failures <<< FAILURES!

[...truncated 10 lines...]
BUILD FAILED
/mnt/ssd/jenkins/workspace/Lucene-Solr-trunk-Linux/build.xml:467: The following error occurred while executing this line:
/mnt/ssd/jenkins/workspace/Lucene-Solr-trunk-Linux/build.xml:447: The following error occurred while executing this line:
/mnt/ssd/jenkins/workspace/Lucene-Solr-trunk-Linux/build.xml:45: The following error occurred while executing this line:
/mnt/ssd/jenkins/workspace/Lucene-Solr-trunk-Linux/extra-targets.xml:37: The following error occurred while executing this line:
/mnt/ssd/jenkins/workspace/Lucene-Solr-trunk-Linux/solr/build.xml:209: The following error occurred while executing this line:
/mnt/ssd/jenkins/workspace/Lucene-Solr-trunk-Linux/solr/common-build.xml:440: The following error occurred while executing this line:
/mnt/ssd/jenkins/workspace/Lucene-Solr-trunk-Linux/solr/common-build.xml:496: The following error occurred while executing this line:
/mnt/ssd/jenkins/workspace/Lucene-Solr-trunk-Linux/lucene/common-build.xml:1296: The following error occurred while executing this line:
/mnt/ssd/jenkins/workspace/Lucene-Solr-trunk-Linux/lucene/common-build.xml:920: There were test failures: 1 suite, 5 tests, 2 failures

Total time: 60 minutes 50 seconds
Build step 'Invoke Ant' marked build as failure
Description set: Java: 64bit/jdk1.7.0_55 -XX:+UseCompressedOops -XX:+UseParallelGC
Archiving artifacts
Recording test results
Email was triggered for: Failure
Sending email for trigger: Failure



Mime
View raw message