lucene-dev mailing list archives

Site index · List index
Message view « Date » · « Thread »
Top « Date » · « Thread »
From buil...@flonkings.com
Subject [JENKINS] Lucene-4x-Linux-Java7-64-test-only - Build # 20274 - Failure!
Date Thu, 01 May 2014 04:44:11 GMT
Build: builds.flonkings.com/job/Lucene-4x-Linux-Java7-64-test-only/20274/

1 tests failed.
REGRESSION:  org.apache.lucene.index.TestIndexWriter.testManyFields

Error Message:
3.x codec does not support payloads on vectors!

Stack Trace:
java.lang.UnsupportedOperationException: 3.x codec does not support payloads on vectors!
	at __randomizedtesting.SeedInfo.seed([A7DEAB3AF9A18B1F:8FE0FDA4EBDC8889]:0)
	at org.apache.lucene.codecs.lucene3x.PreFlexRWTermVectorsWriter.startField(PreFlexRWTermVectorsWriter.java:82)
	at org.apache.lucene.index.TermVectorsConsumerPerField.finishDocument(TermVectorsConsumerPerField.java:83)
	at org.apache.lucene.index.TermVectorsConsumer.finishDocument(TermVectorsConsumer.java:112)
	at org.apache.lucene.index.TermsHash.finishDocument(TermsHash.java:93)
	at org.apache.lucene.index.DefaultIndexingChain.processDocument(DefaultIndexingChain.java:345)
	at org.apache.lucene.index.DocumentsWriterPerThread.updateDocument(DocumentsWriterPerThread.java:222)
	at org.apache.lucene.index.DocumentsWriter.updateDocument(DocumentsWriter.java:459)
	at org.apache.lucene.index.IndexWriter.updateDocument(IndexWriter.java:1541)
	at org.apache.lucene.index.IndexWriter.addDocument(IndexWriter.java:1211)
	at org.apache.lucene.index.IndexWriter.addDocument(IndexWriter.java:1192)
	at org.apache.lucene.index.TestIndexWriter.testManyFields(TestIndexWriter.java:275)
	at sun.reflect.NativeMethodAccessorImpl.invoke0(Native Method)
	at sun.reflect.NativeMethodAccessorImpl.invoke(NativeMethodAccessorImpl.java:57)
	at sun.reflect.DelegatingMethodAccessorImpl.invoke(DelegatingMethodAccessorImpl.java:43)
	at java.lang.reflect.Method.invoke(Method.java:606)
	at com.carrotsearch.randomizedtesting.RandomizedRunner.invoke(RandomizedRunner.java:1618)
	at com.carrotsearch.randomizedtesting.RandomizedRunner$6.evaluate(RandomizedRunner.java:827)
	at com.carrotsearch.randomizedtesting.RandomizedRunner$7.evaluate(RandomizedRunner.java:863)
	at com.carrotsearch.randomizedtesting.RandomizedRunner$8.evaluate(RandomizedRunner.java:877)
	at org.apache.lucene.util.TestRuleSetupTeardownChained$1.evaluate(TestRuleSetupTeardownChained.java:50)
	at org.apache.lucene.util.TestRuleFieldCacheSanity$1.evaluate(TestRuleFieldCacheSanity.java:51)
	at org.apache.lucene.util.AbstractBeforeAfterRule$1.evaluate(AbstractBeforeAfterRule.java:46)
	at com.carrotsearch.randomizedtesting.rules.SystemPropertiesInvariantRule$1.evaluate(SystemPropertiesInvariantRule.java:55)
	at org.apache.lucene.util.TestRuleThreadAndTestName$1.evaluate(TestRuleThreadAndTestName.java:49)
	at org.apache.lucene.util.TestRuleIgnoreAfterMaxFailures$1.evaluate(TestRuleIgnoreAfterMaxFailures.java:65)
	at org.apache.lucene.util.TestRuleMarkFailure$1.evaluate(TestRuleMarkFailure.java:48)
	at com.carrotsearch.randomizedtesting.rules.StatementAdapter.evaluate(StatementAdapter.java:36)
	at com.carrotsearch.randomizedtesting.ThreadLeakControl$StatementRunner.run(ThreadLeakControl.java:360)
	at com.carrotsearch.randomizedtesting.ThreadLeakControl.forkTimeoutingTask(ThreadLeakControl.java:793)
	at com.carrotsearch.randomizedtesting.ThreadLeakControl$3.evaluate(ThreadLeakControl.java:453)
	at com.carrotsearch.randomizedtesting.RandomizedRunner.runSingleTest(RandomizedRunner.java:836)
	at com.carrotsearch.randomizedtesting.RandomizedRunner$3.evaluate(RandomizedRunner.java:738)
	at com.carrotsearch.randomizedtesting.RandomizedRunner$4.evaluate(RandomizedRunner.java:772)
	at com.carrotsearch.randomizedtesting.RandomizedRunner$5.evaluate(RandomizedRunner.java:783)
	at org.apache.lucene.util.AbstractBeforeAfterRule$1.evaluate(AbstractBeforeAfterRule.java:46)
	at org.apache.lucene.util.TestRuleStoreClassName$1.evaluate(TestRuleStoreClassName.java:42)
	at com.carrotsearch.randomizedtesting.rules.SystemPropertiesInvariantRule$1.evaluate(SystemPropertiesInvariantRule.java:55)
	at com.carrotsearch.randomizedtesting.rules.NoShadowingOrOverridesOnMethodsRule$1.evaluate(NoShadowingOrOverridesOnMethodsRule.java:39)
	at com.carrotsearch.randomizedtesting.rules.NoShadowingOrOverridesOnMethodsRule$1.evaluate(NoShadowingOrOverridesOnMethodsRule.java:39)
	at com.carrotsearch.randomizedtesting.rules.StatementAdapter.evaluate(StatementAdapter.java:36)
	at com.carrotsearch.randomizedtesting.rules.StatementAdapter.evaluate(StatementAdapter.java:36)
	at com.carrotsearch.randomizedtesting.rules.StatementAdapter.evaluate(StatementAdapter.java:36)
	at org.apache.lucene.util.TestRuleAssertionsRequired$1.evaluate(TestRuleAssertionsRequired.java:43)
	at org.apache.lucene.util.TestRuleMarkFailure$1.evaluate(TestRuleMarkFailure.java:48)
	at org.apache.lucene.util.TestRuleIgnoreAfterMaxFailures$1.evaluate(TestRuleIgnoreAfterMaxFailures.java:65)
	at org.apache.lucene.util.TestRuleIgnoreTestSuites$1.evaluate(TestRuleIgnoreTestSuites.java:55)
	at com.carrotsearch.randomizedtesting.rules.StatementAdapter.evaluate(StatementAdapter.java:36)
	at com.carrotsearch.randomizedtesting.ThreadLeakControl$StatementRunner.run(ThreadLeakControl.java:360)
	at java.lang.Thread.run(Thread.java:724)




Build Log:
[...truncated 414 lines...]
   [junit4] Suite: org.apache.lucene.index.TestIndexWriter
   [junit4]   2> NOTE: reproduce with: ant test  -Dtestcase=TestIndexWriter -Dtests.method=testManyFields
-Dtests.seed=A7DEAB3AF9A18B1F -Dtests.slow=true -Dtests.locale=es -Dtests.timezone=Australia/Tasmania
-Dtests.file.encoding=ISO-8859-1
   [junit4] ERROR   0.49s J0 | TestIndexWriter.testManyFields <<<
   [junit4]    > Throwable #1: java.lang.UnsupportedOperationException: 3.x codec does
not support payloads on vectors!
   [junit4]    > 	at __randomizedtesting.SeedInfo.seed([A7DEAB3AF9A18B1F:8FE0FDA4EBDC8889]:0)
   [junit4]    > 	at org.apache.lucene.codecs.lucene3x.PreFlexRWTermVectorsWriter.startField(PreFlexRWTermVectorsWriter.java:82)
   [junit4]    > 	at org.apache.lucene.index.TermVectorsConsumerPerField.finishDocument(TermVectorsConsumerPerField.java:83)
   [junit4]    > 	at org.apache.lucene.index.TermVectorsConsumer.finishDocument(TermVectorsConsumer.java:112)
   [junit4]    > 	at org.apache.lucene.index.TermsHash.finishDocument(TermsHash.java:93)
   [junit4]    > 	at org.apache.lucene.index.DefaultIndexingChain.processDocument(DefaultIndexingChain.java:345)
   [junit4]    > 	at org.apache.lucene.index.DocumentsWriterPerThread.updateDocument(DocumentsWriterPerThread.java:222)
   [junit4]    > 	at org.apache.lucene.index.DocumentsWriter.updateDocument(DocumentsWriter.java:459)
   [junit4]    > 	at org.apache.lucene.index.IndexWriter.updateDocument(IndexWriter.java:1541)
   [junit4]    > 	at org.apache.lucene.index.IndexWriter.addDocument(IndexWriter.java:1211)
   [junit4]    > 	at org.apache.lucene.index.IndexWriter.addDocument(IndexWriter.java:1192)
   [junit4]    > 	at org.apache.lucene.index.TestIndexWriter.testManyFields(TestIndexWriter.java:275)
   [junit4]    > 	at java.lang.Thread.run(Thread.java:724)
   [junit4]   2> NOTE: leaving temporary files on disk at: /var/lib/jenkins/workspace/Lucene-4x-Linux-Java7-64-test-only/checkout/lucene/build/core/test/J0/./lucene.index.TestIndexWriter-A7DEAB3AF9A18B1F-001
   [junit4]   2> NOTE: test params are: codec=Lucene3x, sim=RandomSimilarityProvider(queryNorm=false,coord=crazy):
{c47=DFR GL3(800.0), b26=DFR GL1, f32=DFR I(ne)B2, a4=IB LL-L2, b5=DFR G1, f8=DFR I(F)LZ(0.3),
f46=DFR I(ne)BZ(0.3), f34=DFR G1, d41=DFR I(n)L2, a39=DFR I(F)1, e33=DFR GZ(0.3), d5=IB SPL-L1,
b42=DFR I(F)B3(800.0), a42=DFR I(n)Z(0.3), d34=DFR GLZ(0.3), e10=IB SPL-D1, e15=DFR I(ne)B3(800.0),
c17=LM Jelinek-Mercer(0.100000), c26=DFR I(F)3(800.0), d45=DFR I(ne)B3(800.0), c3=DFR I(F)B1,
c35=DFR I(F)B2, b30=IB LL-D1, c9=LM Jelinek-Mercer(0.700000), b45=DFR GB3(800.0), f19=DFR
I(F)Z(0.3), a33=DFR I(ne)Z(0.3), a24=DFR I(F)3(800.0), a41=DFR GL1, d10=IB LL-D1, c4=DFR GB2,
d43=DFR I(ne)1, f33=DFR I(F)L2, c33=IB LL-DZ(0.3), b44=DFR I(F)LZ(0.3), b31=DFR I(ne)BZ(0.3),
d17=DFR I(n)3(800.0), c32=DFR I(ne)LZ(0.3), c12=DFR G3(800.0), d0=DFR I(n)B3(800.0), c42=BM25(k1=1.2,b=0.75),
a47=IB SPL-D3(800.0), f0=DFR I(F)L2, c24=DFR GB1, b27=DFR I(n)Z(0.3), e23=LM Jelinek-Mercer(0.700000),
f20=DFR I(ne)BZ(0.3), e8=DFR I(n)B2, d22=IB LL-L3(800.0), c23=IB LL-L3(800.0), b41=DFR G1,
d32=DFR GL2, d15=IB SPL-L2, e38=IB SPL-DZ(0.3), a34=DFR I(ne)LZ(0.3), tvtest=DFR I(n)B3(800.0),
e3=DFR GL3(800.0), c1=DFR GBZ(0.3), f31=DFR I(ne)L1, d26=DFR I(n)L3(800.0), c15=DFR I(n)B1,
a29=IB LL-LZ(0.3), c2=DFR I(n)B2, d8=DFR I(ne)L1, b18=IB SPL-L3(800.0), b24=DFR I(n)L3(800.0),
a37=DFR I(F)B2, a20=DFR I(ne)1, a44=BM25(k1=1.2,b=0.75), content3=DFR GL1, b14=LM Jelinek-Mercer(0.100000),
f2=IB SPL-D1, d6=DFR G2, b20=IB LL-L3(800.0), c31=DFR I(ne)Z(0.3), d2=DFR I(F)L3(800.0), f38=DFR
I(ne)1, b4=DFR I(F)L2, c11=IB LL-D1, a11=DFR I(n)L1, b43=DFR I(ne)B3(800.0), b15=DFR I(n)3(800.0),
e11=DFR I(n)L2, b9=DFR I(ne)1, e34=DFR GL1, f1=DFR G1, e29=IB SPL-L2, b1=DefaultSimilarity,
d1=DFR I(F)B2, b0=DFR G2, f14=DFR I(ne)B3(800.0), f44=DFR I(F)2, b13=IB SPL-L2, b40=DFR I(F)L2,
f21=DFR GLZ(0.3), f43=DFR GB2, c38=IB LL-D2, a10=DFR G3(800.0), binary=DFR I(F)3(800.0), b36=DFR
I(n)L1, b19=IB LL-D3(800.0), f23=IB LL-D1, b2=DFR I(ne)L1, d16=LM Jelinek-Mercer(0.100000),
a13=DFR I(n)B1, c25=DFR I(F)Z(0.3), d39=DFR I(n)BZ(0.3), f6=DFR I(F)B3(800.0), b29=DFR I(F)BZ(0.3),
b34=IB LL-D1, a45=DFR I(ne)L2, b25=DFR GZ(0.3), c19=DFR I(ne)2, f5=DFR I(ne)1, e2=DFR I(n)2,
a30=LM Jelinek-Mercer(0.700000), e26=DFR I(n)L1, a9=DFR I(F)B1, e16=DFR I(F)LZ(0.3), d47=DFR
GB3(800.0), c13=DFR I(n)L1, c10=LM Jelinek-Mercer(0.700000), e30=DFR I(F)Z(0.3), c22=DFR GB3(800.0),
body=DFR I(ne)LZ(0.3), c41=IB SPL-LZ(0.3), e36=IB LL-LZ(0.3), d33=DFR I(ne)BZ(0.3), e12=DFR
I(n)1, e47=DFR I(ne)3(800.0), e21=DFR I(ne)BZ(0.3), f28=IB SPL-L2, a15=LM Jelinek-Mercer(0.100000),
e40=LM Jelinek-Mercer(0.100000), a1=IB SPL-D3(800.0), c34=DFR I(n)B3(800.0), a=DFR GB1, d14=DFR
I(n)B1, c43=DFR I(ne)L2, a16=DFR I(n)3(800.0), d12=DFR I(n)L1, d46=DFR I(F)LZ(0.3), c8=DFR
GLZ(0.3), f18=DFR GB1, d4=IB LL-D2, b11=DFR I(n)BZ(0.3), b3=DFR I(ne)B2, d42=DFR I(n)1, f29=LM
Jelinek-Mercer(0.100000), e6=DFR I(ne)B1, e43=IB SPL-D2, a6=DFR I(ne)B1, b7=DFR I(n)L2, a3=DFR
GL3(800.0), f7=DFR I(ne)B3(800.0), f24=DFR G3(800.0), d35=LM Jelinek-Mercer(0.700000), e28=DFR
I(n)B1, a8=DFR I(n)B2, e1=IB SPL-D3(800.0), c30=DFR I(ne)3(800.0), a32=DFR I(ne)3(800.0),
e13=DFR I(ne)1, b28=IB LL-LZ(0.3), b12=DFR I(n)B1, d11=DFR G3(800.0), a0=IB LL-L1, c36=DFR
I(F)L3(800.0), d31=DFR I(F)2, f40=DFR GBZ(0.3), d36=IB LL-D1, a2=DFR I(n)2, a43=IB SPL-LZ(0.3),
a40=DFR GZ(0.3), f39=DFR I(F)B3(800.0), c21=DFR I(F)LZ(0.3), d23=DFR GB1, d28=DFR GL1, c29=DFR
GL1, d27=DFR GZ(0.3), c44=IB LL-L1, b8=DFR I(n)1, d25=DFR I(F)3(800.0), f42=DFR I(F)B1, f22=LM
Jelinek-Mercer(0.700000), string=DFR I(ne)L3(800.0), f3=DFR I(n)L2, a5=DFR I(n)LZ(0.3), a27=DFR
GL1, b16=DFR I(ne)2, d30=DFR GB2, a17=DFR I(ne)2, e5=DFR I(n)LZ(0.3), a14=IB SPL-L2, a18=IB
SPL-D2, c37=DFR I(F)1, e20=DFR GL2, c28=DFR GZ(0.3), f16=DFR GB3(800.0), a36=DFR I(n)B3(800.0),
a35=IB LL-DZ(0.3), d7=DefaultSimilarity, a12=DFR I(n)BZ(0.3), e4=IB LL-L2, d38=DFR I(n)L1,
c=DFR I(F)3(800.0), a26=DFR GZ(0.3), e31=DFR I(F)3(800.0), d21=DFR GB3(800.0), b38=DFR I(n)B1,
c45=IB SPL-D3(800.0), f45=DFR GL2, e27=DFR I(n)BZ(0.3), content4=DFR GZ(0.3), c46=DFR I(n)2,
b21=DFR GB1, e32=DFR I(n)L3(800.0), b46=IB LL-L3(800.0), f15=DFR I(F)LZ(0.3), d29=DFR I(n)Z(0.3),
f35=IB SPL-D1, =IB SPL-L2, b17=IB SPL-D2, a22=DFR GB1, b35=DFR G3(800.0), b37=DFR I(n)BZ(0.3),
d44=DFR I(F)B3(800.0), a28=DFR I(n)Z(0.3), d20=DFR I(F)LZ(0.3), a21=IB LL-L3(800.0), content1=IB
LL-L3(800.0), f41=DFR I(n)B2, b33=LM Jelinek-Mercer(0.700000), e0=IB LL-L1, a19=IB SPL-L3(800.0),
b6=IB SPL-D1, d3=DFR I(F)1, a25=DFR I(n)L3(800.0), a7=DFR GBZ(0.3), f37=DFR I(n)1, id=IB LL-L1,
f36=DFR I(n)L2, f10=DFR I(n)L2, content5=DFR I(F)B3(800.0), f47=DFR GLZ(0.3), foo=DFR I(F)L2,
f9=DFR GB3(800.0), str=DFR I(ne)B1, myfield=DFR I(F)2, str2=DFR GB2, e14=DFR I(F)B3(800.0),
c18=DFR I(n)3(800.0), a46=IB LL-L1, b47=DFR GB1, e18=IB LL-L3(800.0), f27=DFR I(n)B1, c39=IB
SPL-L1, b32=DFR GLZ(0.3), c5=DFR I(F)2, f13=DFR I(F)B3(800.0), c20=DFR I(ne)B3(800.0), c40=DFR
I(n)Z(0.3), e24=IB LL-D1, e35=DFR I(n)Z(0.3), e37=DFR I(F)BZ(0.3), c0=DFR I(ne)B1, d19=IB
SPL-D2, field=DFR I(F)L3(800.0), e25=DFR G3(800.0), e22=DFR GLZ(0.3), e46=DFR I(F)L1, b10=DFR
I(n)L1, e44=IB SPL-L3(800.0), content=LM Jelinek-Mercer(0.100000), f17=IB LL-L3(800.0), d40=IB
SPL-D1, d24=DFR I(F)Z(0.3), c7=DFR I(ne)BZ(0.3), c6=DFR GL2, a23=DFR I(F)Z(0.3), e45=IB LL-D3(800.0),
e19=DFR GB1, b23=DFR I(F)3(800.0), b39=IB SPL-L2, b22=DFR I(F)Z(0.3), d18=DFR I(ne)2, f26=DFR
I(n)BZ(0.3), c14=DFR I(n)BZ(0.3), f25=DFR I(n)L1, f30=DefaultSimilarity, f12=DFR I(ne)1, d37=DFR
G3(800.0), c27=DFR I(n)L3(800.0), f4=DFR I(n)1, c16=IB SPL-L2, e9=DFR I(F)B1, d13=DFR I(n)BZ(0.3),
a38=DFR I(F)L3(800.0), d9=DFR I(ne)B2, a31=IB LL-D1, f11=DFR I(n)1, e41=DFR I(n)3(800.0),
e39=DFR I(ne)L3(800.0), e7=DFR GBZ(0.3), e42=DFR I(ne)2, e17=DFR GB3(800.0)}, locale=es, timezone=Australia/Tasmania
   [junit4]   2> NOTE: Linux 3.2.0-26-generic amd64/Oracle Corporation 1.7.0_25 (64-bit)/cpus=8,threads=1,free=73949056,total=256311296
   [junit4]   2> NOTE: All tests run in this JVM: [TestIndexWriter]
   [junit4] Completed on J0 in 63.53s, 60 tests, 1 error <<< FAILURES!

[...truncated 1104 lines...]
BUILD FAILED
/var/lib/jenkins/workspace/Lucene-4x-Linux-Java7-64-test-only/checkout/lucene/build.xml:49:
The following error occurred while executing this line:
/var/lib/jenkins/workspace/Lucene-4x-Linux-Java7-64-test-only/checkout/lucene/common-build.xml:1297:
The following error occurred while executing this line:
/var/lib/jenkins/workspace/Lucene-4x-Linux-Java7-64-test-only/checkout/lucene/common-build.xml:921:
There were test failures: 400 suites, 3113 tests, 1 error, 101 ignored (91 assumptions)

Total time: 5 minutes 29 seconds
Build step 'Invoke Ant' marked build as failure
Recording test results
Email was triggered for: Failure
Sending email for trigger: Failure



Mime
View raw message