lucene-dev mailing list archives

Site index · List index
Message view « Date » · « Thread »
Top « Date » · « Thread »
From Policeman Jenkins Server <jenk...@thetaphi.de>
Subject [JENKINS] Lucene-Solr-4.x-Linux (64bit/jdk1.7.0_60-ea-b15) - Build # 10165 - Failure!
Date Sun, 11 May 2014 10:06:13 GMT
Build: http://jenkins.thetaphi.de/job/Lucene-Solr-4.x-Linux/10165/
Java: 64bit/jdk1.7.0_60-ea-b15 -XX:-UseCompressedOops -XX:+UseParallelGC

1 tests failed.
REGRESSION:  org.apache.solr.morphlines.cell.SolrCellMorphlineTest.testSolrCellDocumentTypes

Error Message:
key:ignored__attachment_mimetype expected:<[message/rfc822]> but was:<[text/plain]>

Stack Trace:
java.lang.AssertionError: key:ignored__attachment_mimetype expected:<[message/rfc822]> but was:<[text/plain]>
	at __randomizedtesting.SeedInfo.seed([9F39CE52972432F5:5FA6DCCF2FF6C20]:0)
	at org.junit.Assert.fail(Assert.java:93)
	at org.junit.Assert.failNotEquals(Assert.java:647)
	at org.junit.Assert.assertEquals(Assert.java:128)
	at org.apache.solr.morphlines.solr.AbstractSolrMorphlineTestBase.testDocumentTypesInternal(AbstractSolrMorphlineTestBase.java:170)
	at org.apache.solr.morphlines.cell.SolrCellMorphlineTest.testSolrCellDocumentTypes(SolrCellMorphlineTest.java:193)
	at sun.reflect.NativeMethodAccessorImpl.invoke0(Native Method)
	at sun.reflect.NativeMethodAccessorImpl.invoke(NativeMethodAccessorImpl.java:57)
	at sun.reflect.DelegatingMethodAccessorImpl.invoke(DelegatingMethodAccessorImpl.java:43)
	at java.lang.reflect.Method.invoke(Method.java:606)
	at com.carrotsearch.randomizedtesting.RandomizedRunner.invoke(RandomizedRunner.java:1618)
	at com.carrotsearch.randomizedtesting.RandomizedRunner$6.evaluate(RandomizedRunner.java:827)
	at com.carrotsearch.randomizedtesting.RandomizedRunner$7.evaluate(RandomizedRunner.java:863)
	at com.carrotsearch.randomizedtesting.RandomizedRunner$8.evaluate(RandomizedRunner.java:877)
	at com.carrotsearch.randomizedtesting.rules.SystemPropertiesRestoreRule$1.evaluate(SystemPropertiesRestoreRule.java:53)
	at org.apache.lucene.util.TestRuleSetupTeardownChained$1.evaluate(TestRuleSetupTeardownChained.java:50)
	at org.apache.lucene.util.TestRuleFieldCacheSanity$1.evaluate(TestRuleFieldCacheSanity.java:51)
	at org.apache.lucene.util.AbstractBeforeAfterRule$1.evaluate(AbstractBeforeAfterRule.java:46)
	at com.carrotsearch.randomizedtesting.rules.SystemPropertiesInvariantRule$1.evaluate(SystemPropertiesInvariantRule.java:55)
	at org.apache.lucene.util.TestRuleThreadAndTestName$1.evaluate(TestRuleThreadAndTestName.java:49)
	at org.apache.lucene.util.TestRuleIgnoreAfterMaxFailures$1.evaluate(TestRuleIgnoreAfterMaxFailures.java:65)
	at org.apache.lucene.util.TestRuleMarkFailure$1.evaluate(TestRuleMarkFailure.java:48)
	at com.carrotsearch.randomizedtesting.rules.StatementAdapter.evaluate(StatementAdapter.java:36)
	at com.carrotsearch.randomizedtesting.ThreadLeakControl$StatementRunner.run(ThreadLeakControl.java:360)
	at com.carrotsearch.randomizedtesting.ThreadLeakControl.forkTimeoutingTask(ThreadLeakControl.java:793)
	at com.carrotsearch.randomizedtesting.ThreadLeakControl$3.evaluate(ThreadLeakControl.java:453)
	at com.carrotsearch.randomizedtesting.RandomizedRunner.runSingleTest(RandomizedRunner.java:836)
	at com.carrotsearch.randomizedtesting.RandomizedRunner$3.evaluate(RandomizedRunner.java:738)
	at com.carrotsearch.randomizedtesting.RandomizedRunner$4.evaluate(RandomizedRunner.java:772)
	at com.carrotsearch.randomizedtesting.RandomizedRunner$5.evaluate(RandomizedRunner.java:783)
	at com.carrotsearch.randomizedtesting.rules.StatementAdapter.evaluate(StatementAdapter.java:36)
	at com.carrotsearch.randomizedtesting.rules.SystemPropertiesRestoreRule$1.evaluate(SystemPropertiesRestoreRule.java:53)
	at org.apache.lucene.util.AbstractBeforeAfterRule$1.evaluate(AbstractBeforeAfterRule.java:46)
	at org.apache.lucene.util.TestRuleStoreClassName$1.evaluate(TestRuleStoreClassName.java:42)
	at com.carrotsearch.randomizedtesting.rules.SystemPropertiesInvariantRule$1.evaluate(SystemPropertiesInvariantRule.java:55)
	at com.carrotsearch.randomizedtesting.rules.NoShadowingOrOverridesOnMethodsRule$1.evaluate(NoShadowingOrOverridesOnMethodsRule.java:39)
	at com.carrotsearch.randomizedtesting.rules.NoShadowingOrOverridesOnMethodsRule$1.evaluate(NoShadowingOrOverridesOnMethodsRule.java:39)
	at com.carrotsearch.randomizedtesting.rules.StatementAdapter.evaluate(StatementAdapter.java:36)
	at com.carrotsearch.randomizedtesting.rules.StatementAdapter.evaluate(StatementAdapter.java:36)
	at com.carrotsearch.randomizedtesting.rules.StatementAdapter.evaluate(StatementAdapter.java:36)
	at org.apache.lucene.util.TestRuleAssertionsRequired$1.evaluate(TestRuleAssertionsRequired.java:43)
	at org.apache.lucene.util.TestRuleMarkFailure$1.evaluate(TestRuleMarkFailure.java:48)
	at org.apache.lucene.util.TestRuleIgnoreAfterMaxFailures$1.evaluate(TestRuleIgnoreAfterMaxFailures.java:65)
	at org.apache.lucene.util.TestRuleIgnoreTestSuites$1.evaluate(TestRuleIgnoreTestSuites.java:55)
	at com.carrotsearch.randomizedtesting.rules.StatementAdapter.evaluate(StatementAdapter.java:36)
	at com.carrotsearch.randomizedtesting.ThreadLeakControl$StatementRunner.run(ThreadLeakControl.java:360)
	at java.lang.Thread.run(Thread.java:745)




Build Log:
[...truncated 19117 lines...]
   [junit4] Suite: org.apache.solr.morphlines.cell.SolrCellMorphlineTest
   [junit4]   2> log4j:WARN No such property [conversionPattern] in org.apache.solr.util.SolrLogLayout.
   [junit4]   2> Creating dataDir: /mnt/ssd/jenkins/workspace/Lucene-Solr-4.x-Linux/solr/build/contrib/solr-morphlines-cell/test/J0/./solr.morphlines.cell.SolrCellMorphlineTest-9F39CE52972432F5-001/init-core-data-001
   [junit4]   2> 759 T10 oas.SolrTestCaseJ4.buildSSLConfig Randomized ssl (false) and clientAuth (false)
   [junit4]   2> 789 T10 oas.SolrTestCaseJ4.initCore ####initCore
   [junit4]   2> 828 T10 oasc.SolrResourceLoader.<init> new SolrResourceLoader for directory: '/mnt/ssd/jenkins/workspace/Lucene-Solr-4.x-Linux/solr/contrib/morphlines-core/src/test-files/solr/collection1/'
   [junit4]   2> 1404 T10 oasc.SolrConfig.initLibs Adding specified lib dirs to ClassLoader
   [junit4]   2> 1406 T10 oasc.SolrResourceLoader.addToClassLoader WARN Can't find (or read) directory to add to classloader: ../../../contrib/extraction/lib (resolved as: /mnt/ssd/jenkins/workspace/Lucene-Solr-4.x-Linux/solr/contrib/morphlines-core/src/test-files/solr/collection1/../../../contrib/extraction/lib).
   [junit4]   2> 1407 T10 oasc.SolrResourceLoader.addToClassLoader WARN Can't find (or read) directory to add to classloader: ../../../dist/ (resolved as: /mnt/ssd/jenkins/workspace/Lucene-Solr-4.x-Linux/solr/contrib/morphlines-core/src/test-files/solr/collection1/../../../dist).
   [junit4]   2> 1408 T10 oasc.SolrResourceLoader.addToClassLoader WARN Can't find (or read) directory to add to classloader: ../../../contrib/clustering/lib/ (resolved as: /mnt/ssd/jenkins/workspace/Lucene-Solr-4.x-Linux/solr/contrib/morphlines-core/src/test-files/solr/collection1/../../../contrib/clustering/lib).
   [junit4]   2> 1409 T10 oasc.SolrResourceLoader.addToClassLoader WARN Can't find (or read) directory to add to classloader: ../../../dist/ (resolved as: /mnt/ssd/jenkins/workspace/Lucene-Solr-4.x-Linux/solr/contrib/morphlines-core/src/test-files/solr/collection1/../../../dist).
   [junit4]   2> 1410 T10 oasc.SolrResourceLoader.addToClassLoader WARN Can't find (or read) directory to add to classloader: ../../../contrib/langid/lib/ (resolved as: /mnt/ssd/jenkins/workspace/Lucene-Solr-4.x-Linux/solr/contrib/morphlines-core/src/test-files/solr/collection1/../../../contrib/langid/lib).
   [junit4]   2> 1411 T10 oasc.SolrResourceLoader.addToClassLoader WARN Can't find (or read) directory to add to classloader: ../../../dist/ (resolved as: /mnt/ssd/jenkins/workspace/Lucene-Solr-4.x-Linux/solr/contrib/morphlines-core/src/test-files/solr/collection1/../../../dist).
   [junit4]   2> 1412 T10 oasc.SolrResourceLoader.addToClassLoader WARN Can't find (or read) directory to add to classloader: ../../../contrib/velocity/lib (resolved as: /mnt/ssd/jenkins/workspace/Lucene-Solr-4.x-Linux/solr/contrib/morphlines-core/src/test-files/solr/collection1/../../../contrib/velocity/lib).
   [junit4]   2> 1413 T10 oasc.SolrResourceLoader.addToClassLoader WARN Can't find (or read) directory to add to classloader: ../../../dist/ (resolved as: /mnt/ssd/jenkins/workspace/Lucene-Solr-4.x-Linux/solr/contrib/morphlines-core/src/test-files/solr/collection1/../../../dist).
   [junit4]   2> 1414 T10 oasc.SolrResourceLoader.addToClassLoader WARN Can't find (or read) directory to add to classloader: /non/existent/dir/yields/warning (resolved as: /non/existent/dir/yields/warning).
   [junit4]   2> 1600 T10 oasc.SolrConfig.<init> Using Lucene MatchVersion: LUCENE_4_9
   [junit4]   2> 1831 T10 oasc.SolrConfig.<init> Loaded SolrConfig: solrconfig.xml
   [junit4]   2> 1838 T10 oass.IndexSchema.readSchema Reading Solr Schema from schema.xml
   [junit4]   2> 1952 T10 oass.IndexSchema.readSchema [null] Schema name=example
   [junit4]   2> 2120 T10 oasc.SolrResourceLoader.findClass WARN Solr loaded a deprecated plugin/analysis class [solr.IntField]. Please consult documentation how to replace it accordingly.
   [junit4]   2> 2129 T10 oasc.SolrResourceLoader.findClass WARN Solr loaded a deprecated plugin/analysis class [solr.LongField]. Please consult documentation how to replace it accordingly.
   [junit4]   2> 2137 T10 oasc.SolrResourceLoader.findClass WARN Solr loaded a deprecated plugin/analysis class [solr.FloatField]. Please consult documentation how to replace it accordingly.
   [junit4]   2> 2147 T10 oasc.SolrResourceLoader.findClass WARN Solr loaded a deprecated plugin/analysis class [solr.DoubleField]. Please consult documentation how to replace it accordingly.
   [junit4]   2> 2155 T10 oasc.SolrResourceLoader.findClass WARN Solr loaded a deprecated plugin/analysis class [solr.DateField]. Please consult documentation how to replace it accordingly.
   [junit4]   2> 2687 T10 oasc.SolrResourceLoader.findClass WARN Solr loaded a deprecated plugin/analysis class [solr.ThaiWordFilterFactory]. Please consult documentation how to replace it accordingly.
   [junit4]   2> 2726 T10 oass.IndexSchema.readSchema unique key field: id
   [junit4]   2> 2886 T10 oass.FileExchangeRateProvider.reload Reloading exchange rates from file currency.xml
   [junit4]   2> 2899 T10 oass.FileExchangeRateProvider.reload Reloading exchange rates from file currency.xml
   [junit4]   2> 3049 T10 oasc.SolrResourceLoader.locateSolrHome JNDI not configured for solr (NoInitialContextEx)
   [junit4]   2> 3050 T10 oasc.SolrResourceLoader.locateSolrHome using system property solr.solr.home: /mnt/ssd/jenkins/workspace/Lucene-Solr-4.x-Linux/solr/contrib/morphlines-core/src/test-files/solr
   [junit4]   2> 3051 T10 oasc.SolrResourceLoader.<init> new SolrResourceLoader for directory: '/mnt/ssd/jenkins/workspace/Lucene-Solr-4.x-Linux/solr/contrib/morphlines-core/src/test-files/solr/'
   [junit4]   2> 3147 T10 oasc.CoreContainer.<init> New CoreContainer 152444616
   [junit4]   2> 3148 T10 oasc.CoreContainer.load Loading cores into CoreContainer [instanceDir=/mnt/ssd/jenkins/workspace/Lucene-Solr-4.x-Linux/solr/contrib/morphlines-core/src/test-files/solr/]
   [junit4]   2> 3167 T10 oashc.HttpShardHandlerFactory.getParameter Setting socketTimeout to: 0
   [junit4]   2> 3168 T10 oashc.HttpShardHandlerFactory.getParameter Setting urlScheme to: null
   [junit4]   2> 3173 T10 oashc.HttpShardHandlerFactory.getParameter Setting connTimeout to: 0
   [junit4]   2> 3174 T10 oashc.HttpShardHandlerFactory.getParameter Setting maxConnectionsPerHost to: 20
   [junit4]   2> 3175 T10 oashc.HttpShardHandlerFactory.getParameter Setting corePoolSize to: 0
   [junit4]   2> 3175 T10 oashc.HttpShardHandlerFactory.getParameter Setting maximumPoolSize to: 2147483647
   [junit4]   2> 3176 T10 oashc.HttpShardHandlerFactory.getParameter Setting maxThreadIdleTime to: 5
   [junit4]   2> 3177 T10 oashc.HttpShardHandlerFactory.getParameter Setting sizeOfQueue to: -1
   [junit4]   2> 3177 T10 oashc.HttpShardHandlerFactory.getParameter Setting fairnessPolicy to: false
   [junit4]   2> 3405 T10 oasl.LogWatcher.createWatcher SLF4J impl is org.slf4j.impl.Log4jLoggerFactory
   [junit4]   2> 3407 T10 oasl.LogWatcher.newRegisteredLogWatcher Registering Log Listener [Log4j (org.slf4j.impl.Log4jLoggerFactory)]
   [junit4]   2> 3410 T10 oasc.CoreContainer.load Host Name: 
   [junit4]   2> 3503 T11 oasc.SolrResourceLoader.<init> new SolrResourceLoader for directory: '/mnt/ssd/jenkins/workspace/Lucene-Solr-4.x-Linux/solr/contrib/morphlines-core/src/test-files/solr/collection1/'
   [junit4]   2> 3583 T11 oasc.SolrConfig.initLibs Adding specified lib dirs to ClassLoader
   [junit4]   2> 3584 T11 oasc.SolrResourceLoader.addToClassLoader WARN Can't find (or read) directory to add to classloader: ../../../contrib/extraction/lib (resolved as: /mnt/ssd/jenkins/workspace/Lucene-Solr-4.x-Linux/solr/contrib/morphlines-core/src/test-files/solr/collection1/../../../contrib/extraction/lib).
   [junit4]   2> 3585 T11 oasc.SolrResourceLoader.addToClassLoader WARN Can't find (or read) directory to add to classloader: ../../../dist/ (resolved as: /mnt/ssd/jenkins/workspace/Lucene-Solr-4.x-Linux/solr/contrib/morphlines-core/src/test-files/solr/collection1/../../../dist).
   [junit4]   2> 3586 T11 oasc.SolrResourceLoader.addToClassLoader WARN Can't find (or read) directory to add to classloader: ../../../contrib/clustering/lib/ (resolved as: /mnt/ssd/jenkins/workspace/Lucene-Solr-4.x-Linux/solr/contrib/morphlines-core/src/test-files/solr/collection1/../../../contrib/clustering/lib).
   [junit4]   2> 3587 T11 oasc.SolrResourceLoader.addToClassLoader WARN Can't find (or read) directory to add to classloader: ../../../dist/ (resolved as: /mnt/ssd/jenkins/workspace/Lucene-Solr-4.x-Linux/solr/contrib/morphlines-core/src/test-files/solr/collection1/../../../dist).
   [junit4]   2> 3588 T11 oasc.SolrResourceLoader.addToClassLoader WARN Can't find (or read) directory to add to classloader: ../../../contrib/langid/lib/ (resolved as: /mnt/ssd/jenkins/workspace/Lucene-Solr-4.x-Linux/solr/contrib/morphlines-core/src/test-files/solr/collection1/../../../contrib/langid/lib).
   [junit4]   2> 3588 T11 oasc.SolrResourceLoader.addToClassLoader WARN Can't find (or read) directory to add to classloader: ../../../dist/ (resolved as: /mnt/ssd/jenkins/workspace/Lucene-Solr-4.x-Linux/solr/contrib/morphlines-core/src/test-files/solr/collection1/../../../dist).
   [junit4]   2> 3589 T11 oasc.SolrResourceLoader.addToClassLoader WARN Can't find (or read) directory to add to classloader: ../../../contrib/velocity/lib (resolved as: /mnt/ssd/jenkins/workspace/Lucene-Solr-4.x-Linux/solr/contrib/morphlines-core/src/test-files/solr/collection1/../../../contrib/velocity/lib).
   [junit4]   2> 3590 T11 oasc.SolrResourceLoader.addToClassLoader WARN Can't find (or read) directory to add to classloader: ../../../dist/ (resolved as: /mnt/ssd/jenkins/workspace/Lucene-Solr-4.x-Linux/solr/contrib/morphlines-core/src/test-files/solr/collection1/../../../dist).
   [junit4]   2> 3591 T11 oasc.SolrResourceLoader.addToClassLoader WARN Can't find (or read) directory to add to classloader: /non/existent/dir/yields/warning (resolved as: /non/existent/dir/yields/warning).
   [junit4]   2> 3658 T11 oasc.SolrConfig.<init> Using Lucene MatchVersion: LUCENE_4_9
   [junit4]   2> 3735 T11 oasc.SolrConfig.<init> Loaded SolrConfig: solrconfig.xml
   [junit4]   2> 3736 T11 oass.IndexSchema.readSchema Reading Solr Schema from schema.xml
   [junit4]   2> 3793 T11 oass.IndexSchema.readSchema [collection1] Schema name=example
   [junit4]   2> 4236 T11 oass.IndexSchema.readSchema unique key field: id
   [junit4]   2> 4266 T11 oass.FileExchangeRateProvider.reload Reloading exchange rates from file currency.xml
   [junit4]   2> 4275 T11 oass.FileExchangeRateProvider.reload Reloading exchange rates from file currency.xml
   [junit4]   2> 4336 T11 oasc.CoreContainer.create Creating SolrCore 'collection1' using configuration from instancedir /mnt/ssd/jenkins/workspace/Lucene-Solr-4.x-Linux/solr/contrib/morphlines-core/src/test-files/solr/collection1/
   [junit4]   2> 4365 T11 oasc.SolrCore.initDirectoryFactory org.apache.solr.core.MockDirectoryFactory
   [junit4]   2> 4374 T11 oasc.SolrCore.<init> [collection1] Opening new SolrCore at /mnt/ssd/jenkins/workspace/Lucene-Solr-4.x-Linux/solr/contrib/morphlines-core/src/test-files/solr/collection1/, dataDir=/mnt/ssd/jenkins/workspace/Lucene-Solr-4.x-Linux/solr/build/contrib/solr-morphlines-cell/test/J0/./solr.morphlines.cell.SolrCellMorphlineTest-9F39CE52972432F5-001/init-core-data-001/
   [junit4]   2> 4376 T11 oasc.JmxMonitoredMap.<init> No JMX servers found, not exposing Solr information with JMX.
   [junit4]   2> 4387 T11 oasc.SolrCore.initListeners [collection1] Added SolrEventListener for newSearcher: org.apache.solr.core.QuerySenderListener{queries=[]}
   [junit4]   2> 4388 T11 oasc.SolrCore.initListeners [collection1] Added SolrEventListener for firstSearcher: org.apache.solr.core.QuerySenderListener{queries=[{q=static firstSearcher warming in solrconfig.xml}]}
   [junit4]   2> 4420 T11 oasc.CachingDirectoryFactory.get return new directory for /mnt/ssd/jenkins/workspace/Lucene-Solr-4.x-Linux/solr/build/contrib/solr-morphlines-cell/test/J0/./solr.morphlines.cell.SolrCellMorphlineTest-9F39CE52972432F5-001/init-core-data-001
   [junit4]   2> 4421 T11 oasc.SolrCore.getNewIndexDir New index directory detected: old=null new=/mnt/ssd/jenkins/workspace/Lucene-Solr-4.x-Linux/solr/build/contrib/solr-morphlines-cell/test/J0/./solr.morphlines.cell.SolrCellMorphlineTest-9F39CE52972432F5-001/init-core-data-001/index/
   [junit4]   2> 4422 T11 oasc.SolrCore.initIndex WARN [collection1] Solr index directory '/mnt/ssd/jenkins/workspace/Lucene-Solr-4.x-Linux/solr/build/contrib/solr-morphlines-cell/test/J0/./solr.morphlines.cell.SolrCellMorphlineTest-9F39CE52972432F5-001/init-core-data-001/index' doesn't exist. Creating new index...
   [junit4]   2> 4430 T11 oasc.CachingDirectoryFactory.get return new directory for /mnt/ssd/jenkins/workspace/Lucene-Solr-4.x-Linux/solr/build/contrib/solr-morphlines-cell/test/J0/./solr.morphlines.cell.SolrCellMorphlineTest-9F39CE52972432F5-001/init-core-data-001/index
   [junit4]   2> 4476 T11 oasc.SolrDeletionPolicy.onCommit SolrDeletionPolicy.onCommit: commits: num=1
   [junit4]   2> 		commit{dir=MockDirectoryWrapper(RAMDirectory@33796a37 lockFactory=NativeFSLockFactory@/mnt/ssd/jenkins/workspace/Lucene-Solr-4.x-Linux/solr/build/contrib/solr-morphlines-cell/test/J0/./solr.morphlines.cell.SolrCellMorphlineTest-9F39CE52972432F5-001/init-core-data-001/index),segFN=segments_1,generation=1}
   [junit4]   2> 4478 T11 oasc.SolrDeletionPolicy.updateCommits newest commit generation = 1
   [junit4]   2> 4487 T11 oasc.SolrCore.initWriters created json: solr.JSONResponseWriter
   [junit4]   2> 4487 T11 oasc.SolrCore.initWriters adding lazy queryResponseWriter: solr.VelocityResponseWriter
   [junit4]   2> 4489 T11 oasc.SolrCore.initWriters created velocity: solr.VelocityResponseWriter
   [junit4]   2> 4498 T11 oasc.SolrCore.initWriters created xslt: solr.XSLTResponseWriter
   [junit4]   2> 4499 T11 oasr.XSLTResponseWriter.init xsltCacheLifetimeSeconds=5
   [junit4]   2> 4732 T11 oasc.SolrCore.loadUpdateProcessorChains no updateRequestProcessorChain defined as default, creating implicit default
   [junit4]   2> 4756 T11 oasc.RequestHandlers.initHandlersFromConfig created /select: solr.SearchHandler
   [junit4]   2> 4757 T11 oasc.RequestHandlers.initHandlersFromConfig created /query: solr.SearchHandler
   [junit4]   2> 4762 T11 oasc.RequestHandlers.initHandlersFromConfig created /get: solr.RealTimeGetHandler
   [junit4]   2> 4763 T11 oasc.RequestHandlers.initHandlersFromConfig created /browse: solr.SearchHandler
   [junit4]   2> 4770 T11 oasc.RequestHandlers.initHandlersFromConfig created /update: solr.UpdateRequestHandler
   [junit4]   2> 4775 T11 oasc.SolrResourceLoader.findClass WARN Solr loaded a deprecated plugin/analysis class [solr.JsonUpdateRequestHandler]. Please consult documentation how to replace it accordingly.
   [junit4]   2> 4776 T11 oasc.RequestHandlers.initHandlersFromConfig created /update/json: solr.JsonUpdateRequestHandler
   [junit4]   2> 4781 T11 oasc.SolrResourceLoader.findClass WARN Solr loaded a deprecated plugin/analysis class [solr.CSVRequestHandler]. Please consult documentation how to replace it accordingly.
   [junit4]   2> 4781 T11 oasc.RequestHandlers.initHandlersFromConfig created /update/csv: solr.CSVRequestHandler
   [junit4]   2> 4782 T11 oasc.RequestHandlers.initHandlersFromConfig adding lazy requestHandler: solr.FieldAnalysisRequestHandler
   [junit4]   2> 4783 T11 oasc.RequestHandlers.initHandlersFromConfig created /analysis/field: solr.FieldAnalysisRequestHandler
   [junit4]   2> 4783 T11 oasc.RequestHandlers.initHandlersFromConfig adding lazy requestHandler: solr.DocumentAnalysisRequestHandler
   [junit4]   2> 4784 T11 oasc.RequestHandlers.initHandlersFromConfig created /analysis/document: solr.DocumentAnalysisRequestHandler
   [junit4]   2> 4790 T11 oasc.RequestHandlers.initHandlersFromConfig created /admin/: solr.admin.AdminHandlers
   [junit4]   2> 4795 T11 oasc.RequestHandlers.initHandlersFromConfig created /admin/ping: solr.PingRequestHandler
   [junit4]   2> 4801 T11 oasc.RequestHandlers.initHandlersFromConfig created /debug/dump: solr.DumpRequestHandler
   [junit4]   2> 4815 T11 oasc.RequestHandlers.initHandlersFromConfig created /replication: solr.ReplicationHandler
   [junit4]   2> 4815 T11 oasc.RequestHandlers.initHandlersFromConfig adding lazy requestHandler: solr.SearchHandler
   [junit4]   2> 4816 T11 oasc.RequestHandlers.initHandlersFromConfig created /spell: solr.SearchHandler
   [junit4]   2> 4816 T11 oasc.RequestHandlers.initHandlersFromConfig adding lazy requestHandler: solr.SearchHandler
   [junit4]   2> 4816 T11 oasc.RequestHandlers.initHandlersFromConfig created /tvrh: solr.SearchHandler
   [junit4]   2> 4817 T11 oasc.RequestHandlers.initHandlersFromConfig adding lazy requestHandler: solr.SearchHandler
   [junit4]   2> 4817 T11 oasc.RequestHandlers.initHandlersFromConfig created /terms: solr.SearchHandler
   [junit4]   2> 4818 T11 oasc.RequestHandlers.initHandlersFromConfig adding lazy requestHandler: solr.SearchHandler
   [junit4]   2> 4818 T11 oasc.RequestHandlers.initHandlersFromConfig created /elevate: solr.SearchHandler
   [junit4]   2> 4851 T11 oashl.XMLLoader.init xsltCacheLifetimeSeconds=60
   [junit4]   2> 4855 T11 oashl.XMLLoader.init xsltCacheLifetimeSeconds=60
   [junit4]   2> 4856 T11 oashl.XMLLoader.init xsltCacheLifetimeSeconds=60
   [junit4]   2> 4882 T11 oasu.CommitTracker.<init> Hard AutoCommit: if uncommited for 60000ms; 
   [junit4]   2> 4883 T11 oasu.CommitTracker.<init> Soft AutoCommit: if uncommited for 1000ms; 
   [junit4]   2> 4885 T11 oasc.SolrDeletionPolicy.onInit SolrDeletionPolicy.onInit: commits: num=1
   [junit4]   2> 		commit{dir=MockDirectoryWrapper(RAMDirectory@33796a37 lockFactory=NativeFSLockFactory@/mnt/ssd/jenkins/workspace/Lucene-Solr-4.x-Linux/solr/build/contrib/solr-morphlines-cell/test/J0/./solr.morphlines.cell.SolrCellMorphlineTest-9F39CE52972432F5-001/init-core-data-001/index),segFN=segments_1,generation=1}
   [junit4]   2> 4885 T11 oasc.SolrDeletionPolicy.updateCommits newest commit generation = 1
   [junit4]   2> 4898 T11 oass.SolrIndexSearcher.<init> Opening Searcher@6dccdc3b[collection1] main
   [junit4]   2> 4911 T11 oasr.ManagedResourceStorage$FileStorageIO.configure File-based storage initialized to use dir: /mnt/ssd/jenkins/workspace/Lucene-Solr-4.x-Linux/solr/contrib/morphlines-core/src/test-files/solr/collection1/conf
   [junit4]   2> 4912 T11 oasr.RestManager.init Initializing RestManager with initArgs: {storageDir=/mnt/ssd/jenkins/workspace/Lucene-Solr-4.x-Linux/solr/contrib/morphlines-core/src/test-files/solr/collection1/conf/}
   [junit4]   2> 4931 T11 oasr.ManagedResourceStorage.load Reading _rest_managed.json using file:dir=/mnt/ssd/jenkins/workspace/Lucene-Solr-4.x-Linux/solr/contrib/morphlines-core/src/test-files/solr/collection1/conf
   [junit4]   2> 4932 T11 oasr.ManagedResource.reloadFromStorage WARN No stored data found for /rest/managed
   [junit4]   2> 4933 T11 oasr.ManagedResource.notifyObserversDuringInit WARN No registered observers for /rest/managed
   [junit4]   2> 4933 T11 oasr.RestManager.init Initializing 0 registered ManagedResources
   [junit4]   2> 4934 T11 oashc.SpellCheckComponent.inform Initializing spell checkers
   [junit4]   2> 4952 T11 oass.DirectSolrSpellChecker.init init: {name=default,field=name,classname=solr.DirectSolrSpellChecker,distanceMeasure=internal,accuracy=0.5,maxEdits=2,minPrefix=1,maxInspections=5,minQueryLength=4,maxQueryFrequency=0.01}
   [junit4]   2> 4971 T11 oashc.SpellCheckComponent.inform No queryConverter defined, using default converter
   [junit4]   2> 4975 T11 oashc.QueryElevationComponent.inform Loading QueryElevation from: /mnt/ssd/jenkins/workspace/Lucene-Solr-4.x-Linux/solr/contrib/morphlines-core/src/test-files/solr/collection1/conf/elevate.xml
   [junit4]   2> 5038 T11 oash.ReplicationHandler.inform Commits will be reserved for  10000
   [junit4]   2> 5039 T12 oasc.QuerySenderListener.newSearcher QuerySenderListener sending requests to Searcher@6dccdc3b[collection1] main{StandardDirectoryReader(segments_1:1:nrt)}
   [junit4]   2> 5039 T11 oasc.CoreContainer.registerCore registering core: collection1
   [junit4]   2> 5044 T10 oas.SolrTestCaseJ4.initCore ####initCore end
   [junit4]   2> 5065 T10 oas.SolrTestCaseJ4.setUp ###Starting testSolrCellDocumentTypes2
   [junit4]   2> ASYNC  NEW_CORE C0 name=collection1 org.apache.solr.core.SolrCore@4de3afa9
   [junit4]   2> 5141 T12 C0 oasc.SolrCore.execute [collection1] webapp=null path=null params={distrib=false&event=firstSearcher&q=static+firstSearcher+warming+in+solrconfig.xml} hits=0 status=0 QTime=99 
   [junit4]   2> 5144 T12 oasc.QuerySenderListener.newSearcher QuerySenderListener done.
   [junit4]   2> 5144 T12 oashc.SpellCheckComponent$SpellCheckerListener.newSearcher Loading spell index for spellchecker: default
   [junit4]   2> 5145 T12 oashc.SpellCheckComponent$SpellCheckerListener.newSearcher Loading spell index for spellchecker: wordbreak
   [junit4]   2> 5146 T12 oasc.SolrCore.registerSearcher [collection1] Registered new searcher Searcher@6dccdc3b[collection1] main{StandardDirectoryReader(segments_1:1:nrt)}
   [junit4]   2> 5250 T10 C0 oasup.LogUpdateProcessor.finish [collection1] webapp=null path=/update params={} {deleteByQuery=*:* (-1467799564752781312)} 0 165
   [junit4]   2> 5253 T10 C0 oasu.DirectUpdateHandler2.commit start commit{,optimize=false,openSearcher=true,waitSearcher=true,expungeDeletes=false,softCommit=false,prepareCommit=false}
   [junit4]   2> 5253 T10 C0 oasu.DirectUpdateHandler2.commit No uncommitted changes. Skipping IW.commit.
   [junit4]   2> 5254 T10 C0 oasc.SolrCore.openNewSearcher SolrIndexSearcher has not changed - not re-opening: org.apache.solr.search.SolrIndexSearcher
   [junit4]   2> 5255 T10 C0 oasu.DirectUpdateHandler2.commit end_commit_flush
   [junit4]   2> 5256 T10 C0 oasup.LogUpdateProcessor.finish [collection1] webapp=null path=/update params={commit=true&softCommit=false&waitSearcher=true} {commit=} 0 4
   [junit4]   2> 5473 T10 okma.MorphlineContext.importCommandBuilders Importing commands
   [junit4]   2> 6725 T10 okma.MorphlineContext.importCommandBuilders Done importing commands
   [junit4]   2> 8920 T10 oasc.SolrResourceLoader.<init> new SolrResourceLoader for directory: '/mnt/ssd/jenkins/workspace/Lucene-Solr-4.x-Linux/solr/contrib/morphlines-core/src/test-files/solr/collection1/'
   [junit4]   2> 8990 T10 oasc.SolrConfig.initLibs Adding specified lib dirs to ClassLoader
   [junit4]   2> 8991 T10 oasc.SolrResourceLoader.addToClassLoader WARN Can't find (or read) directory to add to classloader: ../../../contrib/extraction/lib (resolved as: /mnt/ssd/jenkins/workspace/Lucene-Solr-4.x-Linux/solr/contrib/morphlines-core/src/test-files/solr/collection1/../../../contrib/extraction/lib).
   [junit4]   2> 8992 T10 oasc.SolrResourceLoader.addToClassLoader WARN Can't find (or read) directory to add to classloader: ../../../dist/ (resolved as: /mnt/ssd/jenkins/workspace/Lucene-Solr-4.x-Linux/solr/contrib/morphlines-core/src/test-files/solr/collection1/../../../dist).
   [junit4]   2> 8994 T10 oasc.SolrResourceLoader.addToClassLoader WARN Can't find (or read) directory to add to classloader: ../../../contrib/clustering/lib/ (resolved as: /mnt/ssd/jenkins/workspace/Lucene-Solr-4.x-Linux/solr/contrib/morphlines-core/src/test-files/solr/collection1/../../../contrib/clustering/lib).
   [junit4]   2> 8995 T10 oasc.SolrResourceLoader.addToClassLoader WARN Can't find (or read) directory to add to classloader: ../../../dist/ (resolved as: /mnt/ssd/jenkins/workspace/Lucene-Solr-4.x-Linux/solr/contrib/morphlines-core/src/test-files/solr/collection1/../../../dist).
   [junit4]   2> 8996 T10 oasc.SolrResourceLoader.addToClassLoader WARN Can't find (or read) directory to add to classloader: ../../../contrib/langid/lib/ (resolved as: /mnt/ssd/jenkins/workspace/Lucene-Solr-4.x-Linux/solr/contrib/morphlines-core/src/test-files/solr/collection1/../../../contrib/langid/lib).
   [junit4]   2> 8997 T10 oasc.SolrResourceLoader.addToClassLoader WARN Can't find (or read) directory to add to classloader: ../../../dist/ (resolved as: /mnt/ssd/jenkins/workspace/Lucene-Solr-4.x-Linux/solr/contrib/morphlines-core/src/test-files/solr/collection1/../../../dist).
   [junit4]   2> 8998 T10 oasc.SolrResourceLoader.addToClassLoader WARN Can't find (or read) directory to add to classloader: ../../../contrib/velocity/lib (resolved as: /mnt/ssd/jenkins/workspace/Lucene-Solr-4.x-Linux/solr/contrib/morphlines-core/src/test-files/solr/collection1/../../../contrib/velocity/lib).
   [junit4]   2> 9000 T10 oasc.SolrResourceLoader.addToClassLoader WARN Can't find (or read) directory to add to classloader: ../../../dist/ (resolved as: /mnt/ssd/jenkins/workspace/Lucene-Solr-4.x-Linux/solr/contrib/morphlines-core/src/test-files/solr/collection1/../../../dist).
   [junit4]   2> 9001 T10 oasc.SolrResourceLoader.addToClassLoader WARN Can't find (or read) directory to add to classloader: /non/existent/dir/yields/warning (resolved as: /non/existent/dir/yields/warning).
   [junit4]   2> 9047 T10 oasc.SolrConfig.<init> Using Lucene MatchVersion: LUCENE_4_9
   [junit4]   2> 9137 T10 oasc.SolrConfig.<init> Loaded SolrConfig: solrconfig.xml
   [junit4]   2> 9139 T10 oass.IndexSchema.readSchema Reading Solr Schema from schema.xml
   [junit4]   2> 9205 T10 oass.IndexSchema.readSchema [null] Schema name=example
   [junit4]   2> 9784 T10 oass.IndexSchema.readSchema unique key field: id
   [junit4]   2> 9809 T10 oass.FileExchangeRateProvider.reload Reloading exchange rates from file currency.xml
   [junit4]   2> 9817 T10 oass.FileExchangeRateProvider.reload Reloading exchange rates from file currency.xml
   [junit4]   2> 9867 T10 oasc.SolrResourceLoader.<init> new SolrResourceLoader for directory: '/mnt/ssd/jenkins/workspace/Lucene-Solr-4.x-Linux/solr/contrib/morphlines-core/src/test-files/solr/collection1/'
   [junit4]   2> 9916 T10 oasc.SolrConfig.initLibs Adding specified lib dirs to ClassLoader
   [junit4]   2> 9917 T10 oasc.SolrResourceLoader.addToClassLoader WARN Can't find (or read) directory to add to classloader: ../../../contrib/extraction/lib (resolved as: /mnt/ssd/jenkins/workspace/Lucene-Solr-4.x-Linux/solr/contrib/morphlines-core/src/test-files/solr/collection1/../../../contrib/extraction/lib).
   [junit4]   2> 9918 T10 oasc.SolrResourceLoader.addToClassLoader WARN Can't find (or read) directory to add to classloader: ../../../dist/ (resolved as: /mnt/ssd/jenkins/workspace/Lucene-Solr-4.x-Linux/solr/contrib/morphlines-core/src/test-files/solr/collection1/../../../dist).
   [junit4]   2> 9919 T10 oasc.SolrResourceLoader.addToClassLoader WARN Can't find (or read) directory to add to classloader: ../../../contrib/clustering/lib/ (resolved as: /mnt/ssd/jenkins/workspace/Lucene-Solr-4.x-Linux/solr/contrib/morphlines-core/src/test-files/solr/collection1/../../../contrib/clustering/lib).
   [junit4]   2> 9919 T10 oasc.SolrResourceLoader.addToClassLoader WARN Can't find (or read) directory to add to classloader: ../../../dist/ (resolved as: /mnt/ssd/jenkins/workspace/Lucene-Solr-4.x-Linux/solr/contrib/morphlines-core/src/test-files/solr/collection1/../../../dist).
   [junit4]   2> 9920 T10 oasc.SolrResourceLoader.addToClassLoader WARN Can't find (or read) directory to add to classloader: ../../../contrib/langid/lib/ (resolved as: /mnt/ssd/jenkins/workspace/Lucene-Solr-4.x-Linux/solr/contrib/morphlines-core/src/test-files/solr/collection1/../../../contrib/langid/lib).
   [junit4]   2> 9921 T10 oasc.SolrResourceLoader.addToClassLoader WARN Can't find (or read) directory to add to classloader: ../../../dist/ (resolved as: /mnt/ssd/jenkins/workspace/Lucene-Solr-4.x-Linux/solr/contrib/morphlines-core/src/test-files/solr/collection1/../../../dist).
   [junit4]   2> 9921 T10 oasc.SolrResourceLoader.addToClassLoader WARN Can't find (or read) directory to add to classloader: ../../../contrib/velocity/lib (resolved as: /mnt/ssd/jenkins/workspace/Lucene-Solr-4.x-Linux/solr/contrib/morphlines-core/src/test-files/solr/collection1/../../../contrib/velocity/lib).
   [junit4]   2> 9922 T10 oasc.SolrResourceLoader.addToClassLoader WARN Can't find (or read) directory to add to classloader: ../../../dist/ (resolved as: /mnt/ssd/jenkins/workspace/Lucene-Solr-4.x-Linux/solr/contrib/morphlines-core/src/test-files/solr/collection1/../../../dist).
   [junit4]   2> 9923 T10 oasc.SolrResourceLoader.addToClassLoader WARN Can't find (or read) directory to add to classloader: /non/existent/dir/yields/warning (resolved as: /non/existent/dir/yields/warning).
   [junit4]   2> 9955 T10 oasc.SolrConfig.<init> Using Lucene MatchVersion: LUCENE_4_9
   [junit4]   2> 10021 T10 oasc.SolrConfig.<init> Loaded SolrConfig: solrconfig.xml
   [junit4]   2> 10022 T10 oass.IndexSchema.readSchema Reading Solr Schema from schema.xml
   [junit4]   2> 10059 T10 oass.IndexSchema.readSchema [null] Schema name=example
   [junit4]   2> 10457 T10 oass.IndexSchema.readSchema unique key field: id
   [junit4]   2> 10484 T10 oass.FileExchangeRateProvider.reload Reloading exchange rates from file currency.xml
   [junit4]   2> 10490 T10 oass.FileExchangeRateProvider.reload Reloading exchange rates from file currency.xml
   [junit4]   2> 11004 T10 oasc.SolrResourceLoader.<init> new SolrResourceLoader for directory: '/mnt/ssd/jenkins/workspace/Lucene-Solr-4.x-Linux/solr/contrib/morphlines-core/src/test-files/solr/collection1/'
   [junit4]   2> 11043 T10 oasc.SolrConfig.initLibs Adding specified lib dirs to ClassLoader
   [junit4]   2> 11044 T10 oasc.SolrResourceLoader.addToClassLoader WARN Can't find (or read) directory to add to classloader: ../../../contrib/extraction/lib (resolved as: /mnt/ssd/jenkins/workspace/Lucene-Solr-4.x-Linux/solr/contrib/morphlines-core/src/test-files/solr/collection1/../../../contrib/extraction/lib).
   [junit4]   2> 11044 T10 oasc.SolrResourceLoader.addToClassLoader WARN Can't find (or read) directory to add to classloader: ../../../dist/ (resolved as: /mnt/ssd/jenkins/workspace/Lucene-Solr-4.x-Linux/solr/contrib/morphlines-core/src/test-files/solr/collection1/../../../dist).
   [junit4]   2> 11045 T10 oasc.SolrResourceLoader.addToClassLoader WARN Can't find (or read) directory to add to classloader: ../../../contrib/clustering/lib/ (resolved as: /mnt/ssd/jenkins/workspace/Lucene-Solr-4.x-Linux/solr/contrib/morphlines-core/src/test-files/solr/collection1/../../../contrib/clustering/lib).
   [junit4]   2> 11045 T10 oasc.SolrResourceLoader.addToClassLoader WARN Can't find (or read) directory to add to classloader: ../../../dist/ (resolved as: /mnt/ssd/jenkins/workspace/Lucene-Solr-4.x-Linux/solr/contrib/morphlines-core/src/test-files/solr/collection1/../../../dist).
   [junit4]   2> 11046 T10 oasc.SolrResourceLoader.addToClassLoader WARN Can't find (or read) directory to add to classloader: ../../../contrib/langid/lib/ (resolved as: /mnt/ssd/jenkins/workspace/Lucene-Solr-4.x-Linux/solr/contrib/morphlines-core/src/test-files/solr/collection1/../../../contrib/langid/lib).
   [junit4]   2> 11046 T10 oasc.SolrResourceLoader.addToClassLoader WARN Can't find (or read) directory to add to classloader: ../../../dist/ (resolved as: /mnt/ssd/jenkins/workspace/Lucene-Solr-4.x-Linux/solr/contrib/morphlines-core/src/test-files/solr/collection1/../../../dist).
   [junit4]   2> 11047 T10 oasc.SolrResourceLoader.addToClassLoader WARN Can't find (or read) directory to add to classloader: ../../../contrib/velocity/lib (resolved as: /mnt/ssd/jenkins/workspace/Lucene-Solr-4.x-Linux/solr/contrib/morphlines-core/src/test-files/solr/collection1/../../../contrib/velocity/lib).
   [junit4]   2> 11047 T10 oasc.SolrResourceLoader.addToClassLoader WARN Can't find (or read) directory to add to classloader: ../../../dist/ (resolved as: /mnt/ssd/jenkins/workspace/Lucene-Solr-4.x-Linux/solr/contrib/morphlines-core/src/test-files/solr/collection1/../../../dist).
   [junit4]   2> 11048 T10 oasc.SolrResourceLoader.addToClassLoader WARN Can't find (or read) directory to add to classloader: /non/existent/dir/yields/warning (resolved as: /non/existent/dir/yields/warning).
   [junit4]   2> 11087 T10 oasc.SolrConfig.<init> Using Lucene MatchVersion: LUCENE_4_9
   [junit4]   2> 11143 T10 oasc.SolrConfig.<init> Loaded SolrConfig: solrconfig.xml
   [junit4]   2> 11144 T10 oass.IndexSchema.readSchema Reading Solr Schema from schema.xml
   [junit4]   2> 11177 T10 oass.IndexSchema.readSchema [null] Schema name=example
   [junit4]   2> 11528 T10 oass.IndexSchema.readSchema unique key field: id
   [junit4]   2> 11550 T10 oass.FileExchangeRateProvider.reload Reloading exchange rates from file currency.xml
   [junit4]   2> 11557 T10 oass.FileExchangeRateProvider.reload Reloading exchange rates from file currency.xml
   [junit4]   2> 11588 T10 oasc.SolrResourceLoader.<init> new SolrResourceLoader for directory: '/mnt/ssd/jenkins/workspace/Lucene-Solr-4.x-Linux/solr/contrib/morphlines-core/src/test-files/solr/collection1/'
   [junit4]   2> 11626 T10 oasc.SolrConfig.initLibs Adding specified lib dirs to ClassLoader
   [junit4]   2> 11627 T10 oasc.SolrResourceLoader.addToClassLoader WARN Can't find (or read) directory to add to classloader: ../../../contrib/extraction/lib (resolved as: /mnt/ssd/jenkins/workspace/Lucene-Solr-4.x-Linux/solr/contrib/morphlines-core/src/test-files/solr/collection1/../../../contrib/extraction/lib).
   [junit4]   2> 11628 T10 oasc.SolrResourceLoader.addToClassLoader WARN Can't find (or read) directory to add to classloader: ../../../dist/ (resolved as: /mnt/ssd/jenkins/workspace/Lucene-Solr-4.x-Linux/solr/contrib/morphlines-core/src/test-files/solr/collection1/../../../dist).
   [junit4]   2> 11628 T10 oasc.SolrResourceLoader.addToClassLoader WARN Can't find (or read) directory to add to classloader: ../../../contrib/clustering/lib/ (resolved as: /mnt/ssd/jenkins/workspace/Lucene-Solr-4.x-Linux/solr/contrib/morphlines-core/src/test-files/solr/collection1/../../../contrib/clustering/lib).
   [junit4]   2> 11629 T10 oasc.SolrResourceLoader.addToClassLoader WARN Can't find (or read) directory to add to classloader: ../../../dist/ (resolved as: /mnt/ssd/jenkins/workspace/Lucene-Solr-4.x-Linux/solr/contrib/morphlines-core/src/test-files/solr/collection1/../../../dist).
   [junit4]   2> 11630 T10 oasc.SolrResourceLoader.addToClassLoader WARN Can't find (or read) directory to add to classloader: ../../../contrib/langid/lib/ (resolved as: /mnt/ssd/jenkins/workspace/Lucene-Solr-4.x-Linux/solr/contrib/morphlines-core/src/test-files/solr/collection1/../../../contrib/langid/lib).
   [junit4]   2> 11630 T10 oasc.SolrResourceLoader.addToClassLoader WARN Can't find (or read) directory to add to classloader: ../../../dist/ (resolved as: /mnt/ssd/jenkins/workspace/Lucene-Solr-4.x-Linux/solr/contrib/morphlines-core/src/test-files/solr/collection1/../../../dist).
   [junit4]   2> 11631 T10 oasc.SolrResourceLoader.addToClassLoader WARN Can't find (or read) directory to add to classloader: ../../../contrib/velocity/lib (resolved as: /mnt/ssd/jenkins/workspace/Lucene-Solr-4.x-Linux/solr/contrib/morphlines-core/src/test-files/solr/collection1/../../../contrib/velocity/lib).
   [junit4]   2> 11631 T10 oasc.SolrResourceLoader.addToClassLoader WARN Can't find (or read) directory to add to classloader: ../../../dist/ (resolved as: /mnt/ssd/jenkins/workspace/Lucene-Solr-4.x-Linux/solr/contrib/morphlines-core/src/test-files/solr/collection1/../../../dist).
   [junit4]   2> 11632 T10 oasc.SolrResourceLoader.addToClassLoader WARN Can't find (or read) directory to add to classloader: /non/existent/dir/yields/warning (resolved as: /non/existent/dir/yields/warning).
   [junit4]   2> 11662 T10 oasc.SolrConfig.<init> Using Lucene MatchVersion: LUCENE_4_9
   [junit4]   2> 11715 T10 oasc.SolrConfig.<init> Loaded SolrConfig: solrconfig.xml
   [junit4]   2> 11716 T10 oass.IndexSchema.readSchema Reading Solr Schema from schema.xml
   [junit4]   2> 11744 T10 oass.IndexSchema.readSchema [null] Schema name=example
   [junit4]   2> 12093 T10 oass.IndexSchema.readSchema unique key field: id
   [junit4]   2> 12126 T10 oass.FileExchangeRateProvider.reload Reloading exchange rates from file currency.xml
   [junit4]   2> 12131 T10 oass.FileExchangeRateProvider.reload Reloading exchange rates from file currency.xml
   [junit4]   2> 12325 T10 oasc.SolrResourceLoader.<init> new SolrResourceLoader for directory: '/mnt/ssd/jenkins/workspace/Lucene-Solr-4.x-Linux/solr/contrib/morphlines-core/src/test-files/solr/collection1/'
   [junit4]   2> 12367 T10 oasc.SolrConfig.initLibs Adding specified lib dirs to ClassLoader
   [junit4]   2> 12368 T10 oasc.SolrResourceLoader.addToClassLoader WARN Can't find (or read) directory to add to classloader: ../../../contrib/extraction/lib (resolved as: /mnt/ssd/jenkins/workspace/Lucene-Solr-4.x-Linux/solr/contrib/morphlines-core/src/test-files/solr/collection1/../../../contrib/extraction/lib).
   [junit4]   2> 12369 T10 oasc.SolrResourceLoader.addToClassLoader WARN Can't find (or read) directory to add to classloader: ../../../dist/ (resolved as: /mnt/ssd/jenkins/workspace/Lucene-Solr-4.x-Linux/solr/contrib/morphlines-core/src/test-files/solr/collection1/../../../dist).
   [junit4]   2> 12369 T10 oasc.SolrResourceLoader.addToClassLoader WARN Can't find (or read) directory to add to classloader: ../../../contrib/clustering/lib/ (resolved as: /mnt/ssd/jenkins/workspace/Lucene-Solr-4.x-Linux/solr/contrib/morphlines-core/src/test-files/solr/collection1/../../../contrib/clustering/lib).
   [junit4]   2> 12370 T10 oasc.SolrResourceLoader.addToClassLoader WARN Can't find (or read) directory to add to classloader: ../../../dist/ (resolved as: /mnt/ssd/jenkins/workspace/Lucene-Solr-4.x-Linux/solr/contrib/morphlines-core/src/test-files/solr/collection1/../../../dist).
   [junit4]   2> 12370 T10 oasc.SolrResourceLoader.addToClassLoader WARN Can't find (or read) directory to add to classloader: ../../../contrib/langid/lib/ (resolved as: /mnt/ssd/jenkins/workspace/Lucene-Solr-4.x-Linux/solr/contrib/morphlines-core/src/test-files/solr/collection1/../../../contrib/langid/lib).
   [junit4]   2> 12371 T10 oasc.SolrResourceLoader.addToClassLoader WARN Can't find (or read) directory to add to classloader: ../../../dist/ (resolved as: /mnt/ssd/jenkins/workspace/Lucene-Solr-4.x-Linux/solr/contrib/morphlines-core/src/test-files/solr/collection1/../../../dist).
   [junit4]   2> 12372 T10 oasc.SolrResourceLoader.addToClassLoader WARN Can't find (or read) directory to add to classloader: ../../../contrib/velocity/lib (resolved as: /mnt/ssd/jenkins/workspace/Lucene-Solr-4.x-Linux/solr/contrib/morphlines-core/src/test-files/solr/collection1/../../../contrib/velocity/lib).
   [junit4]   2> 12372 T10 oasc.SolrResourceLoader.addToClassLoader WARN Can't find (or read) directory to add to classloader: ../../../dist/ (resolved as: /mnt/ssd/jenkins/workspace/Lucene-Solr-4.x-Linux/solr/contrib/morphlines-core/src/test-files/solr/collection1/../../../dist).
   [junit4]   2> 12373 T10 oasc.SolrResourceLoader.addToClassLoader WARN Can't find (or read) directory to add to classloader: /non/existent/dir/yields/warning (resolved as: /non/existent/dir/yields/warning).
   [junit4]   2> 12412 T10 oasc.SolrConfig.<init> Using Lucene MatchVersion: LUCENE_4_9
   [junit4]   2> 12465 T10 oasc.SolrConfig.<init> Loaded SolrConfig: solrconfig.xml
   [junit4]   2> 12465 T10 oass.IndexSchema.readSchema Reading Solr Schema from schema.xml
   [junit4]   2> 12483 T10 oass.IndexSchema.readSchema [null] Schema name=example
   [junit4]   2> 12833 T10 oass.IndexSchema.readSchema unique key field: id
   [junit4]   2> 12854 T10 oass.FileExchangeRateProvider.reload Reloading exchange rates from file currency.xml
   [junit4]   2> 12859 T10 oass.FileExchangeRateProvider.reload Reloading exchange rates from file currency.xml
   [junit4]   2> ASYNC  NEW_CORE C1 name=collection1 org.apache.solr.core.SolrCore@4de3afa9
   [junit4]   2> 12885 T10 C1 oasup.LogUpdateProcessor.finish [collection1] webapp=null path=/update params={} {deleteByQuery=*:* (-1467799572832059392)} 0 2
   [junit4]   2> 12885 T10 C1 oasu.DirectUpdateHandler2.commit start commit{,optimize=false,openSearcher=true,waitSearcher=true,expungeDeletes=false,softCommit=false,prepareCommit=false}
   [junit4]   2> 12886 T10 C1 oasu.DirectUpdateHandler2.commit No uncommitted changes. Skipping IW.commit.
   [junit4]   2> 12886 T10 C1 oasc.SolrCore.openNewSearcher SolrIndexSearcher has not changed - not re-opening: org.apache.solr.search.SolrIndexSearcher
   [junit4]   2> 12887 T10 C1 oasu.DirectUpdateHandler2.commit end_commit_flush
   [junit4]   2> 12888 T10 C1 oasup.LogUpdateProcessor.finish [collection1] webapp=null path=/update params={commit=true&softCommit=false&waitSearcher=true} {commit=} 0 3
   [junit4]   2> 13519 T10 C1 oasup.LogUpdateProcessor.finish [collection1] webapp=null path=/update params={} {add=[testPPT_various.ppt#0 (1467799573416116224)]} 0 81
   [junit4]   2> ASYNC  NEW_CORE C2 name=collection1 org.apache.solr.core.SolrCore@4de3afa9
   [junit4]   2> 13530 T10 C2 oasu.DirectUpdateHandler2.commit start commit{,optimize=false,openSearcher=true,waitSearcher=true,expungeDeletes=false,softCommit=true,prepareCommit=false}
   [junit4]   2> 13607 T10 C2 oass.SolrIndexSearcher.<init> Opening Searcher@44069da3[collection1] main
   [junit4]   2> 13610 T10 C2 oasu.DirectUpdateHandler2.commit end_commit_flush
   [junit4]   2> 13610 T12 oasc.QuerySenderListener.newSearcher QuerySenderListener sending requests to Searcher@44069da3[collection1] main{StandardDirectoryReader(segments_1:3:nrt _0(4.9):C1)}
   [junit4]   2> 13611 T12 oasc.QuerySenderListener.newSearcher QuerySenderListener done.
   [junit4]   2> 13611 T12 oasc.SolrCore.registerSearcher [collection1] Registered new searcher Searcher@44069da3[collection1] main{StandardDirectoryReader(segments_1:3:nrt _0(4.9):C1)}
   [junit4]   2> 13613 T10 C2 oasup.LogUpdateProcessor.finish [collection1] webapp=null path=/update params={commit=true&softCommit=true&waitSearcher=true} {commit=} 0 83
   [junit4]   2> 13623 T10 C2 oasc.SolrCore.execute [collection1] webapp=null path=/select params={q=*%3A*&rows=2147483647} hits=1 status=0 QTime=8 
   [junit4]   2> 15116 T10 C2 oasup.LogUpdateProcessor.finish [collection1] webapp=null path=/update params={} {add=[testPPT_various.pptx#0 (1467799575164092416)]} 0 10
   [junit4]   2> 15117 T10 C2 oasu.DirectUpdateHandler2.commit start commit{,optimize=false,openSearcher=true,waitSearcher=true,expungeDeletes=false,softCommit=true,prepareCommit=false}
   [junit4]   2> 15150 T10 C2 oass.SolrIndexSearcher.<init> Opening Searcher@247eb64f[collection1] main
   [junit4]   2> 15150 T10 C2 oasu.DirectUpdateHandler2.commit end_commit_flush
   [junit4]   2> 15151 T12 oasc.QuerySenderListener.newSearcher QuerySenderListener sending requests to Searcher@247eb64f[collection1] main{StandardDirectoryReader(segments_1:5:nrt _0(4.9):C1 _1(4.9):C1)}
   [junit4]   2> 15151 T12 oasc.QuerySenderListener.newSearcher QuerySenderListener done.
   [junit4]   2> 15152 T12 oasc.SolrCore.registerSearcher [collection1] Registered new searcher Searcher@247eb64f[collection1] main{StandardDirectoryReader(segments_1:5:nrt _0(4.9):C1 _1(4.9):C1)}
   [junit4]   2> 15152 T10 C2 oasup.LogUpdateProcessor.finish [collection1] webapp=null path=/update params={commit=true&softCommit=true&waitSearcher=true} {commit=} 0 35
   [junit4]   2> 15153 T10 C2 oasc.SolrCore.execute [collection1] webapp=null path=/select params={q=*%3A*&rows=2147483647} hits=2 status=0 QTime=0 
   [junit4]   2> ASYNC  NEW_CORE C3 name=collection1 org.apache.solr.core.SolrCore@4de3afa9
   [junit4]   2> 15371 T10 C3 oasup.LogUpdateProcessor.finish [collection1] webapp=null path=/update params={} {add=[testEXCEL.xlsx#0 (1467799575434625024)]} 0 6
   [junit4]   2> 15372 T10 C3 oasu.DirectUpdateHandler2.commit start commit{,optimize=false,openSearcher=true,waitSearcher=true,expungeDeletes=false,softCommit=true,prepareCommit=false}
   [junit4]   2> 15385 T10 C3 oass.SolrIndexSearcher.<init> Opening Searcher@5295436a[collection1] main
   [junit4]   2> 15386 T10 C3 oasu.DirectUpdateHandler2.commit end_commit_flush
   [junit4]   2> 15386 T12 oasc.QuerySenderListener.newSearcher QuerySenderListener sending requests to Searcher@5295436a[collection1] main{StandardDirectoryReader(segments_1:7:nrt _0(4.9):C1 _1(4.9):C1 _2(4.9):C1)}
   [junit4]   2> 15387 T12 oasc.QuerySenderListener.newSearcher QuerySenderListener done.
   [junit4]   2> 15387 T12 oasc.SolrCore.registerSearcher [collection1] Registered new searcher Searcher@5295436a[collection1] main{StandardDirectoryReader(segments_1:7:nrt _0(4.9):C1 _1(4.9):C1 _2(4.9):C1)}
   [junit4]   2> 15388 T10 C3 oasup.LogUpdateProcessor.finish [collection1] webapp=null path=/update params={commit=true&softCommit=true&waitSearcher=true} {commit=} 0 16
   [junit4]   2> 15389 T10 C3 oasc.SolrCore.execute [collection1] webapp=null path=/select params={q=*%3A*&rows=2147483647} hits=3 status=0 QTime=0 
   [junit4]   2> 15677 T10 C3 oasup.LogUpdateProcessor.finish [collection1] webapp=null path=/update params={} {add=[testEXCEL.xls#0 (1467799575754440704)]} 0 7
   [junit4]   2> 15678 T10 C3 oasu.DirectUpdateHandler2.commit start commit{,optimize=false,openSearcher=true,waitSearcher=true,expungeDeletes=false,softCommit=true,prepareCommit=false}
   [junit4]   2> 15691 T10 C3 oass.SolrIndexSearcher.<init> Opening Searcher@5261b67f[collection1] main
   [junit4]   2> 15692 T10 C3 oasu.DirectUpdateHandler2.commit end_commit_flush
   [junit4]   2> 15692 T12 oasc.QuerySenderListener.newSearcher QuerySenderListener sending requests to Searcher@5261b67f[collection1] main{StandardDirectoryReader(segments_1:9:nrt _0(4.9):C1 _1(4.9):C1 _2(4.9):C1 _3(4.9):C1)}
   [junit4]   2> 15693 T12 oasc.QuerySenderListener.newSearcher QuerySenderListener done.
   [junit4]   2> 15694 T12 oasc.SolrCore.registerSearcher [collection1] Registered new searcher Searcher@5261b67f[collection1] main{StandardDirectoryReader(segments_1:9:nrt _0(4.9):C1 _1(4.9):C1 _2(4.9):C1 _3(4.9):C1)}
   [junit4]   2> 15694 T10 C3 oasup.LogUpdateProcessor.finish [collection1] webapp=null path=/update params={commit=true&softCommit=true&waitSearcher=true} {commit=} 0 16
   [junit4]   2> 15695 T10 C3 oasc.SolrCore.execute [collection1] webapp=null path=/select params={q=*%3A*&rows=2147483647} hits=4 status=0 QTime=0 
   [junit4]   2> 15896 T10 C3 oasup.LogUpdateProcessor.finish [collection1] webapp=null path=/update params={} {add=[testPages.pages#0 (1467799575975690240)]} 0 16
   [junit4]   2> 15897 T10 C3 oasu.DirectUpdateHandler2.commit start commit{,optimize=false,openSearcher=true,waitSearcher=true,expungeDeletes=false,softCommit=true,prepareCommit=false}
   [junit4]   2> 15924 T10 C3 oass.SolrIndexSearcher.<init> Opening Searcher@71e2a099[collection1] main
   [junit4]   2> 15925 T10 C3 oasu.DirectUpdateHandler2.commit end_commit_flush
   [junit4]   2> 15925 T12 oasc.QuerySenderListener.newSearcher QuerySenderListener sending requests to Searcher@71e2a099[collection1] main{StandardDirectoryReader(segments_1:11:nrt _0(4.9):C1 _1(4.9):C1 _2(4.9):C1 _3(4.9):C1 _4(4.9):C1)}
   [junit4]   2> 15926 T12 oasc.QuerySenderListener.newSearcher QuerySenderListener done.
   [junit4]   2> 15926 T12 oasc.SolrCore.registerSearcher [collection1] Registered new searcher Searcher@71e2a099[collection1] main{StandardDirectoryReader(segments_1:11:nrt _0(4.9):C1 _1(4.9):C1 _2(4.9):C1 _3(4.9):C1 _4(4.9):C1)}
   [junit4]   2> 15927 T10 C3 oasup.LogUpdateProcessor.finish [collection1] webapp=null path=/update params={commit=true&softCommit=true&waitSearcher=true} {commit=} 0 30
   [junit4]   2> 15928 T10 C3 oasc.SolrCore.execute [collection1] webapp=null path=/select params={q=*%3A*&rows=2147483647} hits=5 status=0 QTime=0 
   [junit4]   2> 16380 T10 C3 oasup.LogUpdateProcessor.finish [collection1] webapp=null path=/update params={} {add=[testRTFVarious.rtf#0 (1467799576490541056)]} 0 9
   [junit4]   2> 16381 T10 C3 oasu.DirectUpdateHandler2.commit start commit{,optimize=false,openSearcher=true,waitSearcher=true,expungeDeletes=false,softCommit=true,prepareCommit=false}
   [junit4]   2> 16396 T10 C3 oass.SolrIndexSearcher.<init> Opening Searcher@6ac89eea[collection1] main
   [junit4]   2> 16398 T10 C3 oasu.DirectUpdateHandler2.commit end_commit_flush
   [junit4]   2> 16398 T12 oasc.QuerySenderListener.newSearcher QuerySenderListener sending requests to Searcher@6ac89eea[collection1] main{StandardDirectoryReader(segments_1:13:nrt _0(4.9):C1 _1(4.9):C1 _2(4.9):C1 _3(4.9):C1 _4(4.9):C1 _5(4.9):C1)}
   [junit4]   2> 16399 T12 oasc.QuerySenderListener.newSearcher QuerySenderListener done.
   [junit4]   2> 16399 T12 oasc.SolrCore.registerSearcher [collection1] Registered new searcher Searcher@6ac89eea[collection1] main{StandardDirectoryReader(segments_1:13:nrt _0(4.9):C1 _1(4.9):C1 _2(4.9):C1 _3(4.9):C1 _4(4.9):C1 _5(4.9):C1)}
   [junit4]   2> 16400 T10 C3 oasup.LogUpdateProcessor.finish [collection1] webapp=null path=/update params={commit=true&softCommit=true&waitSearcher=true} {commit=} 0 19
   [junit4]   2> 16402 T10 C3 oasc.SolrCore.execute [collection1] webapp=null path=/select params={q=*%3A*&rows=2147483647} hits=6 status=0 QTime=1 
   [junit4]   2> 16449 T10 C3 oasup.LogUpdateProcessor.finish [collection1] webapp=null path=/update params={} {add=[complex.mbox#0 (1467799576550309888)]} 0 22
   [junit4]   2> 16450 T10 C3 oasu.DirectUpdateHandler2.commit start commit{,optimize=false,openSearcher=true,waitSearcher=true,expungeDeletes=false,softCommit=true,prepareCommit=false}
   [junit4]   2> 16472 T10 C3 oass.SolrIndexSearcher.<init> Opening Searcher@289efc97[collection1] main
   [junit4]   2> 16474 T10 C3 oasu.DirectUpdateHandler2.commit end_commit_flush
   [junit4]   2> 16474 T12 oasc.QuerySenderListener.newSearcher QuerySenderListener sending requests to Searcher@289efc97[collection1] main{StandardDirectoryReader(segments_1:15:nrt _0(4.9):C1 _1(4.9):C1 _2(4.9):C1 _3(4.9):C1 _4(4.9):C1 _5(4.9):C1 _6(4.9):C1)}
   [junit4]   2> 16475 T12 oasc.QuerySenderListener.newSearcher QuerySenderListener done.
   [junit4]   2> 16475 T12 oasc.SolrCore.registerSearcher [collection1] Registered new searcher Searcher@289efc97[collection1] main{StandardDirectoryReader(segments_1:15:nrt _0(4.9):C1 _1(4.9):C1 _2(4.9):C1 _3(4.9):C1 _4(4.9):C1 _5(4.9):C1 _6(4.9):C1)}
   [junit4]   2> 16476 T10 C3 oasup.LogUpdateProcessor.finish [collection1] webapp=null path=/update params={commit=true&softCommit=true&waitSearcher=true} {commit=} 0 26
   [junit4]   2> 16477 T10 C3 oasc.SolrCore.execute [collection1] webapp=null path=/select params={q=*%3A*&rows=2147483647} hits=7 status=0 QTime=0 
   [junit4]   2> 16568 T10 C3 oasup.LogUpdateProcessor.finish [collection1] webapp=null path=/update params={} {add=[test-outlook.msg#0 (1467799576686624768)]} 0 10
   [junit4]   2> 16569 T10 C3 oasu.DirectUpdateHandler2.commit start commit{,optimize=false,openSearcher=true,waitSearcher=true,expungeDeletes=false,softCommit=true,prepareCommit=false}
   [junit4]   2> 16580 T10 C3 oass.SolrIndexSearcher.<init> Opening Searcher@74f4b0db[collection1] main
   [junit4]   2> 16581 T10 C3 oasu.DirectUpdateHandler2.commit end_commit_flush
   [junit4]   2> 16581 T12 oasc.QuerySenderListener.newSearcher QuerySenderListener sending requests to Searcher@74f4b0db[collection1] main{StandardDirectoryReader(segments_1:17:nrt _0(4.9):C1 _1(4.9):C1 _2(4.9):C1 _3(4.9):C1 _4(4.9):C1 _5(4.9):C1 _6(4.9):C1 _7(4.9):C1)}
   [junit4]   2> 16582 T12 oasc.QuerySenderListener.newSearcher QuerySenderListener done.
   [junit4]   2> 16582 T12 oasc.SolrCore.registerSearcher [collection1] Registered new searcher Searcher@74f4b0db[collection1] main{StandardDirectoryReader(segments_1:17:nrt _0(4.9):C1 _1(4.9):C1 _2(4.9):C1 _3(4.9):C1 _4(4.9):C1 _5(4.9):C1 _6(4.9):C1 _7(4.9):C1)}
   [junit4]   2> 16583 T10 C3 oasup.LogUpdateProcessor.finish [collection1] webapp=null path=/update params={commit=true&softCommit=true&waitSearcher=true} {commit=} 0 15
   [junit4]   2> 16584 T10 C3 oasc.SolrCore.execute [collection1] webapp=null path=/select params={q=*%3A*&rows=2147483647} hits=8 status=0 QTime=0 
   [junit4]   2> 16623 T10 C3 oasup.LogUpdateProcessor.finish [collection1] webapp=null path=/update params={} {add=[testEMLX.emlx#0 (1467799576746393600)]} 0 6
   [junit4]   2> 16624 T10 C3 oasu.DirectUpdateHandler2.commit start commit{,optimize=false,openSearcher=true,waitSearcher=true,expungeDeletes=false,softCommit=true,prepareCommit=false}
   [junit4]   2> 16635 T10 C3 oass.SolrIndexSearcher.<init> Opening Searcher@7dec4e95[collection1] main
   [junit4]   2> 16636 T10 C3 oasu.DirectUpdateHandler2.commit end_commit_flush
   [junit4]   2> 16636 T12 oasc.QuerySenderListener.newSearcher QuerySenderListener sending requests to Searcher@7dec4e95[collection1] main{StandardDirectoryReader(segments_1:19:nrt _0(4.9):C1 _1(4.9):C1 _2(4.9):C1 _3(4.9):C1 _4(4.9):C1 _5(4.9):C1 _6(4.9):C1 _7(4.9):C1 _8(4.9):C1)}
   [junit4]   2> 16637 T12 oasc.QuerySenderListener.newSearcher QuerySenderListener done.
   [junit4]   2> 16637 T12 oasc.SolrCore.registerSearcher [collection1] Registered new searcher Searcher@7dec4e95[collection1] main{StandardDirectoryReader(segments_1:19:nrt _0(4.9):C1 _1(4.9):C1 _2(4.9):C1 _3(4.9):C1 _4(4.9):C1 _5(4.9):C1 _6(4.9):C1 _7(4.9):C1 _8(4.9):C1)}
   [junit4]   2> 16638 T10 C3 oasup.LogUpdateProcessor.finish [collection1] webapp=null path=/update params={commit=true&softCommit=true&waitSearcher=true} {commit=} 0 14
   [junit4]   2> 16639 T10 C3 oasc.SolrCore.execute [collection1] webapp=null path=/select params={q=*%3A*&rows=2147483647} hits=9 status=0 QTime=0 
   [junit4]   2> 16841 T10 C3 oasup.LogUpdateProcessor.finish [collection1] webapp=null path=/update params={} {add=[testRFC822#0 (1467799576973934592)]} 0 8
   [junit4]   2> 16842 T10 C3 oasu.DirectUpdateHandler2.commit start commit{,optimize=false,openSearcher=true,waitSearcher=true,expungeDeletes=false,softCommit=true,prepareCommit=false}
   [junit4]   2> 16910 T10 C3 oass.SolrIndexSearcher.<init> Opening Searcher@76c1b53a[collection1] main
   [junit4]   2> 16911 T10 C3 oasu.DirectUpdateHandler2.commit end_commit_flush
   [junit4]   2> 16911 T12 oasc.QuerySenderListener.newSearcher QuerySenderListener sending requests to Searcher@76c1b53a[collection1] main{StandardDirectoryReader(segments_1:21:nrt _0(4.9):C1 _1(4.9):C1 _2(4.9):C1 _3(4.9):C1 _4(4.9):C1 _5(4.9):C1 _6(4.9):C1 _7(4.9):C1 _8(4.9):C1 _9(4.9):C1)}
   [junit4]   2> 16912 T12 oasc.QuerySenderListener.newSearcher QuerySenderListener done.
   [junit4]   2> 16913 T12 oasc.SolrCore.registerSearcher [collection1] Registered new searcher Searcher@76c1b53a[collection1] main{StandardDirectoryReader(segments_1:21:nrt _0(4.9):C1 _1(4.9):C1 _2(4.9):C1 _3(4.9):C1 _4(4.9):C1 _5(4.9):C1 _6(4.9):C1 _7(4.9):C1 _8(4.9):C1 _9(4.9):C1)}
   [junit4]   2> 16915 T10 C3 oasup.LogUpdateProcessor.finish [collection1] webapp=null path=/update params={commit=true&softCommit=true&waitSearcher=true} {commit=} 0 73
   [junit4]   2> 16917 T10 C3 oasc.SolrCore.execute [collection1] webapp=null path=/select params={q=*%3A*&rows=2147483647} hits=10 status=0 QTime=0 
   [junit4]   2> 17105 T10 C3 oasup.LogUpdateProcessor.finish [collection1] webapp=null path=/update params={} {add=[rsstest.rss#0 (1467799577256001536)]} 0 2
   [junit4]   2> 17106 T10 C3 oasu.DirectUpdateHandler2.commit start commit{,optimize=false,openSearcher=true,waitSearcher=true,expungeDeletes=false,softCommit=true,prepareCommit=false}
   [junit4]   2> 17115 T10 C3 oass.SolrIndexSearcher.<init> Opening Searcher@e50823f[collection1] main
   [junit4]   2> 17116 T10 C3 oasu.DirectUpdateHandler2.commit end_commit_flush
   [junit4]   2> 17116 T12 oasc.QuerySenderListener.newSearcher QuerySenderListener sending requests to Searcher@e50823f[collection1] main{StandardDirectoryReader(segments_1:25:nrt _a(4.9):C10 _b(4.9):C1)}
   [junit4]   2> 17117 T12 oasc.QuerySenderListener.newSearcher QuerySenderListener done.
   [junit4]   2> 17118 T12 oasc.SolrCore.registerSearcher [collection1] Registered new searcher Searcher@e50823f[collection1] main{StandardDirectoryReader(segments_1:25:nrt _a(4.9):C10 _b(4.9):C1)}
   [junit4]   2> 17123 T10 C3 oasup.LogUpdateProcessor.finish [collection1] webapp=null path=/update params={commit=true&softCommit=true&waitSearcher=true} {commit=} 0 17
   [junit4]   2> 17124 T10 C3 oasc.SolrCore.execute [collection1] webapp=null path=/select params={q=*%3A*&rows=2147483647} hits=11 status=0 QTime=0 
   [junit4]   2> 17163 T10 C3 oasup.LogUpdateProcessor.finish [collection1] webapp=null path=/update params={} {add=[testMP3i18n.mp3#0 (1467799577315770368)]} 0 4
   [junit4]   2> 17164 T10 C3 oasu.DirectUpdateHandler2.commit start commit{,optimize=false,openSearcher=true,waitSearcher=true,expungeDeletes=false,softCommit=true,prepareCommit=false}
   [junit4]   2> 17172 T10 C3 oass.SolrIndexSearcher.<init> Opening Searcher@22adccd6[collection1] main
   [junit4]   2> 17173 T10 C3 oasu.DirectUpdateHandler2.commit end_commit_flush
   [junit4]   2> 17173 T12 oasc.QuerySenderListener.newSearcher QuerySenderListener sending requests to Searcher@22adccd6[collection1] main{StandardDirectoryReader(segments_1:27:nrt _a(4.9):C10 _b(4.9):C1 _c(4.9):C1)}
   [junit4]   2> 17174 T12 oasc.QuerySenderListener.newSearcher QuerySenderListener done.
   [junit4]   2> 17175 T12 oasc.SolrCore.registerSearcher [collection1] Registered new searcher Searcher@22adccd6[collection1] main{StandardDirectoryReader(segments_1:27:nrt _a(4.9):C10 _b(4.9):C1 _c(4.9):C1)}
   [junit4]   2> 17176 T10 C3 oasup.LogUpdateProcessor.finish [collection1] webapp=null path=/update params={commit=true&softCommit=true&waitSearcher=true} {commit=} 0 12
   [junit4]   2> 17177 T10 C3 oasc.SolrCore.execute [collection1] webapp=null path=/select params={q=*%3A*&rows=2147483647} hits=12 status=0 QTime=0 
   [junit4]   2> 17250 T10 C3 oasup.LogUpdateProcessor.finish [collection1] webapp=null path=/update params={} {add=[testAIFF.aif#0 (1467799577409093632)]} 0 2
   [junit4]   2> 17251 T10 C3 oasu.DirectUpdateHandler2.commit start commit{,optimize=false,openSearcher=true,waitSearcher=true,expungeDeletes=false,softCommit=true,prepareCommit=false}
   [junit4]   2> 17257 T10 C3 oass.SolrIndexSearcher.<init> Opening Searcher@235f6196[collection1] main
   [junit4]   2> 17257 T10 C3 oasu.DirectUpdateHandler2.commit end_commit_flush
   [junit4]   2> 17258 T12 oasc.QuerySenderListener.newSearcher QuerySenderListener sending requests to Searcher@235f6196[collection1] main{StandardDirectoryReader(segments_1:29:nrt _a(4.9):C10 _b(4.9):C1 _c(4.9):C1 _d(4.9):C1)}
   [junit4]   2> 17258 T12 oasc.QuerySenderListener.newSearcher QuerySenderListener done.
   [junit4]   2> 17259 T12 oasc.SolrCore.registerSearcher [collection1] Registered new searcher Searcher@235f6196[collection1] main{StandardDirectoryReader(segments_1:29:nrt _a(4.9):C10 _b(4.9):C1 _c(4.9):C1 _d(4.9):C1)}
   [junit4]   2> 17260 T10 C3 oasup.LogUpdateProcessor.finish [collection1] webapp=null path=/update params={commit=true&softCommit=true&waitSearcher=true} {commit=} 0 9
   [junit4]   2> 17261 T10 C3 oasc.SolrCore.execute [collection1] webapp=null path=/select params={q=*%3A*&rows=2147483647} hits=13 status=0 QTime=1 
   [junit4]   2> 17285 T10 C3 oasup.LogUpdateProcessor.finish [collection1] webapp=null path=/update params={} {add=[testFLAC.flac#0 (1467799577444745216)]} 0 2
   [junit4]   2> 17286 T10 C3 oasu.DirectUpdateHandler2.commit start commit{,optimize=false,openSearcher=true,waitSearcher=true,expungeDeletes=false,softCommit=true,prepareCommit=false}
   [junit4]   2> 17292 T10 C3 oass.SolrIndexSearcher.<init> Opening Searcher@4073350c[collection1] main
   [junit4]   2> 17293 T10 C3 oasu.DirectUpdateHandler2.commit end_commit_flush
   [junit4]   2> 17293 T12 oasc.QuerySenderListener.newSearcher QuerySenderListener sending requests to Searcher@4073350c[collection1] main{StandardDirectoryReader(segments_1:31:nrt _a(4.9):C10 _b(4.9):C1 _c(4.9):C1 _d(4.9):C1 _e(4.9):C1)}
   [junit4]   2> 17294 T12 oasc.QuerySenderListener.newSearcher QuerySenderListener done.
   [junit4]   2> 17294 T12 oasc.SolrCore.registerSearcher [collection1] Registered new searcher Searcher@4073350c[collection1] main{StandardDirectoryReader(segments_1:31:nrt _a(4.9):C10 _b(4.9):C1 _c(4.9):C1 _d(4.9):C1 _e(4.9):C1)}
   [junit4]   2> 17295 T10 C3 oasup.LogUpdateProcessor.finish [collection1] webapp=null path=/update params={commit=true&softCommit=true&waitSearcher=true} {commit=} 0 9
   [junit4]   2> 17296 T10 C3 oasc.SolrCore.execute [collection1] webapp=null path=/select params={q=*%3A*&rows=2147483647} hits=14 status=0 QTime=0 
   [junit4]   2> 17433 T10 C3 oasup.LogUpdateProcessor.finish [collection1] webapp=null path=/update params={} {add=[testMP4.m4a#0 (1467799577598885888)]} 0 4
   [junit4]   2> 17434 T10 C3 oasu.DirectUpdateHandler2.commit start commit{,optimize=false,openSearcher=true,waitSearcher=true,expungeDeletes=false,softCommit=true,prepareCommit=false}
   [junit4]   2> 17440 T10 C3 oass.SolrIndexSearcher.<init> Opening Searcher@7046dc2d[collection1] main
   [junit4]   2> 17441 T10 C3 oasu.DirectUpdateHandler2.commit end_commit_flush
   [junit4]   2> 17441 T12 oasc.QuerySenderListener.newSearcher QuerySenderListener sending requests to Searcher@7046dc2d[collection1] main{StandardDirectoryReader(segments_1:33:nrt _a(4.9):C10 _b(4.9):C1 _c(4.9):C1 _d(4.9):C1 _e(4.9):C1 _f(4.9):C1)}
   [junit4]   2> 17442 T12 oasc.QuerySenderListener.newSearcher QuerySenderListener done.
   [junit4]   2> 17443 T12 oasc.SolrCore.registerSearcher [collection1] Registered new searcher Searcher@7046dc2d[collection1] main{StandardDirectoryReader(segments_1:33:nrt _a(4.9):C10 _b(4.9):C1 _c(4.9):C1 _d(4.9):C1 _e(4.9):C1 _f(4.9):C1)}
   [junit4]   2> 17444 T10 C3 oasup.LogUpdateProcessor.finish [collection1] webapp=null path=/update params={commit=true&softCommit=true&waitSearcher=true} {commit=} 0 10
   [junit4]   2> 17445 T10 C3 oasc.SolrCore.execute [collection1] webapp=null path=/select params={q=*%3A*&rows=2147483647} hits=15 status=0 QTime=1 
   [junit4]   2> 17456 T10 C3 oasup.LogUpdateProcessor.finish [collection1] webapp=null path=/update params={} {add=[testWAV.wav#0 (1467799577625100288)]} 0 2
   [junit4]   2> 17457 T10 C3 oasu.DirectUpdateHandler2.commit start commit{,optimize=false,openSearcher=true,waitSearcher=true,expungeDeletes=false,softCommit=true,prepareCommit=false}
   [junit4]   2> 17463 T10 C3 oass.SolrIndexSearcher.<init> Opening Searcher@17d1f820[collection1] main
   [junit4]   2> 17464 T10 C3 oasu.DirectUpdateHandler2.commit end_commit_flush
   [junit4]   2> 17464 T12 oasc.QuerySenderListener.newSearcher QuerySenderListener sending requests to Searcher@17d1f820[collection1] main{StandardDirectoryReader(segments_1:35:nrt _a(4.9):C10 _b(4.9):C1 _c(4.9):C1 _d(4.9):C1 _e(4.9):C1 _f(4.9):C1 _g(4.9):C1)}
   [junit4]   2> 17465 T12 oasc.QuerySenderListener.newSearcher QuerySenderListener done.
   [junit4]   2> 17465 T12 oasc.SolrCore.registerSearcher [collection1] Registered new searcher Searcher@17d1f820[collection1] main{StandardDirectoryReader(segments_1:35:nrt _a(4.9):C10 _b(4.9):C1 _c(4.9):C1 _d(4.9):C1 _e(4.9):C1 _f(4.9):C1 _g(4.9):C1)}
   [junit4]   2> 17466 T10 C3 oasup.LogUpdateProcessor.finish [collection1] webapp=null path=/update params={commit=true&softCommit=true&waitSearcher=true} {commit=} 0 9
   [junit4]   2> 17467 T10 C3 oasc.SolrCore.execute [collection1] webapp=null path=/select params={q=*%3A*&rows=2147483647} hits=16 status=0 QTime=0 
   [junit4]   2> 17495 T10 C3 oasup.LogUpdateProcessor.finish [collection1] webapp=null path=/update params={} {add=[testFLV.flv#0 (1467799577664946176)]} 0 3
   [junit4]   2> 17496 T10 C3 oasu.DirectUpdateHandler2.commit start commit{,optimize=false,openSearcher=true,waitSearcher=true,expungeDeletes=false,softCommit=true,prepareCommit=false}
   [junit4]   2> 17502 T10 C3 oass.SolrIndexSearcher.<init> Opening Searcher@159ba1f0[collection1] main
   [junit4]   2> 17503 T10 C3 oasu.DirectUpdateHandler2.commit end_commit_flush
   [junit4]   2> 17503 T12 oasc.QuerySenderListener.newSearcher QuerySenderListener sending requests to Searcher@159ba1f0[collection1] main{StandardDirectoryReader(segments_1:37:nrt _a(4.9):C10 _b(4.9):C1 _c(4.9):C1 _d(4.9):C1 _e(4.9):C1 _f(4.9):C1 _g(4.9):C1 _h(4.9):C1)}
   [junit4]   2> 17504 T12 oasc.QuerySenderListener.newSearcher QuerySenderListener done.
   [junit4]   2> 17504 T12 oasc.SolrCore.registerSearcher [collection1] Registered new searcher Searcher@159ba1f0[collection1] main{StandardDirectoryReader(segments_1:37:nrt _a(4.9):C10 _b(4.9):C1 _c(4.9):C1 _d(4.9):C1 _e(4.9):C1 _f(4.9):C1 _g(4.9):C1 _h(4.9):C1)}
   [junit4]   2> 17505 T10 C3 oasup.LogUpdateProcessor.finish [collection1] webapp=null path=/update params={commit=true&softCommit=true&waitSearcher=true} {commit=} 0 9
   [junit4]   2> 17506 T10 C3 oasc.SolrCore.execute [collection1] webapp=null path=/select params={q=*%3A*&rows=2147483647} hits=17 status=0 QTime=0 
   [junit4]   2> 17514 T10 C3 oasup.LogUpdateProcessor.finish [collection1] webapp=null path=/update params={} {add=[testBMP.bmp#0 (1467799577685917696)]} 0 2
   [junit4]   2> 17515 T10 C3 oasu.DirectUpdateHandler2.commit start commit{,optimize=false,openSearcher=true,waitSearcher=true,expungeDeletes=false,softCommit=true,prepareCommit=false}
   [junit4]   2> 17521 T10 C3 oass.SolrIndexSearcher.<init> Opening Searcher@6453569a[collection1] main
   [junit4]   2> 17522 T10 C3 oasu.DirectUpdateHandler2.commit end_commit_flush
   [junit4]   2> 17522 T12 oasc.QuerySenderListener.newSearcher QuerySenderListener sending requests to Searcher@6453569a[collection1] main{StandardDirectoryReader(segments_1:39:nrt _a(4.9):C10 _b(4.9):C1 _c(4.9):C1 _d(4.9):C1 _e(4.9):C1 _f(4.9):C1 _g(4.9):C1 _h(4.9):C1 _i(4.9):C1)}
   [junit4]   2> 17523 T12 oasc.QuerySenderListener.newSearcher QuerySenderListener done.
   [junit4]   2> 17523 T12 oasc.SolrCore.registerSearcher [collection1] Registered new searcher Searcher@6453569a[collection1] main{StandardDirectoryReader(segments_1:39:nrt _a(4.9):C10 _b(4.9):C1 _c(4.9):C1 _d(4.9):C1 _e(4.9):C1 _f(4.9):C1 _g(4.9):C1 _h(4.9):C1 _i(4.9):C1)}
   [junit4]   2> 17524 T10 C3 oasup.LogUpdateProcessor.finish [collection1] webapp=null path=/update params={commit=true&softCommit=true&waitSearcher=true} {commit=} 0 9
   [junit4]   2> 17526 T10 C3 oasc.SolrCore.execute [collection1] webapp=null path=/select params={q=*%3A*&rows=2147483647} hits=18 status=0 QTime=0 
   [junit4]   2> 17533 T10 C3 oasup.LogUpdateProcessor.finish [collection1] webapp=null path=/update params={} {add=[testPNG.png#0 (1467799577705840640)]} 0 2
   [junit4]   2> 17534 T10 C3 oasu.DirectUpdateHandler2.commit start commit{,optimize=false,openSearcher=true,waitSearcher=true,expungeDeletes=false,softCommit=true,prepareCommit=false}
   [junit4]   2> 17540 T10 C3 oass.SolrIndexSearcher.<init> Opening Searcher@6529d860[collection1] main
   [junit4]   2> 17541 T10 C3 oasu.DirectUpdateHandler2.commit end_commit_flush
   [junit4]   2> 17542 T12 oasc.QuerySenderListener.newSearcher QuerySenderListener sending requests to Searcher@6529d860[collection1] main{StandardDirectoryReader(segments_1:41:nrt _a(4.9):C10 _b(4.9):C1 _c(4.9):C1 _d(4.9):C1 _e(4.9):C1 _f(4.9):C1 _g(4.9):C1 _h(4.9):C1 _i(4.9):C1 _j(4.9):C1)}
   [junit4]   2> 17542 T12 oasc.QuerySenderListener.newSearcher QuerySenderListener done.
   [junit4]   2> 17543 T12 oasc.SolrCore.registerSearcher [collection1] Registered new searcher Searcher@6529d860[collection1] main{StandardDirectoryReader(segments_1:41:nrt _a(4.9):C10 _b(4.9):C1 _c(4.9):C1 _d(4.9):C1 _e(4.9):C1 _f(4.9):C1 _g(4.9):C1 _h(4.9):C1 _i(4.9):C1 _j(4.9):C1)}
   [junit4]   2> 17544 T10 C3 oasup.LogUpdateProcessor.finish [collection1] webapp=null path=/update params={commit=true&softCommit=true&waitSearcher=true} {commit=} 0 10
   [junit4]   2> 17545 T10 C3 oasc.SolrCore.execute [collection1] webapp=null path=/select params={q=*%3A*&rows=2147483647} hits=19 status=0 QTime=0 
   [junit4]   2> 17560 T10 C3 oasup.LogUpdateProcessor.finish [collection1] webapp=null path=/update params={} {add=[testPSD.psd#0 (1467799577734152192)]} 0 2
   [junit4]   2> 17561 T10 C3 oasu.DirectUpdateHandler2.commit start commit{,optimize=false,openSearcher=true,waitSearcher=true,expungeDeletes=false,softCommit=true,prepareCommit=false}
   [junit4]   2> 17570 T10 C3 oass.SolrIndexSearcher.<init> Opening Searcher@58421d6c[collection1] main
   [junit4]   2> 17570 T10 C3 oasu.DirectUpdateHandler2.commit end_commit_flush
   [junit4]   2> 17571 T12 oasc.QuerySenderListener.newSearcher QuerySenderListener sending requests to Searcher@58421d6c[collection1] main{StandardDirectoryReader(segments_1:44:nrt _a(4.9):C10 _b(4.9):C1 _c(4.9):C1 _d(4.9):C1 _e(4.9):C1 _f(4.9):C1 _g(4.9):C1 _h(4.9):C1 _i(4.9):C1 _j(4.9):C1 _l(4.9):C1)}
   [junit4]   2> 17571 T12 oasc.QuerySenderListener.newSearcher QuerySenderListener done.
   [junit4]   2> 17572 T12 oasc.SolrCore.registerSearcher [collection1] Registered new searcher Searcher@58421d6c[collection1] main{StandardDirectoryReader(segments_1:44:nrt _a(4.9):C10 _b(4.9):C1 _c(4.9):C1 _d(4.9):C1 _e(4.9):C1 _f(4.9):C1 _g(4.9):C1 _h(4.9):C1 _i(4.9):C1 _j(4.9):C1 _l(4.9):C1)}
   [junit4]   2> 17573 T10 C3 oasup.LogUpdateProcessor.finish [collection1] webapp=null path=/update params={commit=true&softCommit=true&waitSearcher=true} {commit=} 0 12
   [junit4]   2> 17574 T10 C3 oasc.SolrCore.execute [collection1] webapp=null path=/select params={q=*%3A*&rows=2147483647} hits=20 status=0 QTime=1 
   [junit4]   2> ASYNC  NEW_CORE C4 name=collection1 org.apache.solr.core.SolrCore@4de3afa9
   [junit4]   2> 17640 T10 C4 oasup.LogUpdateProcessor.finish [collection1] webapp=null path=/update params={} {add=[testSVG.svg#0 (1467799577816989696)]} 0 2
   [junit4]   2> 17641 T10 C4 oasu.DirectUpdateHandler2.commit start commit{,optimize=false,openSearcher=true,waitSearcher=true,expungeDeletes=false,softCommit=true,prepareCommit=false}
   [junit4]   2> 17647 T10 C4 oass.SolrIndexSearcher.<init> Opening Searcher@73606be2[collection1] main
   [junit4]   2> 17649 T10 C4 oasu.DirectUpdateHandler2.commit end_commit_flush
   [junit4]   2> 17649 T12 oasc.QuerySenderListener.newSearcher QuerySenderListener sending requests to Searcher@73606be2[collection1] main{StandardDirectoryReader(segments_1:46:nrt _a(4.9):C10 _b(4.9):C1 _c(4.9):C1 _d(4.9):C1 _e(4.9):C1 _f(4.9):C1 _g(4.9):C1 _h(4.9):C1 _i(4.9):C1 _j(4.9):C1 _l(4.9):C1 _m(4.9):C1)}
   [junit4]   2> 17650 T12 oasc.QuerySenderListener.newSearcher QuerySenderListener done.
   [junit4]   2> 17650 T12 oasc.SolrCore.registerSearcher [collection1] Registered new searcher Searcher@73606be2[collection1] main{StandardDirectoryReader(segments_1:46:nrt _a(4.9):C10 _b(4.9):C1 _c(4.9):C1 _d(4.9):C1 _e(4.9):C1 _f(4.9):C1 _g(4.9):C1 _h(4.9):C1 _i(4.9):C1 _j(4.9):C1 _l(4.9):C1 _m(4.9):C1)}
   [junit4]   2> 17651 T10 C4 oasup.LogUpdateProcessor.finish [collection1] webapp=null path=/update params={commit=true&softCommit=true&waitSearcher=true} {commit=} 0 10
   [junit4]   2> 17653 T10 C4 oasc.SolrCore.execute [collection1] webapp=null path=/select params={q=*%3A*&rows=2147483647} hits=21 status=0 QTime=1 
   [junit4]   2> 17780 T10 C4 oasup.LogUpdateProcessor.finish [collection1] webapp=null path=/update params={} {add=[testTIFF.tif#0 (1467799577934430208)]} 0 32
   [junit4]   2> 17781 T10 C4 oasu.DirectUpdateHandler2.commit start commit{,optimize=false,openSearcher=true,waitSearcher=true,expungeDeletes=false,softCommit=true,prepareCommit=false}
   [junit4]   2> 17792 T10 C4 oass.SolrIndexSearcher.<init> Opening Searcher@5b174618[collection1] main
   [junit4]   2> 17793 T10 C4 oasu.DirectUpdateHandler2.commit end_commit_flush
   [junit4]   2> 17794 T12 oasc.QuerySenderListener.newSearcher QuerySenderListener sending requests to Searcher@5b174618[collection1] main{StandardDirectoryReader(segments_1:49:nrt _k(4.9):C19 _l(4.9):C1 _m(4.9):C1 _n(4.9):C1)}
   [junit4]   2> 17794 T12 oasc.QuerySenderListener.newSearcher QuerySenderListener done.
   [junit4]   2> 17795 T12 oasc.SolrCore.registerSearcher [collection1] Registered new searcher Searcher@5b174618[collection1] main{StandardDirectoryReader(segments_1:49:nrt _k(4.9):C19 _l(4.9):C1 _m(4.9):C1 _n(4.9):C1)}
   [junit4]   2> 17799 T10 C4 oasup.LogUpdateProcessor.finish [collection1] webapp=null path=/update params={commit=true&softCommit=true&waitSearcher=true} {commit=} 0 18
   [junit4]   2> 17800 T10 C4 oasc.SolrCore.execute [collection1] webapp=null path=/select params={q=*%3A*&rows=2147483647} hits=22 status=0 QTime=0 
   [junit4]   2> 17911 T10 C4 oasup.LogUpdateProcessor.finish [collection1] webapp=null path=/update params={} {add=[testVISIO.vsd#0 (1467799578100105216)]} 0 4
   [junit4]   2> 17912 T10 C4 oasu.DirectUpdateHandler2.commit start commit{,optimize=false,openSearcher=true,waitSearcher=true,expungeDeletes=false,softCommit=true,prepareCommit=false}
   [junit4]   2> 17920 T10 C4 oass.SolrIndexSearcher.<init> Opening Searcher@193651e6[collection1] main
   [junit4]   2> 17921 T10 C4 oasu.DirectUpdateHandler2.commit end_commit_flush
   [junit4]   2> 17921 T12 oasc.QuerySenderListener.newSearcher QuerySenderListener sending requests to Searcher@193651e6[collection1] main{StandardDirectoryReader(segments_1:51:nrt _k(4.9):C19 _l(4.9):C1 _m(4.9):C1 _n(4.9):C1 _o(4.9):C1)}
   [junit4]   2> 17922 T12 oasc.QuerySenderListener.newSearcher QuerySenderListener done.
   [junit4]   2> 17922 T12 oasc.SolrCore.registerSearcher [collection1] Registered new searcher Searcher@193651e6[collection1] main{StandardDirectoryReader(segments_1:51:nrt _k(4.9):C19 _l(4.9):C1 _m(4.9):C1 _n(4.9):C1 _o(4.9):C1)}
   [junit4]   2> 17923 T10 C4 oasup.LogUpdateProcessor.finish [collection1] webapp=null path=/update params={commit=true&softCommit=true&waitSearcher=true} {commit=} 0 11
   [junit4]   2> 17924 T10 C4 oasc.SolrCore.execute [collection1] webapp=null path=/select params={q=*%3A*&rows=2147483647} hits=23 status=0 QTime=1 
   [junit4]   2> 17929 T10 C4 oasu.DirectUpdateHandler2.commit start commit{,optimize=false,openSearcher=true,waitSearcher=true,expungeDeletes=false,softCommit=true,prepareCommit=false}
   [junit4]   2> 17930 T10 C4 oasc.SolrCore.openNewSearcher SolrIndexSearcher has not changed - not re-opening: org.apache.solr.search.SolrIndexSearcher
   [junit4]   2> 17930 T10 C4 oasu.DirectUpdateHandler2.commit end_commit_flush
   [junit4]   2> 17931 T10 C4 oasup.LogUpdateProcessor.finish [collection1] webapp=null path=/update params={commit=true&softCommit=true&waitSearcher=true} {commit=} 0 2
   [junit4]   2> 17932 T10 C4 oasc.SolrCore.execute [collection1] webapp=null path=/select params={q=*%3A*&rows=2147483647} hits=23 status=0 QTime=1 
   [junit4]   2> 17934 T10 oas.SolrTestCaseJ4.tearDown ###Ending testSolrCellDocumentTypes2
   [junit4]   2> 17951 T10 oas.SolrTestCaseJ4.setUp ###Starting testSolrCellDocumentTypes
   [junit4]   2> 17979 T10 C4 oass.SolrIndexSearcher.<init> Opening Searcher@283b0f67[collection1] realtime
   [junit4]   2> 17980 T10 C4 oasup.LogUpdateProcessor.finish [collection1] webapp=null path=/update params={} {deleteByQuery=*:* (-1467799578145193984)} 0 29
   [junit4]   2> 17980 T10 C4 oasu.DirectUpdateHandler2.commit start commit{,optimize=false,openSearcher=true,waitSearcher=true,expungeDeletes=false,softCommit=false,prepareCommit=false}
   [junit4]   2> 17981 T10 C4 oasc.SolrDeletionPolicy.onCommit SolrDeletionPolicy.onCommit: commits: num=2
   [junit4]   2> 		commit{dir=MockDirectoryWrapper(RAMDirectory@33796a37 lockFactory=NativeFSLockFactory@/mnt/ssd/jenkins/workspace/Lucene-Solr-4.x-Linux/solr/build/contrib/solr-morphlines-cell/test/J0/./solr.morphlines.cell.SolrCellMorphlineTest-9F39CE52972432F5-001/init-core-data-001/index),segFN=segments_1,generation=1}
   [junit4]   2> 		commit{dir=MockDirectoryWrapper(RAMDirectory@33796a37 lockFactory=NativeFSLockFactory@/mnt/ssd/jenkins/workspace/Lucene-Solr-4.x-Linux/solr/build/contrib/solr-morphlines-cell/test/J0/./solr.morphlines.cell.SolrCellMorphlineTest-9F39CE52972432F5-001/init-core-data-001/index),segFN=segments_2,generation=2}
   [junit4]   2> 17982 T10 C4 oasc.SolrDeletionPolicy.updateCommits newest commit generation = 2
   [junit4]   2> 17982 T10 C4 oass.SolrIndexSearcher.<init> Opening Searcher@a2673c6[collection1] main
   [junit4]   2> 17983 T10 C4 oasu.DirectUpdateHandler2.commit end_commit_flush
   [junit4]   2> 17983 T12 oasc.QuerySenderListener.newSearcher QuerySenderListener sending requests to Searcher@a2673c6[collection1] main{StandardDirectoryReader(segments_1:53:nrt)}
   [junit4]   2> 17984 T12 oasc.QuerySenderListener.newSearcher QuerySenderListener done.
   [junit4]   2> 17984 T12 oasc.SolrCore.registerSearcher [collection1] Registered new searcher Searcher@a2673c6[collection1] main{StandardDirectoryReader(segments_1:53:nrt)}
   [junit4]   2> 17987 T10 C4 oasup.LogUpdateProcessor.finish [collection1] webapp=null path=/update params={commit=true&softCommit=false&waitSearcher=true} {commit=} 0 7
   [junit4]   2> 18013 T10 okma.MorphlineContext.importCommandBuilders Importing commands
   [junit4]   2> 18557 T10 okma.MorphlineContext.importCommandBuilders Done importing commands
   [junit4]   2> 19061 T10 oasc.SolrResourceLoader.<init> new SolrResourceLoader for directory: '/mnt/ssd/jenkins/workspace/Lucene-Solr-4.x-Linux/solr/contrib/morphlines-core/src/test-files/solr/collection1/'
   [junit4]   2> 19117 T10 oasc.SolrConfig.initLibs Adding specified lib dirs to ClassLoader
   [junit4]   2> 19118 T10 oasc.SolrResourceLoader.addToClassLoader WARN Can't find (or read) directory to add to classloader: ../../../contrib/extraction/lib (resolved as: /mnt/ssd/jenkins/workspace/Lucene-Solr-4.x-Linux/solr/contrib/morphlines-core/src/test-files/solr/collection1/../../../contrib/extraction/lib).
   [junit4]   2> 19118 T10 oasc.SolrResourceLoader.addToClassLoader WARN Can't find (or read) directory to add to classloader: ../../../dist/ (resolved as: /mnt/ssd/jenkins/workspace/Lucene-Solr-4.x-Linux/solr/contrib/morphlines-core/src/test-files/solr/collection1/../../../dist).
   [junit4]   2> 19119 T10 oasc.SolrResourceLoader.addToClassLoader WARN Can't find (or read) directory to add to classloader: ../../../contrib/clustering/lib/ (resolved as: /mnt/ssd/jenkins/workspace/Lucene-Solr-4.x-Linux/solr/contrib/morphlines-core/src/test-files/solr/collection1/../../../contrib/clustering/lib).
   [junit4]   2> 19120 T10 oasc.SolrResourceLoader.addToClassLoader WARN Can't find (or read) directory to add to classloader: ../../../dist/ (resolved as: /mnt/ssd/jenkins/workspace/Lucene-Solr-4.x-Linux/solr/contrib/morphlines-core/src/test-files/solr/collection1/../../../dist).
   [junit4]   2> 19121 T10 oasc.SolrResourceLoader.addToClassLoader WARN Can't find (or read) directory to add to classloader: ../../../contrib/langid/lib/ (resolved as: /mnt/ssd/jenkins/workspace/Lucene-Solr-4.x-Linux/solr/contrib/morphlines-core/src/test-files/solr/collection1/../../../contrib/langid/lib).
   [junit4]   2> 19121 T10 oasc.SolrResourceLoader.addToClassLoader WARN Can't find (or read) directory to add to classloader: ../../../dist/ (resolved as: /mnt/ssd/jenkins/workspace/Lucene-Solr-4.x-Linux/solr/contrib/morphlines-core/src/test-files/solr/collection1/../../../dist).
   [junit4]   2> 19122 T10 oasc.SolrResourceLoader.addToClassLoader WARN Can't find (or read) directory to add to classloader: ../../../contrib/velocity/lib (resolved as: /mnt/ssd/jenkins/workspace/Lucene-Solr-4.x-Linux/solr/contrib/morphlines-core/src/test-files/solr/collection1/../../../contrib/velocity/lib).
   [junit4]   2> 19123 T10 oasc.SolrResourceLoader.addToClassLoader WARN Can't find (or read) directory to add to classloader: ../../../dist/ (resolved as: /mnt/ssd/jenkins/workspace/Lucene-Solr-4.x-Linux/solr/contrib/morphlines-core/src/test-files/solr/collection1/../../../dist).
   [junit4]   2> 19123 T10 oasc.SolrResourceLoader.addToClassLoader WARN Can't find (or read) directory to add to classloader: /non/existent/dir/yields/warning (resolved as: /non/existent/dir/yields/warning).
   [junit4]   2> 19173 T10 oasc.SolrConfig.<init> Using Lucene MatchVersion: LUCENE_4_9
   [junit4]   2> 19261 T10 oasc.SolrConfig.<init> Loaded SolrConfig: solrconfig.xml
   [junit4]   2> 19262 T10 oass.IndexSchema.readSchema Reading Solr Schema from schema.xml
   [junit4]   2> 19289 T10 oass.IndexSchema.readSchema [null] Schema name=example
   [junit4]   2> 19681 T10 oass.IndexSchema.readSchema unique key field: id
   [junit4]   2> 19709 T10 oass.FileExchangeRateProvider.reload Reloading exchange rates from file currency.xml
   [junit4]   2> 19716 T10 oass.FileExchangeRateProvider.reload Reloading exchange rates from file currency.xml
   [junit4]   2> 19750 T10 oasc.SolrResourceLoader.<init> new SolrResourceLoader for directory: '/mnt/ssd/jenkins/workspace/Lucene-Solr-4.x-Linux/solr/contrib/morphlines-core/src/test-files/solr/collection1/'
   [junit4]   2> 19783 T10 oasc.SolrConfig.initLibs Adding specified lib dirs to ClassLoader
   [junit4]   2> 19784 T10 oasc.SolrResourceLoader.addToClassLoader WARN Can't find (or read) directory to add to classloader: ../../../contrib/extraction/lib (resolved as: /mnt/ssd/jenkins/workspace/Lucene-Solr-4.x-Linux/solr/contrib/morphlines-core/src/test-files/solr/collection1/../../../contrib/extraction/lib).
   [junit4]   2> 19784 T10 oasc.SolrResourceLoader.addToClassLoader WARN Can't find (or read) directory to add to classloader: ../../../dist/ (resolved as: /mnt/ssd/jenkins/workspace/Lucene-Solr-4.x-Linux/solr/contrib/morphlines-core/src/test-files/solr/collection1/../../../dist).
   [junit4]   2> 19785 T10 oasc.SolrResourceLoader.addToClassLoader WARN Can't find (or read) directory to add to classloader: ../../../contrib/clustering/lib/ (resolved as: /mnt/ssd/jenkins/workspace/Lucene-Solr-4.x-Linux/solr/contrib/morphlines-core/src/test-files/solr/collection1/../../../contrib/clustering/lib).
   [junit4]   2> 19785 T10 oasc.SolrResourceLoader.addToClassLoader WARN Can't find (or read) directory to add to classloader: ../../../dist/ (resolved as: /mnt/ssd/jenkins/workspace/Lucene-Solr-4.x-Linux/solr/contrib/morphlines-core/src/test-files/solr/collection1/../../../dist).
   [junit4]   2> 19786 T10 oasc.SolrResourceLoader.addToClassLoader WARN Can't find (or read) directory to add to classloader: ../../../contrib/langid/lib/ (resolved as: /mnt/ssd/jenkins/workspace/Lucene-Solr-4.x-Linux/solr/contrib/morphlines-core/src/test-files/solr/collection1/../../../contrib/langid/lib).
   [junit4]   2> 19787 T10 oasc.SolrResourceLoader.addToClassLoader WARN Can't find (or read) directory to add to classloader: ../../../dist/ (resolved as: /mnt/ssd/jenkins/workspace/Lucene-Solr-4.x-Linux/solr/contrib/morphlines-core/src/test-files/solr/collection1/../../../dist).
   [junit4]   2> 19787 T10 oasc.SolrResourceLoader.addToClassLoader WARN Can't find (or read) directory to add to classloader: ../../../contrib/velocity/lib (resolved as: /mnt/ssd/jenkins/workspace/Lucene-Solr-4.x-Linux/solr/contrib/morphlines-core/src/test-files/solr/collection1/../../../contrib/velocity/lib).
   [junit4]   2> 19788 T10 oasc.SolrResourceLoader.addToClassLoader WARN Can't find (or read) directory to add to classloader: ../../../dist/ (resolved as: /mnt/ssd/jenkins/workspace/Lucene-Solr-4.x-Linux/solr/contrib/morphlines-core/src/test-files/solr/collection1/../../../dist).
   [junit4]   2> 19789 T10 oasc.SolrResourceLoader.addToClassLoader WARN Can't find (or read) directory to add to classloader: /non/existent/dir/yields/warning (resolved as: /non/existent/dir/yields/warning).
   [junit4]   2> 19826 T10 oasc.SolrConfig.<init> Using Lucene MatchVersion: LUCENE_4_9
   [junit4]   2> 19882 T10 oasc.SolrConfig.<init> Loaded SolrConfig: solrconfig.xml
   [junit4]   2> 19882 T10 oass.IndexSchema.readSchema Reading Solr Schema from schema.xml
   [junit4]   2> 19896 T10 oass.IndexSchema.readSchema [null] Schema name=example
   [junit4]   2> 20247 T10 oass.IndexSchema.readSchema unique key field: id
   [junit4]   2> 20265 T10 oass.FileExchangeRateProvider.reload Reloading exchange rates from file currency.xml
   [junit4]   2> 20269 T10 oass.FileExchangeRateProvider.reload Reloading exchange rates from file currency.xml
   [junit4]   2> 20292 T10 oasc.SolrResourceLoader.<init> new SolrResourceLoader for directory: '/mnt/ssd/jenkins/workspace/Lucene-Solr-4.x-Linux/solr/contrib/morphlines-core/src/test-files/solr/collection1/'
   [junit4]   2> 20318 T10 oasc.SolrConfig.initLibs Adding specified lib dirs to ClassLoader
   [junit4]   2> 20319 T10 oasc.SolrResourceLoader.a

[...truncated too long message...]

cher QuerySenderListener done.
   [junit4]   2> 28221 T12 oasc.SolrCore.registerSearcher [collection1] Registered new searcher Searcher@5658b4ec[collection1] main{StandardDirectoryReader(segments_4:99:nrt _18(4.9):C1 _19(4.9):C1)}
   [junit4]   2> 28222 T10 C9 oasup.LogUpdateProcessor.finish [collection1] webapp=null path=/update params={commit=true&softCommit=true&waitSearcher=true} {commit=} 0 5
   [junit4]   2> 28223 T10 C9 oasc.SolrCore.execute [collection1] webapp=null path=/select params={q=*%3A*&rows=2147483647} hits=2 status=0 QTime=1 
   [junit4]   2> 28240 T10 C9 oasup.LogUpdateProcessor.finish [collection1] webapp=null path=/update params={} {add=[b8992b15-b39c-4b94-aef6-1b191d0fc24f#0 (1467799588932943872)]} 0 4
   [junit4]   2> 28241 T10 C9 oasu.DirectUpdateHandler2.commit start commit{,optimize=false,openSearcher=true,waitSearcher=true,expungeDeletes=false,softCommit=true,prepareCommit=false}
   [junit4]   2> 28244 T10 C9 oass.SolrIndexSearcher.<init> Opening Searcher@5296a91f[collection1] main
   [junit4]   2> 28245 T10 C9 oasu.DirectUpdateHandler2.commit end_commit_flush
   [junit4]   2> 28245 T12 oasc.QuerySenderListener.newSearcher QuerySenderListener sending requests to Searcher@5296a91f[collection1] main{StandardDirectoryReader(segments_4:101:nrt _18(4.9):C1 _19(4.9):C1 _1a(4.9):C1)}
   [junit4]   2> 28246 T12 oasc.QuerySenderListener.newSearcher QuerySenderListener done.
   [junit4]   2> 28246 T12 oasc.SolrCore.registerSearcher [collection1] Registered new searcher Searcher@5296a91f[collection1] main{StandardDirectoryReader(segments_4:101:nrt _18(4.9):C1 _19(4.9):C1 _1a(4.9):C1)}
   [junit4]   2> 28246 T10 C9 oasup.LogUpdateProcessor.finish [collection1] webapp=null path=/update params={commit=true&softCommit=true&waitSearcher=true} {commit=} 0 5
   [junit4]   2> 28247 T10 C9 oasc.SolrCore.execute [collection1] webapp=null path=/select params={q=*%3A*&rows=2147483647} hits=3 status=0 QTime=0 
   [junit4]   2> 28248 T10 C9 oasu.DirectUpdateHandler2.commit start commit{,optimize=false,openSearcher=true,waitSearcher=true,expungeDeletes=false,softCommit=true,prepareCommit=false}
   [junit4]   2> 28249 T10 C9 oasc.SolrCore.openNewSearcher SolrIndexSearcher has not changed - not re-opening: org.apache.solr.search.SolrIndexSearcher
   [junit4]   2> 28249 T10 C9 oasu.DirectUpdateHandler2.commit end_commit_flush
   [junit4]   2> 28249 T10 C9 oasup.LogUpdateProcessor.finish [collection1] webapp=null path=/update params={commit=true&softCommit=true&waitSearcher=true} {commit=} 0 1
   [junit4]   2> 28250 T10 C9 oasc.SolrCore.execute [collection1] webapp=null path=/select params={q=*%3A*&rows=2147483647} hits=3 status=0 QTime=0 
   [junit4]   2> 28251 T10 oas.SolrTestCaseJ4.tearDown ###Ending testSolrCellJPGCompressed
   [junit4]   2> 28260 T10 oas.SolrTestCaseJ4.setUp ###Starting testTransformValue
   [junit4]   2> 28262 T10 C9 oass.SolrIndexSearcher.<init> Opening Searcher@40033f5d[collection1] realtime
   [junit4]   2> 28262 T10 C9 oasup.LogUpdateProcessor.finish [collection1] webapp=null path=/update params={} {deleteByQuery=*:* (-1467799588956012544)} 0 2
   [junit4]   2> 28263 T10 C9 oasu.DirectUpdateHandler2.commit start commit{,optimize=false,openSearcher=true,waitSearcher=true,expungeDeletes=false,softCommit=false,prepareCommit=false}
   [junit4]   2> 28263 T10 C9 oasc.SolrDeletionPolicy.onCommit SolrDeletionPolicy.onCommit: commits: num=2
   [junit4]   2> 		commit{dir=MockDirectoryWrapper(RAMDirectory@33796a37 lockFactory=NativeFSLockFactory@/mnt/ssd/jenkins/workspace/Lucene-Solr-4.x-Linux/solr/build/contrib/solr-morphlines-cell/test/J0/./solr.morphlines.cell.SolrCellMorphlineTest-9F39CE52972432F5-001/init-core-data-001/index),segFN=segments_4,generation=4}
   [junit4]   2> 		commit{dir=MockDirectoryWrapper(RAMDirectory@33796a37 lockFactory=NativeFSLockFactory@/mnt/ssd/jenkins/workspace/Lucene-Solr-4.x-Linux/solr/build/contrib/solr-morphlines-cell/test/J0/./solr.morphlines.cell.SolrCellMorphlineTest-9F39CE52972432F5-001/init-core-data-001/index),segFN=segments_5,generation=5}
   [junit4]   2> 28264 T10 C9 oasc.SolrDeletionPolicy.updateCommits newest commit generation = 5
   [junit4]   2> 28264 T10 C9 oass.SolrIndexSearcher.<init> Opening Searcher@239dc4a5[collection1] main
   [junit4]   2> 28265 T10 C9 oasu.DirectUpdateHandler2.commit end_commit_flush
   [junit4]   2> 28265 T12 oasc.QuerySenderListener.newSearcher QuerySenderListener sending requests to Searcher@239dc4a5[collection1] main{StandardDirectoryReader(segments_4:103:nrt)}
   [junit4]   2> 28266 T12 oasc.QuerySenderListener.newSearcher QuerySenderListener done.
   [junit4]   2> 28266 T12 oasc.SolrCore.registerSearcher [collection1] Registered new searcher Searcher@239dc4a5[collection1] main{StandardDirectoryReader(segments_4:103:nrt)}
   [junit4]   2> 28267 T10 C9 oasup.LogUpdateProcessor.finish [collection1] webapp=null path=/update params={commit=true&softCommit=false&waitSearcher=true} {commit=} 0 4
   [junit4]   2> 28270 T10 oas.SolrTestCaseJ4.tearDown ###Ending testTransformValue
   [junit4]   2> 28273 T10 oas.SolrTestCaseJ4.deleteCore ###deleteCore
   [junit4]   2> 28273 T10 oasc.CoreContainer.shutdown Shutting down CoreContainer instance=152444616
   [junit4]   2> 28274 T10 oasc.SolrCore.close [collection1]  CLOSING SolrCore org.apache.solr.core.SolrCore@4de3afa9
   [junit4]   2> 28274 T10 oasu.DirectUpdateHandler2.close closing DirectUpdateHandler2{commits=56,autocommit maxTime=60000ms,autocommits=0,soft autocommit maxTime=1000ms,soft autocommits=0,optimizes=0,rollbacks=0,expungeDeletes=0,docsPending=0,adds=0,deletesById=0,deletesByQuery=0,errors=0,cumulative_adds=61,cumulative_deletesById=0,cumulative_deletesByQuery=9,cumulative_errors=0,transaction_logs_total_size=126873,transaction_logs_total_number=9}
   [junit4]   2> 28275 T10 oasu.SolrCoreState.decrefSolrCoreState Closing SolrCoreState
   [junit4]   2> 28275 T10 oasu.DefaultSolrCoreState.closeIndexWriter SolrCoreState ref count has reached 0 - closing IndexWriter
   [junit4]   2> 28276 T10 oasu.DefaultSolrCoreState.closeIndexWriter closing IndexWriter with IndexWriterCloser
   [junit4]   2> 28277 T10 oasc.SolrCore.closeSearcher [collection1] Closing main searcher on request.
   [junit4]   2> 28277 T10 oasc.CachingDirectoryFactory.close Closing MockDirectoryFactory - 2 directories currently being tracked
   [junit4]   2> 28278 T10 oasc.CachingDirectoryFactory.closeCacheValue looking to close /mnt/ssd/jenkins/workspace/Lucene-Solr-4.x-Linux/solr/build/contrib/solr-morphlines-cell/test/J0/./solr.morphlines.cell.SolrCellMorphlineTest-9F39CE52972432F5-001/init-core-data-001 [CachedDir<<refCount=0;path=/mnt/ssd/jenkins/workspace/Lucene-Solr-4.x-Linux/solr/build/contrib/solr-morphlines-cell/test/J0/./solr.morphlines.cell.SolrCellMorphlineTest-9F39CE52972432F5-001/init-core-data-001;done=false>>]
   [junit4]   2> 28279 T10 oasc.CachingDirectoryFactory.close Closing directory: /mnt/ssd/jenkins/workspace/Lucene-Solr-4.x-Linux/solr/build/contrib/solr-morphlines-cell/test/J0/./solr.morphlines.cell.SolrCellMorphlineTest-9F39CE52972432F5-001/init-core-data-001
   [junit4]   2> 28279 T10 oasc.CachingDirectoryFactory.closeCacheValue looking to close /mnt/ssd/jenkins/workspace/Lucene-Solr-4.x-Linux/solr/build/contrib/solr-morphlines-cell/test/J0/./solr.morphlines.cell.SolrCellMorphlineTest-9F39CE52972432F5-001/init-core-data-001/index [CachedDir<<refCount=0;path=/mnt/ssd/jenkins/workspace/Lucene-Solr-4.x-Linux/solr/build/contrib/solr-morphlines-cell/test/J0/./solr.morphlines.cell.SolrCellMorphlineTest-9F39CE52972432F5-001/init-core-data-001/index;done=false>>]
   [junit4]   2> 28279 T10 oasc.CachingDirectoryFactory.close Closing directory: /mnt/ssd/jenkins/workspace/Lucene-Solr-4.x-Linux/solr/build/contrib/solr-morphlines-cell/test/J0/./solr.morphlines.cell.SolrCellMorphlineTest-9F39CE52972432F5-001/init-core-data-001/index
   [junit4]   2> NOTE: leaving temporary files on disk at: /mnt/ssd/jenkins/workspace/Lucene-Solr-4.x-Linux/solr/build/contrib/solr-morphlines-cell/test/J0/./solr.morphlines.cell.SolrCellMorphlineTest-9F39CE52972432F5-001
   [junit4]   2> NOTE: test params are: codec=Lucene46: {}, docValues:{}, sim=DefaultSimilarity, locale=tr, timezone=America/Rosario
   [junit4]   2> NOTE: Linux 3.8.0-39-generic amd64/Oracle Corporation 1.7.0_60-ea (64-bit)/cpus=8,threads=1,free=75256720,total=316669952
   [junit4]   2> NOTE: All tests run in this JVM: [SolrCellMorphlineTest]
   [junit4] Completed in 28.48s, 5 tests, 1 failure <<< FAILURES!

[...truncated 9 lines...]
BUILD FAILED
/mnt/ssd/jenkins/workspace/Lucene-Solr-4.x-Linux/build.xml:467: The following error occurred while executing this line:
/mnt/ssd/jenkins/workspace/Lucene-Solr-4.x-Linux/build.xml:447: The following error occurred while executing this line:
/mnt/ssd/jenkins/workspace/Lucene-Solr-4.x-Linux/build.xml:45: The following error occurred while executing this line:
/mnt/ssd/jenkins/workspace/Lucene-Solr-4.x-Linux/extra-targets.xml:37: The following error occurred while executing this line:
/mnt/ssd/jenkins/workspace/Lucene-Solr-4.x-Linux/solr/build.xml:209: The following error occurred while executing this line:
/mnt/ssd/jenkins/workspace/Lucene-Solr-4.x-Linux/solr/common-build.xml:440: The following error occurred while executing this line:
/mnt/ssd/jenkins/workspace/Lucene-Solr-4.x-Linux/solr/common-build.xml:496: The following error occurred while executing this line:
/mnt/ssd/jenkins/workspace/Lucene-Solr-4.x-Linux/lucene/common-build.xml:1297: The following error occurred while executing this line:
/mnt/ssd/jenkins/workspace/Lucene-Solr-4.x-Linux/lucene/common-build.xml:921: There were test failures: 1 suite, 5 tests, 1 failure

Total time: 60 minutes 35 seconds
Build step 'Invoke Ant' marked build as failure
Description set: Java: 64bit/jdk1.7.0_60-ea-b15 -XX:-UseCompressedOops -XX:+UseParallelGC
Archiving artifacts
Recording test results
Email was triggered for: Failure
Sending email for trigger: Failure



Mime
View raw message