lucene-dev mailing list archives

Site index · List index
Message view « Date » · « Thread »
Top « Date » · « Thread »
From buil...@flonkings.com
Subject [JENKINS] Lucene-trunk-Linux-Java7-64-test-only - Build # 85328 - Still Failing!
Date Fri, 16 May 2014 15:39:06 GMT
Build: builds.flonkings.com/job/Lucene-trunk-Linux-Java7-64-test-only/85328/

5 tests failed.
FAILED:  org.apache.lucene.index.TestIndexWriterMerging.testForceMergeDeletes

Error Message:
background merge hit exception: _0(5.0):C2/1:delGen=1 into _5

Stack Trace:
java.io.IOException: background merge hit exception: _0(5.0):C2/1:delGen=1 into _5
	at __randomizedtesting.SeedInfo.seed([77E3C2EF41ED5F6B:459392497E67DF44]:0)
	at org.apache.lucene.index.IndexWriter.forceMergeDeletes(IndexWriter.java:1807)
	at org.apache.lucene.index.IndexWriter.forceMergeDeletes(IndexWriter.java:1847)
	at org.apache.lucene.index.TestIndexWriterMerging.testForceMergeDeletes(TestIndexWriterMerging.java:171)
	at sun.reflect.NativeMethodAccessorImpl.invoke0(Native Method)
	at sun.reflect.NativeMethodAccessorImpl.invoke(NativeMethodAccessorImpl.java:57)
	at sun.reflect.DelegatingMethodAccessorImpl.invoke(DelegatingMethodAccessorImpl.java:43)
	at java.lang.reflect.Method.invoke(Method.java:606)
	at com.carrotsearch.randomizedtesting.RandomizedRunner.invoke(RandomizedRunner.java:1618)
	at com.carrotsearch.randomizedtesting.RandomizedRunner$6.evaluate(RandomizedRunner.java:827)
	at com.carrotsearch.randomizedtesting.RandomizedRunner$7.evaluate(RandomizedRunner.java:863)
	at com.carrotsearch.randomizedtesting.RandomizedRunner$8.evaluate(RandomizedRunner.java:877)
	at org.apache.lucene.util.TestRuleSetupTeardownChained$1.evaluate(TestRuleSetupTeardownChained.java:50)
	at org.apache.lucene.util.TestRuleFieldCacheSanity$1.evaluate(TestRuleFieldCacheSanity.java:51)
	at org.apache.lucene.util.AbstractBeforeAfterRule$1.evaluate(AbstractBeforeAfterRule.java:46)
	at com.carrotsearch.randomizedtesting.rules.SystemPropertiesInvariantRule$1.evaluate(SystemPropertiesInvariantRule.java:55)
	at org.apache.lucene.util.TestRuleThreadAndTestName$1.evaluate(TestRuleThreadAndTestName.java:49)
	at org.apache.lucene.util.TestRuleIgnoreAfterMaxFailures$1.evaluate(TestRuleIgnoreAfterMaxFailures.java:65)
	at org.apache.lucene.util.TestRuleMarkFailure$1.evaluate(TestRuleMarkFailure.java:48)
	at com.carrotsearch.randomizedtesting.rules.StatementAdapter.evaluate(StatementAdapter.java:36)
	at com.carrotsearch.randomizedtesting.ThreadLeakControl$StatementRunner.run(ThreadLeakControl.java:360)
	at com.carrotsearch.randomizedtesting.ThreadLeakControl.forkTimeoutingTask(ThreadLeakControl.java:793)
	at com.carrotsearch.randomizedtesting.ThreadLeakControl$3.evaluate(ThreadLeakControl.java:453)
	at com.carrotsearch.randomizedtesting.RandomizedRunner.runSingleTest(RandomizedRunner.java:836)
	at com.carrotsearch.randomizedtesting.RandomizedRunner$3.evaluate(RandomizedRunner.java:738)
	at com.carrotsearch.randomizedtesting.RandomizedRunner$4.evaluate(RandomizedRunner.java:772)
	at com.carrotsearch.randomizedtesting.RandomizedRunner$5.evaluate(RandomizedRunner.java:783)
	at org.apache.lucene.util.AbstractBeforeAfterRule$1.evaluate(AbstractBeforeAfterRule.java:46)
	at org.apache.lucene.util.TestRuleStoreClassName$1.evaluate(TestRuleStoreClassName.java:42)
	at com.carrotsearch.randomizedtesting.rules.SystemPropertiesInvariantRule$1.evaluate(SystemPropertiesInvariantRule.java:55)
	at com.carrotsearch.randomizedtesting.rules.NoShadowingOrOverridesOnMethodsRule$1.evaluate(NoShadowingOrOverridesOnMethodsRule.java:39)
	at com.carrotsearch.randomizedtesting.rules.NoShadowingOrOverridesOnMethodsRule$1.evaluate(NoShadowingOrOverridesOnMethodsRule.java:39)
	at com.carrotsearch.randomizedtesting.rules.StatementAdapter.evaluate(StatementAdapter.java:36)
	at com.carrotsearch.randomizedtesting.rules.StatementAdapter.evaluate(StatementAdapter.java:36)
	at com.carrotsearch.randomizedtesting.rules.StatementAdapter.evaluate(StatementAdapter.java:36)
	at org.apache.lucene.util.TestRuleAssertionsRequired$1.evaluate(TestRuleAssertionsRequired.java:43)
	at org.apache.lucene.util.TestRuleMarkFailure$1.evaluate(TestRuleMarkFailure.java:48)
	at org.apache.lucene.util.TestRuleIgnoreAfterMaxFailures$1.evaluate(TestRuleIgnoreAfterMaxFailures.java:65)
	at org.apache.lucene.util.TestRuleIgnoreTestSuites$1.evaluate(TestRuleIgnoreTestSuites.java:55)
	at com.carrotsearch.randomizedtesting.rules.StatementAdapter.evaluate(StatementAdapter.java:36)
	at com.carrotsearch.randomizedtesting.ThreadLeakControl$StatementRunner.run(ThreadLeakControl.java:360)
	at java.lang.Thread.run(Thread.java:745)


FAILED:  org.apache.lucene.index.TestIndexWriterMerging.testForceMergeDeletes2

Error Message:
background merge hit exception: _0(5.0):c2/1:delGen=1 _1(5.0):c2/1:delGen=1 _2(5.0):c2/1:delGen=1
into _1d

Stack Trace:
java.io.IOException: background merge hit exception: _0(5.0):c2/1:delGen=1 _1(5.0):c2/1:delGen=1
_2(5.0):c2/1:delGen=1 into _1d
	at __randomizedtesting.SeedInfo.seed([77E3C2EF41ED5F6B:D166A543AFCF6FA2]:0)
	at org.apache.lucene.index.IndexWriter.forceMergeDeletes(IndexWriter.java:1807)
	at org.apache.lucene.index.IndexWriter.forceMergeDeletes(IndexWriter.java:1847)
	at org.apache.lucene.index.TestIndexWriterMerging.testForceMergeDeletes2(TestIndexWriterMerging.java:238)
	at sun.reflect.NativeMethodAccessorImpl.invoke0(Native Method)
	at sun.reflect.NativeMethodAccessorImpl.invoke(NativeMethodAccessorImpl.java:57)
	at sun.reflect.DelegatingMethodAccessorImpl.invoke(DelegatingMethodAccessorImpl.java:43)
	at java.lang.reflect.Method.invoke(Method.java:606)
	at com.carrotsearch.randomizedtesting.RandomizedRunner.invoke(RandomizedRunner.java:1618)
	at com.carrotsearch.randomizedtesting.RandomizedRunner$6.evaluate(RandomizedRunner.java:827)
	at com.carrotsearch.randomizedtesting.RandomizedRunner$7.evaluate(RandomizedRunner.java:863)
	at com.carrotsearch.randomizedtesting.RandomizedRunner$8.evaluate(RandomizedRunner.java:877)
	at org.apache.lucene.util.TestRuleSetupTeardownChained$1.evaluate(TestRuleSetupTeardownChained.java:50)
	at org.apache.lucene.util.TestRuleFieldCacheSanity$1.evaluate(TestRuleFieldCacheSanity.java:51)
	at org.apache.lucene.util.AbstractBeforeAfterRule$1.evaluate(AbstractBeforeAfterRule.java:46)
	at com.carrotsearch.randomizedtesting.rules.SystemPropertiesInvariantRule$1.evaluate(SystemPropertiesInvariantRule.java:55)
	at org.apache.lucene.util.TestRuleThreadAndTestName$1.evaluate(TestRuleThreadAndTestName.java:49)
	at org.apache.lucene.util.TestRuleIgnoreAfterMaxFailures$1.evaluate(TestRuleIgnoreAfterMaxFailures.java:65)
	at org.apache.lucene.util.TestRuleMarkFailure$1.evaluate(TestRuleMarkFailure.java:48)
	at com.carrotsearch.randomizedtesting.rules.StatementAdapter.evaluate(StatementAdapter.java:36)
	at com.carrotsearch.randomizedtesting.ThreadLeakControl$StatementRunner.run(ThreadLeakControl.java:360)
	at com.carrotsearch.randomizedtesting.ThreadLeakControl.forkTimeoutingTask(ThreadLeakControl.java:793)
	at com.carrotsearch.randomizedtesting.ThreadLeakControl$3.evaluate(ThreadLeakControl.java:453)
	at com.carrotsearch.randomizedtesting.RandomizedRunner.runSingleTest(RandomizedRunner.java:836)
	at com.carrotsearch.randomizedtesting.RandomizedRunner$3.evaluate(RandomizedRunner.java:738)
	at com.carrotsearch.randomizedtesting.RandomizedRunner$4.evaluate(RandomizedRunner.java:772)
	at com.carrotsearch.randomizedtesting.RandomizedRunner$5.evaluate(RandomizedRunner.java:783)
	at org.apache.lucene.util.AbstractBeforeAfterRule$1.evaluate(AbstractBeforeAfterRule.java:46)
	at org.apache.lucene.util.TestRuleStoreClassName$1.evaluate(TestRuleStoreClassName.java:42)
	at com.carrotsearch.randomizedtesting.rules.SystemPropertiesInvariantRule$1.evaluate(SystemPropertiesInvariantRule.java:55)
	at com.carrotsearch.randomizedtesting.rules.NoShadowingOrOverridesOnMethodsRule$1.evaluate(NoShadowingOrOverridesOnMethodsRule.java:39)
	at com.carrotsearch.randomizedtesting.rules.NoShadowingOrOverridesOnMethodsRule$1.evaluate(NoShadowingOrOverridesOnMethodsRule.java:39)
	at com.carrotsearch.randomizedtesting.rules.StatementAdapter.evaluate(StatementAdapter.java:36)
	at com.carrotsearch.randomizedtesting.rules.StatementAdapter.evaluate(StatementAdapter.java:36)
	at com.carrotsearch.randomizedtesting.rules.StatementAdapter.evaluate(StatementAdapter.java:36)
	at org.apache.lucene.util.TestRuleAssertionsRequired$1.evaluate(TestRuleAssertionsRequired.java:43)
	at org.apache.lucene.util.TestRuleMarkFailure$1.evaluate(TestRuleMarkFailure.java:48)
	at org.apache.lucene.util.TestRuleIgnoreAfterMaxFailures$1.evaluate(TestRuleIgnoreAfterMaxFailures.java:65)
	at org.apache.lucene.util.TestRuleIgnoreTestSuites$1.evaluate(TestRuleIgnoreTestSuites.java:55)
	at com.carrotsearch.randomizedtesting.rules.StatementAdapter.evaluate(StatementAdapter.java:36)
	at com.carrotsearch.randomizedtesting.ThreadLeakControl$StatementRunner.run(ThreadLeakControl.java:360)
	at java.lang.Thread.run(Thread.java:745)


FAILED:  org.apache.lucene.index.TestIndexWriterReader.testForceMergeDeletes

Error Message:
background merge hit exception: _0(5.0):C2/1:delGen=1

Stack Trace:
java.io.IOException: background merge hit exception: _0(5.0):C2/1:delGen=1
	at __randomizedtesting.SeedInfo.seed([77E3C2EF41ED5F6B:459392497E67DF44]:0)
	at org.apache.lucene.index.IndexWriter.forceMergeDeletes(IndexWriter.java:1807)
	at org.apache.lucene.index.IndexWriter.forceMergeDeletes(IndexWriter.java:1847)
	at org.apache.lucene.index.TestIndexWriterReader.testForceMergeDeletes(TestIndexWriterReader.java:896)
	at sun.reflect.NativeMethodAccessorImpl.invoke0(Native Method)
	at sun.reflect.NativeMethodAccessorImpl.invoke(NativeMethodAccessorImpl.java:57)
	at sun.reflect.DelegatingMethodAccessorImpl.invoke(DelegatingMethodAccessorImpl.java:43)
	at java.lang.reflect.Method.invoke(Method.java:606)
	at com.carrotsearch.randomizedtesting.RandomizedRunner.invoke(RandomizedRunner.java:1618)
	at com.carrotsearch.randomizedtesting.RandomizedRunner$6.evaluate(RandomizedRunner.java:827)
	at com.carrotsearch.randomizedtesting.RandomizedRunner$7.evaluate(RandomizedRunner.java:863)
	at com.carrotsearch.randomizedtesting.RandomizedRunner$8.evaluate(RandomizedRunner.java:877)
	at org.apache.lucene.util.TestRuleSetupTeardownChained$1.evaluate(TestRuleSetupTeardownChained.java:50)
	at org.apache.lucene.util.TestRuleFieldCacheSanity$1.evaluate(TestRuleFieldCacheSanity.java:51)
	at org.apache.lucene.util.AbstractBeforeAfterRule$1.evaluate(AbstractBeforeAfterRule.java:46)
	at com.carrotsearch.randomizedtesting.rules.SystemPropertiesInvariantRule$1.evaluate(SystemPropertiesInvariantRule.java:55)
	at org.apache.lucene.util.TestRuleThreadAndTestName$1.evaluate(TestRuleThreadAndTestName.java:49)
	at org.apache.lucene.util.TestRuleIgnoreAfterMaxFailures$1.evaluate(TestRuleIgnoreAfterMaxFailures.java:65)
	at org.apache.lucene.util.TestRuleMarkFailure$1.evaluate(TestRuleMarkFailure.java:48)
	at com.carrotsearch.randomizedtesting.rules.StatementAdapter.evaluate(StatementAdapter.java:36)
	at com.carrotsearch.randomizedtesting.ThreadLeakControl$StatementRunner.run(ThreadLeakControl.java:360)
	at com.carrotsearch.randomizedtesting.ThreadLeakControl.forkTimeoutingTask(ThreadLeakControl.java:793)
	at com.carrotsearch.randomizedtesting.ThreadLeakControl$3.evaluate(ThreadLeakControl.java:453)
	at com.carrotsearch.randomizedtesting.RandomizedRunner.runSingleTest(RandomizedRunner.java:836)
	at com.carrotsearch.randomizedtesting.RandomizedRunner$3.evaluate(RandomizedRunner.java:738)
	at com.carrotsearch.randomizedtesting.RandomizedRunner$4.evaluate(RandomizedRunner.java:772)
	at com.carrotsearch.randomizedtesting.RandomizedRunner$5.evaluate(RandomizedRunner.java:783)
	at org.apache.lucene.util.AbstractBeforeAfterRule$1.evaluate(AbstractBeforeAfterRule.java:46)
	at org.apache.lucene.util.TestRuleStoreClassName$1.evaluate(TestRuleStoreClassName.java:42)
	at com.carrotsearch.randomizedtesting.rules.SystemPropertiesInvariantRule$1.evaluate(SystemPropertiesInvariantRule.java:55)
	at com.carrotsearch.randomizedtesting.rules.NoShadowingOrOverridesOnMethodsRule$1.evaluate(NoShadowingOrOverridesOnMethodsRule.java:39)
	at com.carrotsearch.randomizedtesting.rules.NoShadowingOrOverridesOnMethodsRule$1.evaluate(NoShadowingOrOverridesOnMethodsRule.java:39)
	at com.carrotsearch.randomizedtesting.rules.StatementAdapter.evaluate(StatementAdapter.java:36)
	at com.carrotsearch.randomizedtesting.rules.StatementAdapter.evaluate(StatementAdapter.java:36)
	at com.carrotsearch.randomizedtesting.rules.StatementAdapter.evaluate(StatementAdapter.java:36)
	at org.apache.lucene.util.TestRuleAssertionsRequired$1.evaluate(TestRuleAssertionsRequired.java:43)
	at org.apache.lucene.util.TestRuleMarkFailure$1.evaluate(TestRuleMarkFailure.java:48)
	at org.apache.lucene.util.TestRuleIgnoreAfterMaxFailures$1.evaluate(TestRuleIgnoreAfterMaxFailures.java:65)
	at org.apache.lucene.util.TestRuleIgnoreTestSuites$1.evaluate(TestRuleIgnoreTestSuites.java:55)
	at com.carrotsearch.randomizedtesting.rules.StatementAdapter.evaluate(StatementAdapter.java:36)
	at com.carrotsearch.randomizedtesting.ThreadLeakControl$StatementRunner.run(ThreadLeakControl.java:360)
	at java.lang.Thread.run(Thread.java:745)


FAILED:  org.apache.lucene.index.TestTieredMergePolicy.testForceMergeDeletesMaxSegSize

Error Message:
background merge hit exception: _0(5.0):C221 into _1 [maxNumSegments=1]

Stack Trace:
java.io.IOException: background merge hit exception: _0(5.0):C221 into _1 [maxNumSegments=1]
	at __randomizedtesting.SeedInfo.seed([77E3C2EF41ED5F6B:15E4AD1F18E4EAD5]:0)
	at org.apache.lucene.index.IndexWriter.forceMergeDeletes(IndexWriter.java:1807)
	at org.apache.lucene.index.IndexWriter.forceMergeDeletes(IndexWriter.java:1847)
	at org.apache.lucene.index.TestTieredMergePolicy.testForceMergeDeletesMaxSegSize(TestTieredMergePolicy.java:148)
	at sun.reflect.NativeMethodAccessorImpl.invoke0(Native Method)
	at sun.reflect.NativeMethodAccessorImpl.invoke(NativeMethodAccessorImpl.java:57)
	at sun.reflect.DelegatingMethodAccessorImpl.invoke(DelegatingMethodAccessorImpl.java:43)
	at java.lang.reflect.Method.invoke(Method.java:606)
	at com.carrotsearch.randomizedtesting.RandomizedRunner.invoke(RandomizedRunner.java:1618)
	at com.carrotsearch.randomizedtesting.RandomizedRunner$6.evaluate(RandomizedRunner.java:827)
	at com.carrotsearch.randomizedtesting.RandomizedRunner$7.evaluate(RandomizedRunner.java:863)
	at com.carrotsearch.randomizedtesting.RandomizedRunner$8.evaluate(RandomizedRunner.java:877)
	at org.apache.lucene.util.TestRuleSetupTeardownChained$1.evaluate(TestRuleSetupTeardownChained.java:50)
	at org.apache.lucene.util.TestRuleFieldCacheSanity$1.evaluate(TestRuleFieldCacheSanity.java:51)
	at org.apache.lucene.util.AbstractBeforeAfterRule$1.evaluate(AbstractBeforeAfterRule.java:46)
	at com.carrotsearch.randomizedtesting.rules.SystemPropertiesInvariantRule$1.evaluate(SystemPropertiesInvariantRule.java:55)
	at org.apache.lucene.util.TestRuleThreadAndTestName$1.evaluate(TestRuleThreadAndTestName.java:49)
	at org.apache.lucene.util.TestRuleIgnoreAfterMaxFailures$1.evaluate(TestRuleIgnoreAfterMaxFailures.java:65)
	at org.apache.lucene.util.TestRuleMarkFailure$1.evaluate(TestRuleMarkFailure.java:48)
	at com.carrotsearch.randomizedtesting.rules.StatementAdapter.evaluate(StatementAdapter.java:36)
	at com.carrotsearch.randomizedtesting.ThreadLeakControl$StatementRunner.run(ThreadLeakControl.java:360)
	at com.carrotsearch.randomizedtesting.ThreadLeakControl.forkTimeoutingTask(ThreadLeakControl.java:793)
	at com.carrotsearch.randomizedtesting.ThreadLeakControl$3.evaluate(ThreadLeakControl.java:453)
	at com.carrotsearch.randomizedtesting.RandomizedRunner.runSingleTest(RandomizedRunner.java:836)
	at com.carrotsearch.randomizedtesting.RandomizedRunner$3.evaluate(RandomizedRunner.java:738)
	at com.carrotsearch.randomizedtesting.RandomizedRunner$4.evaluate(RandomizedRunner.java:772)
	at com.carrotsearch.randomizedtesting.RandomizedRunner$5.evaluate(RandomizedRunner.java:783)
	at org.apache.lucene.util.AbstractBeforeAfterRule$1.evaluate(AbstractBeforeAfterRule.java:46)
	at org.apache.lucene.util.TestRuleStoreClassName$1.evaluate(TestRuleStoreClassName.java:42)
	at com.carrotsearch.randomizedtesting.rules.SystemPropertiesInvariantRule$1.evaluate(SystemPropertiesInvariantRule.java:55)
	at com.carrotsearch.randomizedtesting.rules.NoShadowingOrOverridesOnMethodsRule$1.evaluate(NoShadowingOrOverridesOnMethodsRule.java:39)
	at com.carrotsearch.randomizedtesting.rules.NoShadowingOrOverridesOnMethodsRule$1.evaluate(NoShadowingOrOverridesOnMethodsRule.java:39)
	at com.carrotsearch.randomizedtesting.rules.StatementAdapter.evaluate(StatementAdapter.java:36)
	at com.carrotsearch.randomizedtesting.rules.StatementAdapter.evaluate(StatementAdapter.java:36)
	at com.carrotsearch.randomizedtesting.rules.StatementAdapter.evaluate(StatementAdapter.java:36)
	at org.apache.lucene.util.TestRuleAssertionsRequired$1.evaluate(TestRuleAssertionsRequired.java:43)
	at org.apache.lucene.util.TestRuleMarkFailure$1.evaluate(TestRuleMarkFailure.java:48)
	at org.apache.lucene.util.TestRuleIgnoreAfterMaxFailures$1.evaluate(TestRuleIgnoreAfterMaxFailures.java:65)
	at org.apache.lucene.util.TestRuleIgnoreTestSuites$1.evaluate(TestRuleIgnoreTestSuites.java:55)
	at com.carrotsearch.randomizedtesting.rules.StatementAdapter.evaluate(StatementAdapter.java:36)
	at com.carrotsearch.randomizedtesting.ThreadLeakControl$StatementRunner.run(ThreadLeakControl.java:360)
	at java.lang.Thread.run(Thread.java:745)


FAILED:  org.apache.lucene.index.TestTieredMergePolicy.testForceMergeDeletes

Error Message:
background merge hit exception: _0(5.0):C4/1:delGen=1 _1(5.0):C4/1:delGen=1 _2(5.0):C4/1:delGen=1
_3(5.0):C4/1:delGen=1 _4(5.0):C4/1:delGen=1 _5(5.0):C4/1:delGen=1 _6(5.0):C4/1:delGen=1 _7(5.0):C4/1:delGen=1
_8(5.0):C4/1:delGen=1 _9(5.0):C4/1:delGen=1 _a(5.0):C4/1:delGen=1 _b(5.0):C4/1:delGen=1 _c(5.0):C4/1:delGen=1
_d(5.0):C4/1:delGen=1 _e(5.0):C4/1:delGen=1 _f(5.0):C4/1:delGen=1 _g(5.0):C4/1:delGen=1 _h(5.0):C4/1:delGen=1
_i(5.0):C4/1:delGen=1 _j(5.0):C4/1:delGen=1

Stack Trace:
java.io.IOException: background merge hit exception: _0(5.0):C4/1:delGen=1 _1(5.0):C4/1:delGen=1
_2(5.0):C4/1:delGen=1 _3(5.0):C4/1:delGen=1 _4(5.0):C4/1:delGen=1 _5(5.0):C4/1:delGen=1 _6(5.0):C4/1:delGen=1
_7(5.0):C4/1:delGen=1 _8(5.0):C4/1:delGen=1 _9(5.0):C4/1:delGen=1 _a(5.0):C4/1:delGen=1 _b(5.0):C4/1:delGen=1
_c(5.0):C4/1:delGen=1 _d(5.0):C4/1:delGen=1 _e(5.0):C4/1:delGen=1 _f(5.0):C4/1:delGen=1 _g(5.0):C4/1:delGen=1
_h(5.0):C4/1:delGen=1 _i(5.0):C4/1:delGen=1 _j(5.0):C4/1:delGen=1
	at __randomizedtesting.SeedInfo.seed([77E3C2EF41ED5F6B:459392497E67DF44]:0)
	at org.apache.lucene.index.IndexWriter.forceMergeDeletes(IndexWriter.java:1807)
	at org.apache.lucene.index.IndexWriter.forceMergeDeletes(IndexWriter.java:1847)
	at org.apache.lucene.index.TestTieredMergePolicy.testForceMergeDeletes(TestTieredMergePolicy.java:64)
	at sun.reflect.NativeMethodAccessorImpl.invoke0(Native Method)
	at sun.reflect.NativeMethodAccessorImpl.invoke(NativeMethodAccessorImpl.java:57)
	at sun.reflect.DelegatingMethodAccessorImpl.invoke(DelegatingMethodAccessorImpl.java:43)
	at java.lang.reflect.Method.invoke(Method.java:606)
	at com.carrotsearch.randomizedtesting.RandomizedRunner.invoke(RandomizedRunner.java:1618)
	at com.carrotsearch.randomizedtesting.RandomizedRunner$6.evaluate(RandomizedRunner.java:827)
	at com.carrotsearch.randomizedtesting.RandomizedRunner$7.evaluate(RandomizedRunner.java:863)
	at com.carrotsearch.randomizedtesting.RandomizedRunner$8.evaluate(RandomizedRunner.java:877)
	at org.apache.lucene.util.TestRuleSetupTeardownChained$1.evaluate(TestRuleSetupTeardownChained.java:50)
	at org.apache.lucene.util.TestRuleFieldCacheSanity$1.evaluate(TestRuleFieldCacheSanity.java:51)
	at org.apache.lucene.util.AbstractBeforeAfterRule$1.evaluate(AbstractBeforeAfterRule.java:46)
	at com.carrotsearch.randomizedtesting.rules.SystemPropertiesInvariantRule$1.evaluate(SystemPropertiesInvariantRule.java:55)
	at org.apache.lucene.util.TestRuleThreadAndTestName$1.evaluate(TestRuleThreadAndTestName.java:49)
	at org.apache.lucene.util.TestRuleIgnoreAfterMaxFailures$1.evaluate(TestRuleIgnoreAfterMaxFailures.java:65)
	at org.apache.lucene.util.TestRuleMarkFailure$1.evaluate(TestRuleMarkFailure.java:48)
	at com.carrotsearch.randomizedtesting.rules.StatementAdapter.evaluate(StatementAdapter.java:36)
	at com.carrotsearch.randomizedtesting.ThreadLeakControl$StatementRunner.run(ThreadLeakControl.java:360)
	at com.carrotsearch.randomizedtesting.ThreadLeakControl.forkTimeoutingTask(ThreadLeakControl.java:793)
	at com.carrotsearch.randomizedtesting.ThreadLeakControl$3.evaluate(ThreadLeakControl.java:453)
	at com.carrotsearch.randomizedtesting.RandomizedRunner.runSingleTest(RandomizedRunner.java:836)
	at com.carrotsearch.randomizedtesting.RandomizedRunner$3.evaluate(RandomizedRunner.java:738)
	at com.carrotsearch.randomizedtesting.RandomizedRunner$4.evaluate(RandomizedRunner.java:772)
	at com.carrotsearch.randomizedtesting.RandomizedRunner$5.evaluate(RandomizedRunner.java:783)
	at org.apache.lucene.util.AbstractBeforeAfterRule$1.evaluate(AbstractBeforeAfterRule.java:46)
	at org.apache.lucene.util.TestRuleStoreClassName$1.evaluate(TestRuleStoreClassName.java:42)
	at com.carrotsearch.randomizedtesting.rules.SystemPropertiesInvariantRule$1.evaluate(SystemPropertiesInvariantRule.java:55)
	at com.carrotsearch.randomizedtesting.rules.NoShadowingOrOverridesOnMethodsRule$1.evaluate(NoShadowingOrOverridesOnMethodsRule.java:39)
	at com.carrotsearch.randomizedtesting.rules.NoShadowingOrOverridesOnMethodsRule$1.evaluate(NoShadowingOrOverridesOnMethodsRule.java:39)
	at com.carrotsearch.randomizedtesting.rules.StatementAdapter.evaluate(StatementAdapter.java:36)
	at com.carrotsearch.randomizedtesting.rules.StatementAdapter.evaluate(StatementAdapter.java:36)
	at com.carrotsearch.randomizedtesting.rules.StatementAdapter.evaluate(StatementAdapter.java:36)
	at org.apache.lucene.util.TestRuleAssertionsRequired$1.evaluate(TestRuleAssertionsRequired.java:43)
	at org.apache.lucene.util.TestRuleMarkFailure$1.evaluate(TestRuleMarkFailure.java:48)
	at org.apache.lucene.util.TestRuleIgnoreAfterMaxFailures$1.evaluate(TestRuleIgnoreAfterMaxFailures.java:65)
	at org.apache.lucene.util.TestRuleIgnoreTestSuites$1.evaluate(TestRuleIgnoreTestSuites.java:55)
	at com.carrotsearch.randomizedtesting.rules.StatementAdapter.evaluate(StatementAdapter.java:36)
	at com.carrotsearch.randomizedtesting.ThreadLeakControl$StatementRunner.run(ThreadLeakControl.java:360)
	at java.lang.Thread.run(Thread.java:745)




Build Log:
[...truncated 543 lines...]
   [junit4] Suite: org.apache.lucene.index.TestIndexWriterMerging
   [junit4]   2> NOTE: reproduce with: ant test  -Dtestcase=TestIndexWriterMerging -Dtests.method=testForceMergeDeletes
-Dtests.seed=77E3C2EF41ED5F6B -Dtests.slow=true -Dtests.locale=sr_CS -Dtests.timezone=AET
-Dtests.file.encoding=ISO-8859-1
   [junit4] ERROR   0.27s J7 | TestIndexWriterMerging.testForceMergeDeletes <<<
   [junit4]    > Throwable #1: java.io.IOException: background merge hit exception: _0(5.0):C2/1:delGen=1
into _5
   [junit4]    > 	at __randomizedtesting.SeedInfo.seed([77E3C2EF41ED5F6B:459392497E67DF44]:0)
   [junit4]    > 	at org.apache.lucene.index.IndexWriter.forceMergeDeletes(IndexWriter.java:1807)
   [junit4]    > 	at org.apache.lucene.index.IndexWriter.forceMergeDeletes(IndexWriter.java:1847)
   [junit4]    > 	at org.apache.lucene.index.TestIndexWriterMerging.testForceMergeDeletes(TestIndexWriterMerging.java:171)
   [junit4]    > 	at java.lang.Thread.run(Thread.java:745)
   [junit4]   2> NOTE: reproduce with: ant test  -Dtestcase=TestIndexWriterMerging -Dtests.method=testForceMergeDeletes2
-Dtests.seed=77E3C2EF41ED5F6B -Dtests.slow=true -Dtests.locale=sr_CS -Dtests.timezone=AET
-Dtests.file.encoding=ISO-8859-1
   [junit4] ERROR   1.37s J7 | TestIndexWriterMerging.testForceMergeDeletes2 <<<
   [junit4]    > Throwable #1: java.io.IOException: background merge hit exception: _0(5.0):c2/1:delGen=1
_1(5.0):c2/1:delGen=1 _2(5.0):c2/1:delGen=1 into _1d
   [junit4]    > 	at __randomizedtesting.SeedInfo.seed([77E3C2EF41ED5F6B:D166A543AFCF6FA2]:0)
   [junit4]    > 	at org.apache.lucene.index.IndexWriter.forceMergeDeletes(IndexWriter.java:1807)
   [junit4]    > 	at org.apache.lucene.index.IndexWriter.forceMergeDeletes(IndexWriter.java:1847)
   [junit4]    > 	at org.apache.lucene.index.TestIndexWriterMerging.testForceMergeDeletes2(TestIndexWriterMerging.java:238)
   [junit4]    > 	at java.lang.Thread.run(Thread.java:745)
   [junit4]   2> May 16, 2014 5:35:49 PM com.carrotsearch.randomizedtesting.ThreadLeakControl
checkThreadLeaks
   [junit4]   2> WARNING: Will linger awaiting termination of 2 leaked thread(s).
   [junit4]   2> NOTE: test params are: codec=Asserting(Lucene46), sim=RandomSimilarityProvider(queryNorm=true,coord=yes):
{tvtest=DFR G1, termVector=DFR GLZ(0.3), id=DefaultSimilarity}, locale=sr_CS, timezone=AET
   [junit4]   2> NOTE: Linux 3.2.0-26-generic amd64/Oracle Corporation 1.7.0_55 (64-bit)/cpus=8,threads=1,free=85820424,total=177209344
   [junit4]   2> NOTE: All tests run in this JVM: [TestInPlaceMergeSorter, TestRollingUpdates,
Test2BPostingsBytes, TestLucene40StoredFieldsFormat, TestBlockPostingsFormat3, TestSortRandom,
TestVirtualMethod, TestMultiLevelSkipList, TestLogMergePolicy, TestTermRangeFilter, TestMultiPhraseQuery,
TestLucene41StoredFieldsFormat, TestPostingsOffsets, Nested, Nested, Nested, Nested, Nested,
Nested, Nested, Nested, Nested, Nested, Nested, Nested, Nested, Nested, Nested, Nested, Nested,
Nested, Nested, Nested, Nested, TestMockCharFilter, TestIndexWriterMerging]
   [junit4] Completed on J7 in 44.68s, 6 tests, 2 errors <<< FAILURES!

[...truncated 274 lines...]
   [junit4] Suite: org.apache.lucene.index.TestIndexWriterReader
   [junit4]   2> NOTE: reproduce with: ant test  -Dtestcase=TestIndexWriterReader -Dtests.method=testForceMergeDeletes
-Dtests.seed=77E3C2EF41ED5F6B -Dtests.slow=true -Dtests.locale=ja_JP -Dtests.timezone=Pacific/Saipan
-Dtests.file.encoding=ISO-8859-1
   [junit4] ERROR   0.07s J0 | TestIndexWriterReader.testForceMergeDeletes <<<
   [junit4]    > Throwable #1: java.io.IOException: background merge hit exception: _0(5.0):C2/1:delGen=1
   [junit4]    > 	at __randomizedtesting.SeedInfo.seed([77E3C2EF41ED5F6B:459392497E67DF44]:0)
   [junit4]    > 	at org.apache.lucene.index.IndexWriter.forceMergeDeletes(IndexWriter.java:1807)
   [junit4]    > 	at org.apache.lucene.index.IndexWriter.forceMergeDeletes(IndexWriter.java:1847)
   [junit4]    > 	at org.apache.lucene.index.TestIndexWriterReader.testForceMergeDeletes(TestIndexWriterReader.java:896)
   [junit4]    > 	at java.lang.Thread.run(Thread.java:745)
   [junit4]   2> NOTE: test params are: codec=CheapBastard, sim=RandomSimilarityProvider(queryNorm=false,coord=crazy):
{foo=IB SPL-D3(800.0), field=IB SPL-L3(800.0), field5=IB SPL-L1, field4=BM25(k1=1.2,b=0.75),
field2=IB SPL-L2, field1=DFR I(ne)L1, indexname=DFR I(F)LZ(0.3), field3=DFR I(ne)3(800.0)},
locale=ja_JP, timezone=Pacific/Saipan
   [junit4]   2> NOTE: Linux 3.2.0-26-generic amd64/Oracle Corporation 1.7.0_55 (64-bit)/cpus=8,threads=1,free=146246000,total=239599616
   [junit4]   2> NOTE: All tests run in this JVM: [TestSpansAdvanced, TestFieldCacheRangeFilter,
TestDocumentsWriterDeleteQueue, TestLucene40PostingsFormat, Test4GBStoredFields, TestSearchWithThreads,
TestRateLimiter, TestStressIndexing, TestStressAdvance, TestSearcherManager, TestPhrasePrefixQuery,
TestBackwardsCompatibility, FuzzyTermOnShortTermsTest, Nested1, TestLucene40DocValuesFormat,
TestPayloadsOnVectors, TestTermsEnum2, TestFilteredQuery, NestedSetupChain, NestedTeardownChain,
TestNRTReaderWithThreads, TestScoreCachingWrappingScorer, TestNumericDocValuesUpdates, TestRecyclingIntBlockAllocator,
Before3, Before3, TestBytesRef, TestIndexWriterReader]
   [junit4] Completed on J0 in 28.55s, 22 tests, 1 error <<< FAILURES!

[...truncated 117 lines...]
   [junit4] Suite: org.apache.lucene.index.TestTieredMergePolicy
   [junit4]   2> NOTE: reproduce with: ant test  -Dtestcase=TestTieredMergePolicy -Dtests.method=testForceMergeDeletesMaxSegSize
-Dtests.seed=77E3C2EF41ED5F6B -Dtests.slow=true -Dtests.locale=hr -Dtests.timezone=Pacific/Saipan
-Dtests.file.encoding=ISO-8859-1
   [junit4] ERROR   0.06s J4 | TestTieredMergePolicy.testForceMergeDeletesMaxSegSize <<<
   [junit4]    > Throwable #1: java.io.IOException: background merge hit exception: _0(5.0):C221
into _1 [maxNumSegments=1]
   [junit4]    > 	at __randomizedtesting.SeedInfo.seed([77E3C2EF41ED5F6B:15E4AD1F18E4EAD5]:0)
   [junit4]    > 	at org.apache.lucene.index.IndexWriter.forceMergeDeletes(IndexWriter.java:1807)
   [junit4]    > 	at org.apache.lucene.index.IndexWriter.forceMergeDeletes(IndexWriter.java:1847)
   [junit4]    > 	at org.apache.lucene.index.TestTieredMergePolicy.testForceMergeDeletesMaxSegSize(TestTieredMergePolicy.java:148)
   [junit4]    > 	at java.lang.Thread.run(Thread.java:745)
   [junit4]   2> NOTE: reproduce with: ant test  -Dtestcase=TestTieredMergePolicy -Dtests.method=testForceMergeDeletes
-Dtests.seed=77E3C2EF41ED5F6B -Dtests.slow=true -Dtests.locale=hr -Dtests.timezone=Pacific/Saipan
-Dtests.file.encoding=ISO-8859-1
   [junit4] ERROR   0.15s J4 | TestTieredMergePolicy.testForceMergeDeletes <<<
   [junit4]    > Throwable #1: java.io.IOException: background merge hit exception: _0(5.0):C4/1:delGen=1
_1(5.0):C4/1:delGen=1 _2(5.0):C4/1:delGen=1 _3(5.0):C4/1:delGen=1 _4(5.0):C4/1:delGen=1 _5(5.0):C4/1:delGen=1
_6(5.0):C4/1:delGen=1 _7(5.0):C4/1:delGen=1 _8(5.0):C4/1:delGen=1 _9(5.0):C4/1:delGen=1 _a(5.0):C4/1:delGen=1
_b(5.0):C4/1:delGen=1 _c(5.0):C4/1:delGen=1 _d(5.0):C4/1:delGen=1 _e(5.0):C4/1:delGen=1 _f(5.0):C4/1:delGen=1
_g(5.0):C4/1:delGen=1 _h(5.0):C4/1:delGen=1 _i(5.0):C4/1:delGen=1 _j(5.0):C4/1:delGen=1
   [junit4]    > 	at __randomizedtesting.SeedInfo.seed([77E3C2EF41ED5F6B:459392497E67DF44]:0)
   [junit4]    > 	at org.apache.lucene.index.IndexWriter.forceMergeDeletes(IndexWriter.java:1807)
   [junit4]    > 	at org.apache.lucene.index.IndexWriter.forceMergeDeletes(IndexWriter.java:1847)
   [junit4]    > 	at org.apache.lucene.index.TestTieredMergePolicy.testForceMergeDeletes(TestTieredMergePolicy.java:64)
   [junit4]    > 	at java.lang.Thread.run(Thread.java:745)
   [junit4]   2> NOTE: leaving temporary files on disk at: /var/lib/jenkins/workspace/Lucene-trunk-Linux-Java7-64-test-only/checkout/lucene/build/core/test/J4/./lucene.index.TestTieredMergePolicy-77E3C2EF41ED5F6B-001
   [junit4]   2> NOTE: test params are: codec=FastCompressingStoredFields(storedFieldsFormat=CompressingStoredFieldsFormat(compressionMode=FAST,
chunkSize=33), termVectorsFormat=CompressingTermVectorsFormat(compressionMode=FAST, chunkSize=33)),
sim=RandomSimilarityProvider(queryNorm=true,coord=yes): {content=DFR I(ne)3(800.0)}, locale=hr,
timezone=Pacific/Saipan
   [junit4]   2> NOTE: Linux 3.2.0-26-generic amd64/Oracle Corporation 1.7.0_55 (64-bit)/cpus=8,threads=1,free=126869024,total=313524224
   [junit4]   2> NOTE: All tests run in this JVM: [TestAttributeSource, TestSegmentMerger,
Test2BDocs, TestLookaheadTokenFilter, TestToken, TestDocTermOrdsRewriteMethod, TestOpenBitSet,
TestNoDeletionPolicy, TestMixedCodecs, TestPrefixInBooleanQuery, TestTwoPhaseCommitTool, TestSimpleAttributeImpl,
TestParallelAtomicReader, TestEliasFanoSequence, TestSearch, TestIntBlockPool, TestNoMergeScheduler,
TestStressNRT, TestPackedInts, TestCrashCausesCorruptIndex, TestDocIdSet, TestDuelingCodecs,
Nested1, Nested2, Nested3, ThrowInUncaught, TestPagedBytes, TestAddIndexes, TestNRTThreads,
TestDirectoryReaderReopen, TestTieredMergePolicy]
   [junit4] Completed on J4 in 7.16s, 6 tests, 2 errors <<< FAILURES!

[...truncated 561 lines...]
BUILD FAILED
/var/lib/jenkins/workspace/Lucene-trunk-Linux-Java7-64-test-only/checkout/lucene/build.xml:49:
The following error occurred while executing this line:
/var/lib/jenkins/workspace/Lucene-trunk-Linux-Java7-64-test-only/checkout/lucene/common-build.xml:1296:
The following error occurred while executing this line:
/var/lib/jenkins/workspace/Lucene-trunk-Linux-Java7-64-test-only/checkout/lucene/common-build.xml:920:
There were test failures: 396 suites, 3093 tests, 5 errors, 96 ignored (86 assumptions)

Total time: 5 minutes 59 seconds
Build step 'Invoke Ant' marked build as failure
Archiving artifacts
Recording test results
Email was triggered for: Failure
Sending email for trigger: Failure



Mime
View raw message