lucene-dev mailing list archives

Site index · List index
Message view « Date » · « Thread »
Top « Date » · « Thread »
From Policeman Jenkins Server <jenk...@thetaphi.de>
Subject [JENKINS] Lucene-Solr-trunk-Linux (64bit/jdk1.8.0_20-ea-b11) - Build # 10310 - Failure!
Date Fri, 16 May 2014 02:38:44 GMT
Build: http://jenkins.thetaphi.de/job/Lucene-Solr-trunk-Linux/10310/
Java: 64bit/jdk1.8.0_20-ea-b11 -XX:-UseCompressedOops -XX:+UseConcMarkSweepGC

1 tests failed.
REGRESSION:  org.apache.solr.cloud.OverseerRolesTest.testDistribSearch

Error Message:
New overseer designate has not become the overseer, expected : 127.0.0.1:48234_eyr%2Feactual : null

Stack Trace:
java.lang.AssertionError: New overseer designate has not become the overseer, expected : 127.0.0.1:48234_eyr%2Feactual : null
	at __randomizedtesting.SeedInfo.seed([DAEA0732652EAE59:5B0C892A1271CE65]:0)
	at org.junit.Assert.fail(Assert.java:93)
	at org.junit.Assert.assertTrue(Assert.java:43)
	at org.apache.solr.cloud.OverseerRolesTest.testOverseerRole(OverseerRolesTest.java:223)
	at org.apache.solr.cloud.OverseerRolesTest.doTest(OverseerRolesTest.java:94)
	at org.apache.solr.BaseDistributedSearchTestCase.testDistribSearch(BaseDistributedSearchTestCase.java:865)
	at sun.reflect.NativeMethodAccessorImpl.invoke0(Native Method)
	at sun.reflect.NativeMethodAccessorImpl.invoke(NativeMethodAccessorImpl.java:62)
	at sun.reflect.DelegatingMethodAccessorImpl.invoke(DelegatingMethodAccessorImpl.java:43)
	at java.lang.reflect.Method.invoke(Method.java:483)
	at com.carrotsearch.randomizedtesting.RandomizedRunner.invoke(RandomizedRunner.java:1618)
	at com.carrotsearch.randomizedtesting.RandomizedRunner$6.evaluate(RandomizedRunner.java:827)
	at com.carrotsearch.randomizedtesting.RandomizedRunner$7.evaluate(RandomizedRunner.java:863)
	at com.carrotsearch.randomizedtesting.RandomizedRunner$8.evaluate(RandomizedRunner.java:877)
	at com.carrotsearch.randomizedtesting.rules.SystemPropertiesRestoreRule$1.evaluate(SystemPropertiesRestoreRule.java:53)
	at org.apache.lucene.util.TestRuleSetupTeardownChained$1.evaluate(TestRuleSetupTeardownChained.java:50)
	at org.apache.lucene.util.TestRuleFieldCacheSanity$1.evaluate(TestRuleFieldCacheSanity.java:51)
	at org.apache.lucene.util.AbstractBeforeAfterRule$1.evaluate(AbstractBeforeAfterRule.java:46)
	at com.carrotsearch.randomizedtesting.rules.SystemPropertiesInvariantRule$1.evaluate(SystemPropertiesInvariantRule.java:55)
	at org.apache.lucene.util.TestRuleThreadAndTestName$1.evaluate(TestRuleThreadAndTestName.java:49)
	at org.apache.lucene.util.TestRuleIgnoreAfterMaxFailures$1.evaluate(TestRuleIgnoreAfterMaxFailures.java:65)
	at org.apache.lucene.util.TestRuleMarkFailure$1.evaluate(TestRuleMarkFailure.java:48)
	at com.carrotsearch.randomizedtesting.rules.StatementAdapter.evaluate(StatementAdapter.java:36)
	at com.carrotsearch.randomizedtesting.ThreadLeakControl$StatementRunner.run(ThreadLeakControl.java:360)
	at com.carrotsearch.randomizedtesting.ThreadLeakControl.forkTimeoutingTask(ThreadLeakControl.java:793)
	at com.carrotsearch.randomizedtesting.ThreadLeakControl$3.evaluate(ThreadLeakControl.java:453)
	at com.carrotsearch.randomizedtesting.RandomizedRunner.runSingleTest(RandomizedRunner.java:836)
	at com.carrotsearch.randomizedtesting.RandomizedRunner$3.evaluate(RandomizedRunner.java:738)
	at com.carrotsearch.randomizedtesting.RandomizedRunner$4.evaluate(RandomizedRunner.java:772)
	at com.carrotsearch.randomizedtesting.RandomizedRunner$5.evaluate(RandomizedRunner.java:783)
	at com.carrotsearch.randomizedtesting.rules.StatementAdapter.evaluate(StatementAdapter.java:36)
	at com.carrotsearch.randomizedtesting.rules.SystemPropertiesRestoreRule$1.evaluate(SystemPropertiesRestoreRule.java:53)
	at org.apache.lucene.util.AbstractBeforeAfterRule$1.evaluate(AbstractBeforeAfterRule.java:46)
	at org.apache.lucene.util.TestRuleStoreClassName$1.evaluate(TestRuleStoreClassName.java:42)
	at com.carrotsearch.randomizedtesting.rules.SystemPropertiesInvariantRule$1.evaluate(SystemPropertiesInvariantRule.java:55)
	at com.carrotsearch.randomizedtesting.rules.NoShadowingOrOverridesOnMethodsRule$1.evaluate(NoShadowingOrOverridesOnMethodsRule.java:39)
	at com.carrotsearch.randomizedtesting.rules.NoShadowingOrOverridesOnMethodsRule$1.evaluate(NoShadowingOrOverridesOnMethodsRule.java:39)
	at com.carrotsearch.randomizedtesting.rules.StatementAdapter.evaluate(StatementAdapter.java:36)
	at com.carrotsearch.randomizedtesting.rules.StatementAdapter.evaluate(StatementAdapter.java:36)
	at com.carrotsearch.randomizedtesting.rules.StatementAdapter.evaluate(StatementAdapter.java:36)
	at org.apache.lucene.util.TestRuleAssertionsRequired$1.evaluate(TestRuleAssertionsRequired.java:43)
	at org.apache.lucene.util.TestRuleMarkFailure$1.evaluate(TestRuleMarkFailure.java:48)
	at org.apache.lucene.util.TestRuleIgnoreAfterMaxFailures$1.evaluate(TestRuleIgnoreAfterMaxFailures.java:65)
	at org.apache.lucene.util.TestRuleIgnoreTestSuites$1.evaluate(TestRuleIgnoreTestSuites.java:55)
	at com.carrotsearch.randomizedtesting.rules.StatementAdapter.evaluate(StatementAdapter.java:36)
	at com.carrotsearch.randomizedtesting.ThreadLeakControl$StatementRunner.run(ThreadLeakControl.java:360)
	at java.lang.Thread.run(Thread.java:745)




Build Log:
[...truncated 10805 lines...]
   [junit4] Suite: org.apache.solr.cloud.OverseerRolesTest
   [junit4]   2> Creating dataDir: /mnt/ssd/jenkins/workspace/Lucene-Solr-trunk-Linux/solr/build/solr-core/test/J1/./solr.cloud.OverseerRolesTest-DAEA0732652EAE59-001/init-core-data-001
   [junit4]   2> 2524 T49 oas.BaseDistributedSearchTestCase.initHostContext Setting hostContext system property: /eyr/e
   [junit4]   2> 2530 T49 oas.SolrTestCaseJ4.setUp ###Starting testDistribSearch
   [junit4]   2> 2533 T49 oasc.ZkTestServer.run STARTING ZK TEST SERVER
   [junit4]   1> client port:0.0.0.0/0.0.0.0:0
   [junit4]   2> 2541 T50 oasc.ZkTestServer$ZKServerMain.runFromConfig Starting server
   [junit4]   2> 2639 T49 oasc.ZkTestServer.run start zk server on port:58339
   [junit4]   2> 2713 T49 oascc.ConnectionManager.waitForConnected Waiting for client to connect to ZooKeeper
   [junit4]   2> 2827 T56 oascc.ConnectionManager.process Watcher org.apache.solr.common.cloud.ConnectionManager@530066af name:ZooKeeperConnection Watcher:127.0.0.1:58339 got event WatchedEvent state:SyncConnected type:None path:null path:null type:None
   [junit4]   2> 2828 T49 oascc.ConnectionManager.waitForConnected Client is connected to ZooKeeper
   [junit4]   2> 2830 T49 oascc.SolrZkClient.makePath makePath: /solr
   [junit4]   2> 2865 T49 oascc.ConnectionManager.waitForConnected Waiting for client to connect to ZooKeeper
   [junit4]   2> 2870 T58 oascc.ConnectionManager.process Watcher org.apache.solr.common.cloud.ConnectionManager@73e65ed2 name:ZooKeeperConnection Watcher:127.0.0.1:58339/solr got event WatchedEvent state:SyncConnected type:None path:null path:null type:None
   [junit4]   2> 2877 T49 oascc.ConnectionManager.waitForConnected Client is connected to ZooKeeper
   [junit4]   2> 2888 T49 oascc.SolrZkClient.makePath makePath: /collections/collection1
   [junit4]   2> 2898 T49 oascc.SolrZkClient.makePath makePath: /collections/collection1/shards
   [junit4]   2> 2903 T49 oascc.SolrZkClient.makePath makePath: /collections/control_collection
   [junit4]   2> 2906 T49 oascc.SolrZkClient.makePath makePath: /collections/control_collection/shards
   [junit4]   2> 2912 T49 oasc.AbstractZkTestCase.putConfig put /mnt/ssd/jenkins/workspace/Lucene-Solr-trunk-Linux/solr/core/src/test-files/solr/collection1/conf/solrconfig-tlog.xml to /configs/conf1/solrconfig.xml
   [junit4]   2> 2925 T49 oascc.SolrZkClient.makePath makePath: /configs/conf1/solrconfig.xml
   [junit4]   2> 2933 T49 oasc.AbstractZkTestCase.putConfig put /mnt/ssd/jenkins/workspace/Lucene-Solr-trunk-Linux/solr/core/src/test-files/solr/collection1/conf/schema.xml to /configs/conf1/schema.xml
   [junit4]   2> 2936 T49 oascc.SolrZkClient.makePath makePath: /configs/conf1/schema.xml
   [junit4]   2> 2943 T49 oasc.AbstractZkTestCase.putConfig put /mnt/ssd/jenkins/workspace/Lucene-Solr-trunk-Linux/solr/core/src/test-files/solr/collection1/conf/solrconfig.snippet.randomindexconfig.xml to /configs/conf1/solrconfig.snippet.randomindexconfig.xml
   [junit4]   2> 2944 T49 oascc.SolrZkClient.makePath makePath: /configs/conf1/solrconfig.snippet.randomindexconfig.xml
   [junit4]   2> 2949 T49 oasc.AbstractZkTestCase.putConfig put /mnt/ssd/jenkins/workspace/Lucene-Solr-trunk-Linux/solr/core/src/test-files/solr/collection1/conf/stopwords.txt to /configs/conf1/stopwords.txt
   [junit4]   2> 2950 T49 oascc.SolrZkClient.makePath makePath: /configs/conf1/stopwords.txt
   [junit4]   2> 2958 T49 oasc.AbstractZkTestCase.putConfig put /mnt/ssd/jenkins/workspace/Lucene-Solr-trunk-Linux/solr/core/src/test-files/solr/collection1/conf/protwords.txt to /configs/conf1/protwords.txt
   [junit4]   2> 2959 T49 oascc.SolrZkClient.makePath makePath: /configs/conf1/protwords.txt
   [junit4]   2> 2971 T49 oasc.AbstractZkTestCase.putConfig put /mnt/ssd/jenkins/workspace/Lucene-Solr-trunk-Linux/solr/core/src/test-files/solr/collection1/conf/currency.xml to /configs/conf1/currency.xml
   [junit4]   2> 2972 T49 oascc.SolrZkClient.makePath makePath: /configs/conf1/currency.xml
   [junit4]   2> 2978 T49 oasc.AbstractZkTestCase.putConfig put /mnt/ssd/jenkins/workspace/Lucene-Solr-trunk-Linux/solr/core/src/test-files/solr/collection1/conf/enumsConfig.xml to /configs/conf1/enumsConfig.xml
   [junit4]   2> 2978 T49 oascc.SolrZkClient.makePath makePath: /configs/conf1/enumsConfig.xml
   [junit4]   2> 2991 T49 oasc.AbstractZkTestCase.putConfig put /mnt/ssd/jenkins/workspace/Lucene-Solr-trunk-Linux/solr/core/src/test-files/solr/collection1/conf/open-exchange-rates.json to /configs/conf1/open-exchange-rates.json
   [junit4]   2> 2992 T49 oascc.SolrZkClient.makePath makePath: /configs/conf1/open-exchange-rates.json
   [junit4]   2> 3007 T49 oasc.AbstractZkTestCase.putConfig put /mnt/ssd/jenkins/workspace/Lucene-Solr-trunk-Linux/solr/core/src/test-files/solr/collection1/conf/mapping-ISOLatin1Accent.txt to /configs/conf1/mapping-ISOLatin1Accent.txt
   [junit4]   2> 3008 T49 oascc.SolrZkClient.makePath makePath: /configs/conf1/mapping-ISOLatin1Accent.txt
   [junit4]   2> 3013 T49 oasc.AbstractZkTestCase.putConfig put /mnt/ssd/jenkins/workspace/Lucene-Solr-trunk-Linux/solr/core/src/test-files/solr/collection1/conf/old_synonyms.txt to /configs/conf1/old_synonyms.txt
   [junit4]   2> 3013 T49 oascc.SolrZkClient.makePath makePath: /configs/conf1/old_synonyms.txt
   [junit4]   2> 3017 T49 oasc.AbstractZkTestCase.putConfig put /mnt/ssd/jenkins/workspace/Lucene-Solr-trunk-Linux/solr/core/src/test-files/solr/collection1/conf/synonyms.txt to /configs/conf1/synonyms.txt
   [junit4]   2> 3019 T49 oascc.SolrZkClient.makePath makePath: /configs/conf1/synonyms.txt
   [junit4]   2> 3836 T49 oejs.Server.doStart jetty-8.1.10.v20130312
   [junit4]   2> 4047 T49 oejs.AbstractConnector.doStart Started SelectChannelConnector@127.0.0.1:50269
   [junit4]   2> 4110 T49 oass.SolrDispatchFilter.init SolrDispatchFilter.init()
   [junit4]   2> 4121 T49 oasc.SolrResourceLoader.locateSolrHome JNDI not configured for solr (NoInitialContextEx)
   [junit4]   2> 4122 T49 oasc.SolrResourceLoader.locateSolrHome using system property solr.solr.home: ../../../../../../../../../../mnt/ssd/jenkins/workspace/Lucene-Solr-trunk-Linux/solr/build/solr-core/test/J1/./solr.cloud.OverseerRolesTest-DAEA0732652EAE59-001/tempDir-002
   [junit4]   2> 4123 T49 oasc.SolrResourceLoader.<init> new SolrResourceLoader for directory: '../../../../../../../../../../mnt/ssd/jenkins/workspace/Lucene-Solr-trunk-Linux/solr/build/solr-core/test/J1/./solr.cloud.OverseerRolesTest-DAEA0732652EAE59-001/tempDir-002/'
   [junit4]   2> 4370 T49 oasc.ConfigSolr.fromFile Loading container configuration from /mnt/ssd/jenkins/workspace/Lucene-Solr-trunk-Linux/solr/build/solr-core/test/J1/../../../../../../../../../../mnt/ssd/jenkins/workspace/Lucene-Solr-trunk-Linux/solr/build/solr-core/test/J1/./solr.cloud.OverseerRolesTest-DAEA0732652EAE59-001/tempDir-002/solr.xml
   [junit4]   2> 4615 T49 oasc.CorePropertiesLocator.<init> Config-defined core root directory: /mnt/ssd/jenkins/workspace/Lucene-Solr-trunk-Linux/solr/build/solr-core/test/J1/../../../../../../../../../../mnt/ssd/jenkins/workspace/Lucene-Solr-trunk-Linux/solr/build/solr-core/test/J1/./solr.cloud.OverseerRolesTest-DAEA0732652EAE59-001/tempDir-002
   [junit4]   2> 4633 T49 oasc.CoreContainer.<init> New CoreContainer 319725503
   [junit4]   2> 4636 T49 oasc.CoreContainer.load Loading cores into CoreContainer [instanceDir=../../../../../../../../../../mnt/ssd/jenkins/workspace/Lucene-Solr-trunk-Linux/solr/build/solr-core/test/J1/./solr.cloud.OverseerRolesTest-DAEA0732652EAE59-001/tempDir-002/]
   [junit4]   2> 4694 T49 oashc.HttpShardHandlerFactory.getParameter Setting socketTimeout to: 90000
   [junit4]   2> 4695 T49 oashc.HttpShardHandlerFactory.getParameter Setting urlScheme to: 
   [junit4]   2> 4703 T49 oashc.HttpShardHandlerFactory.getParameter Setting connTimeout to: 15000
   [junit4]   2> 4704 T49 oashc.HttpShardHandlerFactory.getParameter Setting maxConnectionsPerHost to: 20
   [junit4]   2> 4705 T49 oashc.HttpShardHandlerFactory.getParameter Setting corePoolSize to: 0
   [junit4]   2> 4705 T49 oashc.HttpShardHandlerFactory.getParameter Setting maximumPoolSize to: 2147483647
   [junit4]   2> 4706 T49 oashc.HttpShardHandlerFactory.getParameter Setting maxThreadIdleTime to: 5
   [junit4]   2> 4706 T49 oashc.HttpShardHandlerFactory.getParameter Setting sizeOfQueue to: -1
   [junit4]   2> 4707 T49 oashc.HttpShardHandlerFactory.getParameter Setting fairnessPolicy to: false
   [junit4]   2> 4894 T49 oasl.LogWatcher.createWatcher SLF4J impl is org.slf4j.impl.Log4jLoggerFactory
   [junit4]   2> 4896 T49 oasl.LogWatcher.newRegisteredLogWatcher Registering Log Listener [Log4j (org.slf4j.impl.Log4jLoggerFactory)]
   [junit4]   2> 4898 T49 oasc.CoreContainer.load Host Name: 127.0.0.1
   [junit4]   2> 4899 T49 oasc.ZkContainer.initZooKeeper Zookeeper client=127.0.0.1:58339/solr
   [junit4]   2> 4912 T49 oasc.ZkController.checkChrootPath zkHost includes chroot
   [junit4]   2> 4915 T49 oascc.ConnectionManager.waitForConnected Waiting for client to connect to ZooKeeper
   [junit4]   2> 4922 T70 oascc.ConnectionManager.process Watcher org.apache.solr.common.cloud.ConnectionManager@75715b name:ZooKeeperConnection Watcher:127.0.0.1:58339 got event WatchedEvent state:SyncConnected type:None path:null path:null type:None
   [junit4]   2> 4923 T49 oascc.ConnectionManager.waitForConnected Client is connected to ZooKeeper
   [junit4]   2> 4932 T49 oascc.ConnectionManager.waitForConnected Waiting for client to connect to ZooKeeper
   [junit4]   2> 4936 T72 oascc.ConnectionManager.process Watcher org.apache.solr.common.cloud.ConnectionManager@45361746 name:ZooKeeperConnection Watcher:127.0.0.1:58339/solr got event WatchedEvent state:SyncConnected type:None path:null path:null type:None
   [junit4]   2> 4937 T49 oascc.ConnectionManager.waitForConnected Client is connected to ZooKeeper
   [junit4]   2> 4945 T49 oascc.SolrZkClient.makePath makePath: /overseer/queue
   [junit4]   2> 4953 T49 oascc.SolrZkClient.makePath makePath: /overseer/collection-queue-work
   [junit4]   2> 4961 T49 oascc.SolrZkClient.makePath makePath: /overseer/collection-map-running
   [junit4]   2> 4970 T49 oascc.SolrZkClient.makePath makePath: /overseer/collection-map-completed
   [junit4]   2> 4977 T49 oascc.SolrZkClient.makePath makePath: /overseer/collection-map-failure
   [junit4]   2> 4990 T49 oascc.SolrZkClient.makePath makePath: /live_nodes
   [junit4]   2> 4994 T49 oasc.ZkController.createEphemeralLiveNode Register node as live in ZooKeeper:/live_nodes/127.0.0.1:50269_eyr%2Fe
   [junit4]   2> 4997 T49 oascc.SolrZkClient.makePath makePath: /live_nodes/127.0.0.1:50269_eyr%2Fe
   [junit4]   2> 5002 T49 oascc.SolrZkClient.makePath makePath: /overseer_elect
   [junit4]   2> 5005 T49 oascc.SolrZkClient.makePath makePath: /overseer_elect/election
   [junit4]   2> 5035 T49 oasc.OverseerElectionContext.runLeaderProcess I am going to be the leader 127.0.0.1:50269_eyr%2Fe
   [junit4]   2> 5036 T49 oascc.SolrZkClient.makePath makePath: /overseer_elect/leader
   [junit4]   2> 5040 T49 oasc.Overseer.start Overseer (id=91763942398754819-127.0.0.1:50269_eyr%2Fe-n_0000000000) starting
   [junit4]   2> 5052 T49 oascc.SolrZkClient.makePath makePath: /overseer/queue-work
   [junit4]   2> 5111 T74 oasc.OverseerCollectionProcessor.run Process current queue of collection creations
   [junit4]   2> 5112 T49 oascc.SolrZkClient.makePath makePath: /clusterstate.json
   [junit4]   2> 5116 T49 oascc.SolrZkClient.makePath makePath: /aliases.json
   [junit4]   2> 5119 T49 oascc.ZkStateReader.createClusterStateWatchersAndUpdate Updating cluster state from ZooKeeper... 
   [junit4]   2> 5162 T73 oasc.Overseer$ClusterStateUpdater.run Starting to work on the main queue
   [junit4]   2> 5235 T49 oasc.CorePropertiesLocator.discover Looking for core definitions underneath /mnt/ssd/jenkins/workspace/Lucene-Solr-trunk-Linux/solr/build/solr-core/test/J1/../../../../../../../../../../mnt/ssd/jenkins/workspace/Lucene-Solr-trunk-Linux/solr/build/solr-core/test/J1/./solr.cloud.OverseerRolesTest-DAEA0732652EAE59-001/tempDir-002
   [junit4]   2> 5272 T49 oasc.CorePropertiesLocator.discoverUnder Found core conf in /mnt/ssd/jenkins/workspace/Lucene-Solr-trunk-Linux/solr/build/solr-core/test/J1/../../../../../../../../../../mnt/ssd/jenkins/workspace/Lucene-Solr-trunk-Linux/solr/build/solr-core/test/J1/./solr.cloud.OverseerRolesTest-DAEA0732652EAE59-001/tempDir-002/conf/
   [junit4]   2> 5487 T49 oasc.CorePropertiesLocator.discover Found 1 core definitions
   [junit4]   2> 5492 T49 oass.SolrDispatchFilter.init user.dir=/mnt/ssd/jenkins/workspace/Lucene-Solr-trunk-Linux/solr/build/solr-core/test/J1
   [junit4]   2> 5492 T49 oass.SolrDispatchFilter.init SolrDispatchFilter.init() done
   [junit4]   2> 5504 T49 oascc.ConnectionManager.waitForConnected Waiting for client to connect to ZooKeeper
   [junit4]   2> 5508 T77 oascc.ConnectionManager.process Watcher org.apache.solr.common.cloud.ConnectionManager@52dd693f name:ZooKeeperConnection Watcher:127.0.0.1:58339/solr got event WatchedEvent state:SyncConnected type:None path:null path:null type:None
   [junit4]   2> 5508 T49 oascc.ConnectionManager.waitForConnected Client is connected to ZooKeeper
   [junit4]   2> 5510 T49 oascc.ZkStateReader.createClusterStateWatchersAndUpdate Updating cluster state from ZooKeeper... 
   [junit4]   2> 5514 T49 oasc.ChaosMonkey.monkeyLog monkey: init - expire sessions:false cause connection loss:false
   [junit4]   2> 5857 T49 oasc.AbstractFullDistribZkTestBase.createJettys create jetty 1
   [junit4]   2> 5858 T49 oejs.Server.doStart jetty-8.1.10.v20130312
   [junit4]   2> 5861 T49 oejs.AbstractConnector.doStart Started SelectChannelConnector@127.0.0.1:44704
   [junit4]   2> 5862 T49 oass.SolrDispatchFilter.init SolrDispatchFilter.init()
   [junit4]   2> 5863 T49 oasc.SolrResourceLoader.locateSolrHome JNDI not configured for solr (NoInitialContextEx)
   [junit4]   2> 5863 T49 oasc.SolrResourceLoader.locateSolrHome using system property solr.solr.home: ./solr.cloud.OverseerRolesTest-DAEA0732652EAE59-001/tempDir-003
   [junit4]   2> 5864 T49 oasc.SolrResourceLoader.<init> new SolrResourceLoader for directory: './solr.cloud.OverseerRolesTest-DAEA0732652EAE59-001/tempDir-003/'
   [junit4]   2> 5890 T49 oasc.ConfigSolr.fromFile Loading container configuration from /mnt/ssd/jenkins/workspace/Lucene-Solr-trunk-Linux/solr/build/solr-core/test/J1/./solr.cloud.OverseerRolesTest-DAEA0732652EAE59-001/tempDir-003/solr.xml
   [junit4]   2> 5980 T49 oasc.CorePropertiesLocator.<init> Config-defined core root directory: /mnt/ssd/jenkins/workspace/Lucene-Solr-trunk-Linux/solr/build/solr-core/test/J1/./solr.cloud.OverseerRolesTest-DAEA0732652EAE59-001/tempDir-003
   [junit4]   2> 5981 T49 oasc.CoreContainer.<init> New CoreContainer 245071933
   [junit4]   2> 5982 T49 oasc.CoreContainer.load Loading cores into CoreContainer [instanceDir=./solr.cloud.OverseerRolesTest-DAEA0732652EAE59-001/tempDir-003/]
   [junit4]   2> 5985 T49 oashc.HttpShardHandlerFactory.getParameter Setting socketTimeout to: 90000
   [junit4]   2> 5985 T49 oashc.HttpShardHandlerFactory.getParameter Setting urlScheme to: 
   [junit4]   2> 5986 T49 oashc.HttpShardHandlerFactory.getParameter Setting connTimeout to: 15000
   [junit4]   2> 5986 T49 oashc.HttpShardHandlerFactory.getParameter Setting maxConnectionsPerHost to: 20
   [junit4]   2> 5996 T49 oashc.HttpShardHandlerFactory.getParameter Setting corePoolSize to: 0
   [junit4]   2> 5997 T49 oashc.HttpShardHandlerFactory.getParameter Setting maximumPoolSize to: 2147483647
   [junit4]   2> 5998 T49 oashc.HttpShardHandlerFactory.getParameter Setting maxThreadIdleTime to: 5
   [junit4]   2> 5998 T49 oashc.HttpShardHandlerFactory.getParameter Setting sizeOfQueue to: -1
   [junit4]   2> 5999 T49 oashc.HttpShardHandlerFactory.getParameter Setting fairnessPolicy to: false
   [junit4]   2> 6000 T49 oasl.LogWatcher.createWatcher SLF4J impl is org.slf4j.impl.Log4jLoggerFactory
   [junit4]   2> 6000 T49 oasl.LogWatcher.newRegisteredLogWatcher Registering Log Listener [Log4j (org.slf4j.impl.Log4jLoggerFactory)]
   [junit4]   2> 6001 T49 oasc.CoreContainer.load Host Name: 127.0.0.1
   [junit4]   2> 6001 T49 oasc.ZkContainer.initZooKeeper Zookeeper client=127.0.0.1:58339/solr
   [junit4]   2> 6002 T49 oasc.ZkController.checkChrootPath zkHost includes chroot
   [junit4]   2> 6005 T49 oascc.ConnectionManager.waitForConnected Waiting for client to connect to ZooKeeper
   [junit4]   2> 6010 T88 oascc.ConnectionManager.process Watcher org.apache.solr.common.cloud.ConnectionManager@444fc6d4 name:ZooKeeperConnection Watcher:127.0.0.1:58339 got event WatchedEvent state:SyncConnected type:None path:null path:null type:None
   [junit4]   2> 6011 T49 oascc.ConnectionManager.waitForConnected Client is connected to ZooKeeper
   [junit4]   2> 6014 T49 oascc.ConnectionManager.waitForConnected Waiting for client to connect to ZooKeeper
   [junit4]   2> 6018 T90 oascc.ConnectionManager.process Watcher org.apache.solr.common.cloud.ConnectionManager@44480a6e name:ZooKeeperConnection Watcher:127.0.0.1:58339/solr got event WatchedEvent state:SyncConnected type:None path:null path:null type:None
   [junit4]   2> 6018 T49 oascc.ConnectionManager.waitForConnected Client is connected to ZooKeeper
   [junit4]   2> 6026 T49 oascc.ZkStateReader.createClusterStateWatchersAndUpdate Updating cluster state from ZooKeeper... 
   [junit4]   2> 7029 T49 oasc.ZkController.createEphemeralLiveNode Register node as live in ZooKeeper:/live_nodes/127.0.0.1:44704_eyr%2Fe
   [junit4]   2> 7033 T49 oascc.SolrZkClient.makePath makePath: /live_nodes/127.0.0.1:44704_eyr%2Fe
   [junit4]   2> 7047 T49 oasc.CorePropertiesLocator.discover Looking for core definitions underneath /mnt/ssd/jenkins/workspace/Lucene-Solr-trunk-Linux/solr/build/solr-core/test/J1/./solr.cloud.OverseerRolesTest-DAEA0732652EAE59-001/tempDir-003
   [junit4]   2> 7081 T49 oasc.CorePropertiesLocator.discoverUnder Found core conf in /mnt/ssd/jenkins/workspace/Lucene-Solr-trunk-Linux/solr/build/solr-core/test/J1/./solr.cloud.OverseerRolesTest-DAEA0732652EAE59-001/tempDir-003/conf/
   [junit4]   2> 7272 T49 oasc.CorePropertiesLocator.discover Found 1 core definitions
   [junit4]   2> 7274 T49 oass.SolrDispatchFilter.init user.dir=/mnt/ssd/jenkins/workspace/Lucene-Solr-trunk-Linux/solr/build/solr-core/test/J1
   [junit4]   2> 7274 T49 oass.SolrDispatchFilter.init SolrDispatchFilter.init() done
   [junit4]   2> 7631 T49 oasc.AbstractFullDistribZkTestBase.createJettys create jetty 2
   [junit4]   2> 7632 T49 oejs.Server.doStart jetty-8.1.10.v20130312
   [junit4]   2> 7637 T49 oejs.AbstractConnector.doStart Started SelectChannelConnector@127.0.0.1:48234
   [junit4]   2> 7639 T49 oass.SolrDispatchFilter.init SolrDispatchFilter.init()
   [junit4]   2> 7639 T49 oasc.SolrResourceLoader.locateSolrHome JNDI not configured for solr (NoInitialContextEx)
   [junit4]   2> 7639 T49 oasc.SolrResourceLoader.locateSolrHome using system property solr.solr.home: ../../../../../../../../../../mnt/ssd/jenkins/workspace/Lucene-Solr-trunk-Linux/solr/build/solr-core/test/J1/./solr.cloud.OverseerRolesTest-DAEA0732652EAE59-001/tempDir-004
   [junit4]   2> 7640 T49 oasc.SolrResourceLoader.<init> new SolrResourceLoader for directory: '../../../../../../../../../../mnt/ssd/jenkins/workspace/Lucene-Solr-trunk-Linux/solr/build/solr-core/test/J1/./solr.cloud.OverseerRolesTest-DAEA0732652EAE59-001/tempDir-004/'
   [junit4]   2> 7666 T49 oasc.ConfigSolr.fromFile Loading container configuration from /mnt/ssd/jenkins/workspace/Lucene-Solr-trunk-Linux/solr/build/solr-core/test/J1/../../../../../../../../../../mnt/ssd/jenkins/workspace/Lucene-Solr-trunk-Linux/solr/build/solr-core/test/J1/./solr.cloud.OverseerRolesTest-DAEA0732652EAE59-001/tempDir-004/solr.xml
   [junit4]   2> 7748 T49 oasc.CorePropertiesLocator.<init> Config-defined core root directory: /mnt/ssd/jenkins/workspace/Lucene-Solr-trunk-Linux/solr/build/solr-core/test/J1/../../../../../../../../../../mnt/ssd/jenkins/workspace/Lucene-Solr-trunk-Linux/solr/build/solr-core/test/J1/./solr.cloud.OverseerRolesTest-DAEA0732652EAE59-001/tempDir-004
   [junit4]   2> 7749 T49 oasc.CoreContainer.<init> New CoreContainer 594396806
   [junit4]   2> 7749 T49 oasc.CoreContainer.load Loading cores into CoreContainer [instanceDir=../../../../../../../../../../mnt/ssd/jenkins/workspace/Lucene-Solr-trunk-Linux/solr/build/solr-core/test/J1/./solr.cloud.OverseerRolesTest-DAEA0732652EAE59-001/tempDir-004/]
   [junit4]   2> 7754 T49 oashc.HttpShardHandlerFactory.getParameter Setting socketTimeout to: 90000
   [junit4]   2> 7755 T49 oashc.HttpShardHandlerFactory.getParameter Setting urlScheme to: 
   [junit4]   2> 7756 T49 oashc.HttpShardHandlerFactory.getParameter Setting connTimeout to: 15000
   [junit4]   2> 7756 T49 oashc.HttpShardHandlerFactory.getParameter Setting maxConnectionsPerHost to: 20
   [junit4]   2> 7757 T49 oashc.HttpShardHandlerFactory.getParameter Setting corePoolSize to: 0
   [junit4]   2> 7757 T49 oashc.HttpShardHandlerFactory.getParameter Setting maximumPoolSize to: 2147483647
   [junit4]   2> 7758 T49 oashc.HttpShardHandlerFactory.getParameter Setting maxThreadIdleTime to: 5
   [junit4]   2> 7758 T49 oashc.HttpShardHandlerFactory.getParameter Setting sizeOfQueue to: -1
   [junit4]   2> 7759 T49 oashc.HttpShardHandlerFactory.getParameter Setting fairnessPolicy to: false
   [junit4]   2> 7760 T49 oasl.LogWatcher.createWatcher SLF4J impl is org.slf4j.impl.Log4jLoggerFactory
   [junit4]   2> 7760 T49 oasl.LogWatcher.newRegisteredLogWatcher Registering Log Listener [Log4j (org.slf4j.impl.Log4jLoggerFactory)]
   [junit4]   2> 7761 T49 oasc.CoreContainer.load Host Name: 127.0.0.1
   [junit4]   2> 7761 T49 oasc.ZkContainer.initZooKeeper Zookeeper client=127.0.0.1:58339/solr
   [junit4]   2> 7762 T49 oasc.ZkController.checkChrootPath zkHost includes chroot
   [junit4]   2> 7763 T49 oascc.ConnectionManager.waitForConnected Waiting for client to connect to ZooKeeper
   [junit4]   2> 7769 T102 oascc.ConnectionManager.process Watcher org.apache.solr.common.cloud.ConnectionManager@3bb2f89b name:ZooKeeperConnection Watcher:127.0.0.1:58339 got event WatchedEvent state:SyncConnected type:None path:null path:null type:None
   [junit4]   2> 7769 T49 oascc.ConnectionManager.waitForConnected Client is connected to ZooKeeper
   [junit4]   2> 7781 T49 oascc.ConnectionManager.waitForConnected Waiting for client to connect to ZooKeeper
   [junit4]   2> 7783 T104 oascc.ConnectionManager.process Watcher org.apache.solr.common.cloud.ConnectionManager@4cb7591c name:ZooKeeperConnection Watcher:127.0.0.1:58339/solr got event WatchedEvent state:SyncConnected type:None path:null path:null type:None
   [junit4]   2> 7783 T49 oascc.ConnectionManager.waitForConnected Client is connected to ZooKeeper
   [junit4]   2> 7805 T49 oascc.ZkStateReader.createClusterStateWatchersAndUpdate Updating cluster state from ZooKeeper... 
   [junit4]   2> 8809 T49 oasc.ZkController.createEphemeralLiveNode Register node as live in ZooKeeper:/live_nodes/127.0.0.1:48234_eyr%2Fe
   [junit4]   2> 8812 T49 oascc.SolrZkClient.makePath makePath: /live_nodes/127.0.0.1:48234_eyr%2Fe
   [junit4]   2> 8823 T49 oasc.CorePropertiesLocator.discover Looking for core definitions underneath /mnt/ssd/jenkins/workspace/Lucene-Solr-trunk-Linux/solr/build/solr-core/test/J1/../../../../../../../../../../mnt/ssd/jenkins/workspace/Lucene-Solr-trunk-Linux/solr/build/solr-core/test/J1/./solr.cloud.OverseerRolesTest-DAEA0732652EAE59-001/tempDir-004
   [junit4]   2> 8836 T49 oasc.CorePropertiesLocator.discoverUnder Found core conf in /mnt/ssd/jenkins/workspace/Lucene-Solr-trunk-Linux/solr/build/solr-core/test/J1/../../../../../../../../../../mnt/ssd/jenkins/workspace/Lucene-Solr-trunk-Linux/solr/build/solr-core/test/J1/./solr.cloud.OverseerRolesTest-DAEA0732652EAE59-001/tempDir-004/conf/
   [junit4]   2> 9035 T49 oasc.CorePropertiesLocator.discover Found 1 core definitions
   [junit4]   2> 9037 T49 oass.SolrDispatchFilter.init user.dir=/mnt/ssd/jenkins/workspace/Lucene-Solr-trunk-Linux/solr/build/solr-core/test/J1
   [junit4]   2> 9037 T49 oass.SolrDispatchFilter.init SolrDispatchFilter.init() done
   [junit4]   2> 9452 T49 oasc.AbstractFullDistribZkTestBase.createJettys create jetty 3
   [junit4]   2> 9454 T49 oejs.Server.doStart jetty-8.1.10.v20130312
   [junit4]   2> 9459 T49 oejs.AbstractConnector.doStart Started SelectChannelConnector@127.0.0.1:32833
   [junit4]   2> 9460 T49 oass.SolrDispatchFilter.init SolrDispatchFilter.init()
   [junit4]   2> 9461 T49 oasc.SolrResourceLoader.locateSolrHome JNDI not configured for solr (NoInitialContextEx)
   [junit4]   2> 9461 T49 oasc.SolrResourceLoader.locateSolrHome using system property solr.solr.home: ./solr.cloud.OverseerRolesTest-DAEA0732652EAE59-001/tempDir-005
   [junit4]   2> 9462 T49 oasc.SolrResourceLoader.<init> new SolrResourceLoader for directory: './solr.cloud.OverseerRolesTest-DAEA0732652EAE59-001/tempDir-005/'
   [junit4]   2> 9503 T49 oasc.ConfigSolr.fromFile Loading container configuration from /mnt/ssd/jenkins/workspace/Lucene-Solr-trunk-Linux/solr/build/solr-core/test/J1/./solr.cloud.OverseerRolesTest-DAEA0732652EAE59-001/tempDir-005/solr.xml
   [junit4]   2> 9713 T49 oasc.CorePropertiesLocator.<init> Config-defined core root directory: /mnt/ssd/jenkins/workspace/Lucene-Solr-trunk-Linux/solr/build/solr-core/test/J1/./solr.cloud.OverseerRolesTest-DAEA0732652EAE59-001/tempDir-005
   [junit4]   2> 9714 T49 oasc.CoreContainer.<init> New CoreContainer 1841922731
   [junit4]   2> 9715 T49 oasc.CoreContainer.load Loading cores into CoreContainer [instanceDir=./solr.cloud.OverseerRolesTest-DAEA0732652EAE59-001/tempDir-005/]
   [junit4]   2> 9723 T49 oashc.HttpShardHandlerFactory.getParameter Setting socketTimeout to: 90000
   [junit4]   2> 9724 T49 oashc.HttpShardHandlerFactory.getParameter Setting urlScheme to: 
   [junit4]   2> 9724 T49 oashc.HttpShardHandlerFactory.getParameter Setting connTimeout to: 15000
   [junit4]   2> 9725 T49 oashc.HttpShardHandlerFactory.getParameter Setting maxConnectionsPerHost to: 20
   [junit4]   2> 9725 T49 oashc.HttpShardHandlerFactory.getParameter Setting corePoolSize to: 0
   [junit4]   2> 9726 T49 oashc.HttpShardHandlerFactory.getParameter Setting maximumPoolSize to: 2147483647
   [junit4]   2> 9726 T49 oashc.HttpShardHandlerFactory.getParameter Setting maxThreadIdleTime to: 5
   [junit4]   2> 9727 T49 oashc.HttpShardHandlerFactory.getParameter Setting sizeOfQueue to: -1
   [junit4]   2> 9727 T49 oashc.HttpShardHandlerFactory.getParameter Setting fairnessPolicy to: false
   [junit4]   2> 9728 T49 oasl.LogWatcher.createWatcher SLF4J impl is org.slf4j.impl.Log4jLoggerFactory
   [junit4]   2> 9729 T49 oasl.LogWatcher.newRegisteredLogWatcher Registering Log Listener [Log4j (org.slf4j.impl.Log4jLoggerFactory)]
   [junit4]   2> 9729 T49 oasc.CoreContainer.load Host Name: 127.0.0.1
   [junit4]   2> 9730 T49 oasc.ZkContainer.initZooKeeper Zookeeper client=127.0.0.1:58339/solr
   [junit4]   2> 9731 T49 oasc.ZkController.checkChrootPath zkHost includes chroot
   [junit4]   2> 9732 T49 oascc.ConnectionManager.waitForConnected Waiting for client to connect to ZooKeeper
   [junit4]   2> 9736 T116 oascc.ConnectionManager.process Watcher org.apache.solr.common.cloud.ConnectionManager@1efd7dc6 name:ZooKeeperConnection Watcher:127.0.0.1:58339 got event WatchedEvent state:SyncConnected type:None path:null path:null type:None
   [junit4]   2> 9736 T49 oascc.ConnectionManager.waitForConnected Client is connected to ZooKeeper
   [junit4]   2> 9740 T49 oascc.ConnectionManager.waitForConnected Waiting for client to connect to ZooKeeper
   [junit4]   2> 9751 T118 oascc.ConnectionManager.process Watcher org.apache.solr.common.cloud.ConnectionManager@65ad3a49 name:ZooKeeperConnection Watcher:127.0.0.1:58339/solr got event WatchedEvent state:SyncConnected type:None path:null path:null type:None
   [junit4]   2> 9754 T49 oascc.ConnectionManager.waitForConnected Client is connected to ZooKeeper
   [junit4]   2> 9764 T49 oascc.ZkStateReader.createClusterStateWatchersAndUpdate Updating cluster state from ZooKeeper... 
   [junit4]   2> 10769 T49 oasc.ZkController.createEphemeralLiveNode Register node as live in ZooKeeper:/live_nodes/127.0.0.1:32833_eyr%2Fe
   [junit4]   2> 10772 T49 oascc.SolrZkClient.makePath makePath: /live_nodes/127.0.0.1:32833_eyr%2Fe
   [junit4]   2> 10789 T49 oasc.CorePropertiesLocator.discover Looking for core definitions underneath /mnt/ssd/jenkins/workspace/Lucene-Solr-trunk-Linux/solr/build/solr-core/test/J1/./solr.cloud.OverseerRolesTest-DAEA0732652EAE59-001/tempDir-005
   [junit4]   2> 10802 T49 oasc.CorePropertiesLocator.discoverUnder Found core conf in /mnt/ssd/jenkins/workspace/Lucene-Solr-trunk-Linux/solr/build/solr-core/test/J1/./solr.cloud.OverseerRolesTest-DAEA0732652EAE59-001/tempDir-005/conf/
   [junit4]   2> 10968 T49 oasc.CorePropertiesLocator.discover Found 1 core definitions
   [junit4]   2> 10970 T49 oass.SolrDispatchFilter.init user.dir=/mnt/ssd/jenkins/workspace/Lucene-Solr-trunk-Linux/solr/build/solr-core/test/J1
   [junit4]   2> 10971 T49 oass.SolrDispatchFilter.init SolrDispatchFilter.init() done
   [junit4]   2> 11402 T49 oasc.AbstractFullDistribZkTestBase.createJettys create jetty 4
   [junit4]   2> 11403 T49 oejs.Server.doStart jetty-8.1.10.v20130312
   [junit4]   2> 11405 T49 oejs.AbstractConnector.doStart Started SelectChannelConnector@127.0.0.1:35599
   [junit4]   2> 11407 T49 oass.SolrDispatchFilter.init SolrDispatchFilter.init()
   [junit4]   2> 11414 T49 oasc.SolrResourceLoader.locateSolrHome JNDI not configured for solr (NoInitialContextEx)
   [junit4]   2> 11415 T49 oasc.SolrResourceLoader.locateSolrHome using system property solr.solr.home: ./solr.cloud.OverseerRolesTest-DAEA0732652EAE59-001/tempDir-006
   [junit4]   2> 11416 T49 oasc.SolrResourceLoader.<init> new SolrResourceLoader for directory: './solr.cloud.OverseerRolesTest-DAEA0732652EAE59-001/tempDir-006/'
   [junit4]   2> 11453 T49 oasc.ConfigSolr.fromFile Loading container configuration from /mnt/ssd/jenkins/workspace/Lucene-Solr-trunk-Linux/solr/build/solr-core/test/J1/./solr.cloud.OverseerRolesTest-DAEA0732652EAE59-001/tempDir-006/solr.xml
   [junit4]   2> 11647 T49 oasc.CorePropertiesLocator.<init> Config-defined core root directory: /mnt/ssd/jenkins/workspace/Lucene-Solr-trunk-Linux/solr/build/solr-core/test/J1/./solr.cloud.OverseerRolesTest-DAEA0732652EAE59-001/tempDir-006
   [junit4]   2> 11648 T49 oasc.CoreContainer.<init> New CoreContainer 1187773558
   [junit4]   2> 11648 T49 oasc.CoreContainer.load Loading cores into CoreContainer [instanceDir=./solr.cloud.OverseerRolesTest-DAEA0732652EAE59-001/tempDir-006/]
   [junit4]   2> 11649 T49 oashc.HttpShardHandlerFactory.getParameter Setting socketTimeout to: 90000
   [junit4]   2> 11650 T49 oashc.HttpShardHandlerFactory.getParameter Setting urlScheme to: 
   [junit4]   2> 11650 T49 oashc.HttpShardHandlerFactory.getParameter Setting connTimeout to: 15000
   [junit4]   2> 11650 T49 oashc.HttpShardHandlerFactory.getParameter Setting maxConnectionsPerHost to: 20
   [junit4]   2> 11651 T49 oashc.HttpShardHandlerFactory.getParameter Setting corePoolSize to: 0
   [junit4]   2> 11656 T49 oashc.HttpShardHandlerFactory.getParameter Setting maximumPoolSize to: 2147483647
   [junit4]   2> 11656 T49 oashc.HttpShardHandlerFactory.getParameter Setting maxThreadIdleTime to: 5
   [junit4]   2> 11656 T49 oashc.HttpShardHandlerFactory.getParameter Setting sizeOfQueue to: -1
   [junit4]   2> 11657 T49 oashc.HttpShardHandlerFactory.getParameter Setting fairnessPolicy to: false
   [junit4]   2> 11658 T49 oasl.LogWatcher.createWatcher SLF4J impl is org.slf4j.impl.Log4jLoggerFactory
   [junit4]   2> 11658 T49 oasl.LogWatcher.newRegisteredLogWatcher Registering Log Listener [Log4j (org.slf4j.impl.Log4jLoggerFactory)]
   [junit4]   2> 11658 T49 oasc.CoreContainer.load Host Name: 127.0.0.1
   [junit4]   2> 11659 T49 oasc.ZkContainer.initZooKeeper Zookeeper client=127.0.0.1:58339/solr
   [junit4]   2> 11659 T49 oasc.ZkController.checkChrootPath zkHost includes chroot
   [junit4]   2> 11660 T49 oascc.ConnectionManager.waitForConnected Waiting for client to connect to ZooKeeper
   [junit4]   2> 11665 T130 oascc.ConnectionManager.process Watcher org.apache.solr.common.cloud.ConnectionManager@450fb77c name:ZooKeeperConnection Watcher:127.0.0.1:58339 got event WatchedEvent state:SyncConnected type:None path:null path:null type:None
   [junit4]   2> 11666 T49 oascc.ConnectionManager.waitForConnected Client is connected to ZooKeeper
   [junit4]   2> 11674 T49 oascc.ConnectionManager.waitForConnected Waiting for client to connect to ZooKeeper
   [junit4]   2> 11678 T132 oascc.ConnectionManager.process Watcher org.apache.solr.common.cloud.ConnectionManager@ff408c0 name:ZooKeeperConnection Watcher:127.0.0.1:58339/solr got event WatchedEvent state:SyncConnected type:None path:null path:null type:None
   [junit4]   2> 11678 T49 oascc.ConnectionManager.waitForConnected Client is connected to ZooKeeper
   [junit4]   2> 11687 T49 oascc.ZkStateReader.createClusterStateWatchersAndUpdate Updating cluster state from ZooKeeper... 
   [junit4]   2> 12690 T49 oasc.ZkController.createEphemeralLiveNode Register node as live in ZooKeeper:/live_nodes/127.0.0.1:35599_eyr%2Fe
   [junit4]   2> 12692 T49 oascc.SolrZkClient.makePath makePath: /live_nodes/127.0.0.1:35599_eyr%2Fe
   [junit4]   2> 12825 T49 oasc.CorePropertiesLocator.discover Looking for core definitions underneath /mnt/ssd/jenkins/workspace/Lucene-Solr-trunk-Linux/solr/build/solr-core/test/J1/./solr.cloud.OverseerRolesTest-DAEA0732652EAE59-001/tempDir-006
   [junit4]   2> 12833 T49 oasc.CorePropertiesLocator.discoverUnder Found core conf in /mnt/ssd/jenkins/workspace/Lucene-Solr-trunk-Linux/solr/build/solr-core/test/J1/./solr.cloud.OverseerRolesTest-DAEA0732652EAE59-001/tempDir-006/conf/
   [junit4]   2> 12943 T49 oasc.CorePropertiesLocator.discover Found 1 core definitions
   [junit4]   2> 12944 T49 oass.SolrDispatchFilter.init user.dir=/mnt/ssd/jenkins/workspace/Lucene-Solr-trunk-Linux/solr/build/solr-core/test/J1
   [junit4]   2> 12945 T49 oass.SolrDispatchFilter.init SolrDispatchFilter.init() done
   [junit4]   2> 13299 T49 oasc.AbstractFullDistribZkTestBase.createJettys create jetty 5
   [junit4]   2> 13301 T49 oejs.Server.doStart jetty-8.1.10.v20130312
   [junit4]   2> 13317 T49 oejs.AbstractConnector.doStart Started SelectChannelConnector@127.0.0.1:39985
   [junit4]   2> 13319 T49 oass.SolrDispatchFilter.init SolrDispatchFilter.init()
   [junit4]   2> 13320 T49 oasc.SolrResourceLoader.locateSolrHome JNDI not configured for solr (NoInitialContextEx)
   [junit4]   2> 13321 T49 oasc.SolrResourceLoader.locateSolrHome using system property solr.solr.home: ../../../../../../../../../../mnt/ssd/jenkins/workspace/Lucene-Solr-trunk-Linux/solr/build/solr-core/test/J1/./solr.cloud.OverseerRolesTest-DAEA0732652EAE59-001/tempDir-007
   [junit4]   2> 13322 T49 oasc.SolrResourceLoader.<init> new SolrResourceLoader for directory: '../../../../../../../../../../mnt/ssd/jenkins/workspace/Lucene-Solr-trunk-Linux/solr/build/solr-core/test/J1/./solr.cloud.OverseerRolesTest-DAEA0732652EAE59-001/tempDir-007/'
   [junit4]   2> 13359 T49 oasc.ConfigSolr.fromFile Loading container configuration from /mnt/ssd/jenkins/workspace/Lucene-Solr-trunk-Linux/solr/build/solr-core/test/J1/../../../../../../../../../../mnt/ssd/jenkins/workspace/Lucene-Solr-trunk-Linux/solr/build/solr-core/test/J1/./solr.cloud.OverseerRolesTest-DAEA0732652EAE59-001/tempDir-007/solr.xml
   [junit4]   2> 13627 T49 oasc.CorePropertiesLocator.<init> Config-defined core root directory: /mnt/ssd/jenkins/workspace/Lucene-Solr-trunk-Linux/solr/build/solr-core/test/J1/../../../../../../../../../../mnt/ssd/jenkins/workspace/Lucene-Solr-trunk-Linux/solr/build/solr-core/test/J1/./solr.cloud.OverseerRolesTest-DAEA0732652EAE59-001/tempDir-007
   [junit4]   2> 13628 T49 oasc.CoreContainer.<init> New CoreContainer 887487274
   [junit4]   2> 13628 T49 oasc.CoreContainer.load Loading cores into CoreContainer [instanceDir=../../../../../../../../../../mnt/ssd/jenkins/workspace/Lucene-Solr-trunk-Linux/solr/build/solr-core/test/J1/./solr.cloud.OverseerRolesTest-DAEA0732652EAE59-001/tempDir-007/]
   [junit4]   2> 13653 T49 oashc.HttpShardHandlerFactory.getParameter Setting socketTimeout to: 90000
   [junit4]   2> 13654 T49 oashc.HttpShardHandlerFactory.getParameter Setting urlScheme to: 
   [junit4]   2> 13655 T49 oashc.HttpShardHandlerFactory.getParameter Setting connTimeout to: 15000
   [junit4]   2> 13655 T49 oashc.HttpShardHandlerFactory.getParameter Setting maxConnectionsPerHost to: 20
   [junit4]   2> 13656 T49 oashc.HttpShardHandlerFactory.getParameter Setting corePoolSize to: 0
   [junit4]   2> 13656 T49 oashc.HttpShardHandlerFactory.getParameter Setting maximumPoolSize to: 2147483647
   [junit4]   2> 13657 T49 oashc.HttpShardHandlerFactory.getParameter Setting maxThreadIdleTime to: 5
   [junit4]   2> 13657 T49 oashc.HttpShardHandlerFactory.getParameter Setting sizeOfQueue to: -1
   [junit4]   2> 13658 T49 oashc.HttpShardHandlerFactory.getParameter Setting fairnessPolicy to: false
   [junit4]   2> 13659 T49 oasl.LogWatcher.createWatcher SLF4J impl is org.slf4j.impl.Log4jLoggerFactory
   [junit4]   2> 13659 T49 oasl.LogWatcher.newRegisteredLogWatcher Registering Log Listener [Log4j (org.slf4j.impl.Log4jLoggerFactory)]
   [junit4]   2> 13660 T49 oasc.CoreContainer.load Host Name: 127.0.0.1
   [junit4]   2> 13660 T49 oasc.ZkContainer.initZooKeeper Zookeeper client=127.0.0.1:58339/solr
   [junit4]   2> 13661 T49 oasc.ZkController.checkChrootPath zkHost includes chroot
   [junit4]   2> 13681 T49 oascc.ConnectionManager.waitForConnected Waiting for client to connect to ZooKeeper
   [junit4]   2> 13685 T144 oascc.ConnectionManager.process Watcher org.apache.solr.common.cloud.ConnectionManager@47cebc8d name:ZooKeeperConnection Watcher:127.0.0.1:58339 got event WatchedEvent state:SyncConnected type:None path:null path:null type:None
   [junit4]   2> 13691 T49 oascc.ConnectionManager.waitForConnected Client is connected to ZooKeeper
   [junit4]   2> 13719 T49 oascc.ConnectionManager.waitForConnected Waiting for client to connect to ZooKeeper
   [junit4]   2> 13727 T146 oascc.ConnectionManager.process Watcher org.apache.solr.common.cloud.ConnectionManager@2d87d3dd name:ZooKeeperConnection Watcher:127.0.0.1:58339/solr got event WatchedEvent state:SyncConnected type:None path:null path:null type:None
   [junit4]   2> 13728 T49 oascc.ConnectionManager.waitForConnected Client is connected to ZooKeeper
   [junit4]   2> 13749 T49 oascc.ZkStateReader.createClusterStateWatchersAndUpdate Updating cluster state from ZooKeeper... 
   [junit4]   2> 14754 T49 oasc.ZkController.createEphemeralLiveNode Register node as live in ZooKeeper:/live_nodes/127.0.0.1:39985_eyr%2Fe
   [junit4]   2> 14757 T49 oascc.SolrZkClient.makePath makePath: /live_nodes/127.0.0.1:39985_eyr%2Fe
   [junit4]   2> 14777 T49 oasc.CorePropertiesLocator.discover Looking for core definitions underneath /mnt/ssd/jenkins/workspace/Lucene-Solr-trunk-Linux/solr/build/solr-core/test/J1/../../../../../../../../../../mnt/ssd/jenkins/workspace/Lucene-Solr-trunk-Linux/solr/build/solr-core/test/J1/./solr.cloud.OverseerRolesTest-DAEA0732652EAE59-001/tempDir-007
   [junit4]   2> 14790 T49 oasc.CorePropertiesLocator.discoverUnder Found core conf in /mnt/ssd/jenkins/workspace/Lucene-Solr-trunk-Linux/solr/build/solr-core/test/J1/../../../../../../../../../../mnt/ssd/jenkins/workspace/Lucene-Solr-trunk-Linux/solr/build/solr-core/test/J1/./solr.cloud.OverseerRolesTest-DAEA0732652EAE59-001/tempDir-007/conf/
   [junit4]   2> 15017 T49 oasc.CorePropertiesLocator.discover Found 1 core definitions
   [junit4]   2> 15019 T49 oass.SolrDispatchFilter.init user.dir=/mnt/ssd/jenkins/workspace/Lucene-Solr-trunk-Linux/solr/build/solr-core/test/J1
   [junit4]   2> 15020 T49 oass.SolrDispatchFilter.init SolrDispatchFilter.init() done
   [junit4]   2> 15519 T49 oasc.AbstractFullDistribZkTestBase.createJettys create jetty 6
   [junit4]   2> 15520 T49 oejs.Server.doStart jetty-8.1.10.v20130312
   [junit4]   2> 15568 T49 oejs.AbstractConnector.doStart Started SelectChannelConnector@127.0.0.1:55506
   [junit4]   2> 15569 T49 oass.SolrDispatchFilter.init SolrDispatchFilter.init()
   [junit4]   2> 15570 T49 oasc.SolrResourceLoader.locateSolrHome JNDI not configured for solr (NoInitialContextEx)
   [junit4]   2> 15570 T49 oasc.SolrResourceLoader.locateSolrHome using system property solr.solr.home: ./solr.cloud.OverseerRolesTest-DAEA0732652EAE59-001/tempDir-008
   [junit4]   2> 15571 T49 oasc.SolrResourceLoader.<init> new SolrResourceLoader for directory: './solr.cloud.OverseerRolesTest-DAEA0732652EAE59-001/tempDir-008/'
   [junit4]   2> 15646 T49 oasc.ConfigSolr.fromFile Loading container configuration from /mnt/ssd/jenkins/workspace/Lucene-Solr-trunk-Linux/solr/build/solr-core/test/J1/./solr.cloud.OverseerRolesTest-DAEA0732652EAE59-001/tempDir-008/solr.xml
   [junit4]   2> 15822 T49 oasc.CorePropertiesLocator.<init> Config-defined core root directory: /mnt/ssd/jenkins/workspace/Lucene-Solr-trunk-Linux/solr/build/solr-core/test/J1/./solr.cloud.OverseerRolesTest-DAEA0732652EAE59-001/tempDir-008
   [junit4]   2> 15823 T49 oasc.CoreContainer.<init> New CoreContainer 626330386
   [junit4]   2> 15824 T49 oasc.CoreContainer.load Loading cores into CoreContainer [instanceDir=./solr.cloud.OverseerRolesTest-DAEA0732652EAE59-001/tempDir-008/]
   [junit4]   2> 15825 T49 oashc.HttpShardHandlerFactory.getParameter Setting socketTimeout to: 90000
   [junit4]   2> 15825 T49 oashc.HttpShardHandlerFactory.getParameter Setting urlScheme to: 
   [junit4]   2> 15826 T49 oashc.HttpShardHandlerFactory.getParameter Setting connTimeout to: 15000
   [junit4]   2> 15826 T49 oashc.HttpShardHandlerFactory.getParameter Setting maxConnectionsPerHost to: 20
   [junit4]   2> 15827 T49 oashc.HttpShardHandlerFactory.getParameter Setting corePoolSize to: 0
   [junit4]   2> 15827 T49 oashc.HttpShardHandlerFactory.getParameter Setting maximumPoolSize to: 2147483647
   [junit4]   2> 15828 T49 oashc.HttpShardHandlerFactory.getParameter Setting maxThreadIdleTime to: 5
   [junit4]   2> 15828 T49 oashc.HttpShardHandlerFactory.getParameter Setting sizeOfQueue to: -1
   [junit4]   2> 15829 T49 oashc.HttpShardHandlerFactory.getParameter Setting fairnessPolicy to: false
   [junit4]   2> 15841 T49 oasl.LogWatcher.createWatcher SLF4J impl is org.slf4j.impl.Log4jLoggerFactory
   [junit4]   2> 15841 T49 oasl.LogWatcher.newRegisteredLogWatcher Registering Log Listener [Log4j (org.slf4j.impl.Log4jLoggerFactory)]
   [junit4]   2> 15842 T49 oasc.CoreContainer.load Host Name: 127.0.0.1
   [junit4]   2> 15842 T49 oasc.ZkContainer.initZooKeeper Zookeeper client=127.0.0.1:58339/solr
   [junit4]   2> 15842 T49 oasc.ZkController.checkChrootPath zkHost includes chroot
   [junit4]   2> 15844 T49 oascc.ConnectionManager.waitForConnected Waiting for client to connect to ZooKeeper
   [junit4]   2> 15852 T158 oascc.ConnectionManager.process Watcher org.apache.solr.common.cloud.ConnectionManager@1b888a73 name:ZooKeeperConnection Watcher:127.0.0.1:58339 got event WatchedEvent state:SyncConnected type:None path:null path:null type:None
   [junit4]   2> 15853 T49 oascc.ConnectionManager.waitForConnected Client is connected to ZooKeeper
   [junit4]   2> 15860 T49 oascc.ConnectionManager.waitForConnected Waiting for client to connect to ZooKeeper
   [junit4]   2> 15863 T160 oascc.ConnectionManager.process Watcher org.apache.solr.common.cloud.ConnectionManager@27679ab8 name:ZooKeeperConnection Watcher:127.0.0.1:58339/solr got event WatchedEvent state:SyncConnected type:None path:null path:null type:None
   [junit4]   2> 15863 T49 oascc.ConnectionManager.waitForConnected Client is connected to ZooKeeper
   [junit4]   2> 15893 T49 oascc.ZkStateReader.createClusterStateWatchersAndUpdate Updating cluster state from ZooKeeper... 
   [junit4]   2> 16897 T49 oasc.ZkController.createEphemeralLiveNode Register node as live in ZooKeeper:/live_nodes/127.0.0.1:55506_eyr%2Fe
   [junit4]   2> 16901 T49 oascc.SolrZkClient.makePath makePath: /live_nodes/127.0.0.1:55506_eyr%2Fe
   [junit4]   2> 16910 T49 oasc.CorePropertiesLocator.discover Looking for core definitions underneath /mnt/ssd/jenkins/workspace/Lucene-Solr-trunk-Linux/solr/build/solr-core/test/J1/./solr.cloud.OverseerRolesTest-DAEA0732652EAE59-001/tempDir-008
   [junit4]   2> 16915 T49 oasc.CorePropertiesLocator.discoverUnder Found core conf in /mnt/ssd/jenkins/workspace/Lucene-Solr-trunk-Linux/solr/build/solr-core/test/J1/./solr.cloud.OverseerRolesTest-DAEA0732652EAE59-001/tempDir-008/conf/
   [junit4]   2> 17033 T49 oasc.CorePropertiesLocator.discover Found 1 core definitions
   [junit4]   2> 17034 T49 oass.SolrDispatchFilter.init user.dir=/mnt/ssd/jenkins/workspace/Lucene-Solr-trunk-Linux/solr/build/solr-core/test/J1
   [junit4]   2> 17034 T49 oass.SolrDispatchFilter.init SolrDispatchFilter.init() done
   [junit4]   2> 17036 T49 oascc.ConnectionManager.waitForConnected Waiting for client to connect to ZooKeeper
   [junit4]   2> 17040 T163 oascc.ConnectionManager.process Watcher org.apache.solr.common.cloud.ConnectionManager@2ae708dd name:ZooKeeperConnection Watcher:127.0.0.1:58339/solr got event WatchedEvent state:SyncConnected type:None path:null path:null type:None
   [junit4]   2> 17041 T49 oascc.ConnectionManager.waitForConnected Client is connected to ZooKeeper
   [junit4]   2> 17043 T49 oascc.ZkStateReader.createClusterStateWatchersAndUpdate Updating cluster state from ZooKeeper... 
   [junit4]   2> 17049 T49 oascc.ConnectionManager.waitForConnected Waiting for client to connect to ZooKeeper
   [junit4]   2> 17051 T165 oascc.ConnectionManager.process Watcher org.apache.solr.common.cloud.ConnectionManager@7563d4e0 name:ZooKeeperConnection Watcher:127.0.0.1:58339/solr got event WatchedEvent state:SyncConnected type:None path:null path:null type:None
   [junit4]   2> 17052 T49 oascc.ConnectionManager.waitForConnected Client is connected to ZooKeeper
   [junit4]   2> 17054 T49 oascc.ZkStateReader.createClusterStateWatchersAndUpdate Updating cluster state from ZooKeeper... 
   [junit4]   2> 17385 T140 oasha.CollectionsHandler.handleCreateAction Creating Collection : replicationFactor=2&maxShardsPerNode=2&name=testOverseerQuit&action=CREATE&numShards=4&wt=javabin&version=2
   [junit4]   2> 17389 T72 oasc.DistributedQueue$LatchChildWatcher.process LatchChildWatcher fired on path: /overseer/collection-queue-work state: SyncConnected type NodeChildrenChanged
   [junit4]   2> 17393 T74 oasc.OverseerCollectionProcessor.run Overseer Collection Processor: Get the message id:/overseer/collection-queue-work/qn-0000000000 message:{
   [junit4]   2> 	  "operation":"createcollection",
   [junit4]   2> 	  "fromApi":"true",
   [junit4]   2> 	  "name":"testOverseerQuit",
   [junit4]   2> 	  "replicationFactor":"2",
   [junit4]   2> 	  "numShards":"4",
   [junit4]   2> 	  "maxShardsPerNode":"2"}
   [junit4]   2> 17394 T74 oasc.OverseerCollectionProcessor.processMessage WARN OverseerCollectionProcessor.processMessage : createcollection , {
   [junit4]   2> 	  "operation":"createcollection",
   [junit4]   2> 	  "fromApi":"true",
   [junit4]   2> 	  "name":"testOverseerQuit",
   [junit4]   2> 	  "replicationFactor":"2",
   [junit4]   2> 	  "numShards":"4",
   [junit4]   2> 	  "maxShardsPerNode":"2"}
   [junit4]   2> 17397 T74 oasc.OverseerCollectionProcessor.createConfNode Only one config set found in zk - using it:conf1
   [junit4]   2> 17397 T74 oasc.OverseerCollectionProcessor.createConfNode creating collections conf node /collections/testOverseerQuit 
   [junit4]   2> 17398 T74 oascc.SolrZkClient.makePath makePath: /collections/testOverseerQuit
   [junit4]   2> 17402 T72 oasc.DistributedQueue$LatchChildWatcher.process LatchChildWatcher fired on path: /overseer/queue state: SyncConnected type NodeChildrenChanged
   [junit4]   2> 17403 T73 oascc.ZkStateReader.updateClusterState Updating cloud state from ZooKeeper... 
   [junit4]   2> 17405 T73 oasc.Overseer$ClusterStateUpdater.buildCollection building a new collection: testOverseerQuit
   [junit4]   2> 17405 T73 oasc.Overseer$ClusterStateUpdater.createCollection Create collection testOverseerQuit with shards [shard1, shard2, shard3, shard4]
   [junit4]   2> 17418 T72 oasc.DistributedQueue$LatchChildWatcher.process LatchChildWatcher fired on path: /overseer/queue state: SyncConnected type NodeChildrenChanged
   [junit4]   2> 17422 T160 oascc.ZkStateReader$2.process A cluster state change: WatchedEvent state:SyncConnected type:NodeDataChanged path:/clusterstate.json, has occurred - updating... (live nodes size: 7)
   [junit4]   2> 17423 T72 oascc.ZkStateReader$2.process A cluster state change: WatchedEvent state:SyncConnected type:NodeDataChanged path:/clusterstate.json, has occurred - updating... (live nodes size: 7)
   [junit4]   2> 17423 T165 oascc.ZkStateReader$2.process A cluster state change: WatchedEvent state:SyncConnected type:NodeDataChanged path:/clusterstate.json, has occurred - updating... (live nodes size: 7)
   [junit4]   2> 17423 T163 oascc.ZkStateReader$2.process A cluster state change: WatchedEvent state:SyncConnected type:NodeDataChanged path:/clusterstate.json, has occurred - updating... (live nodes size: 7)
   [junit4]   2> 17423 T104 oascc.ZkStateReader$2.process A cluster state change: WatchedEvent state:SyncConnected type:NodeDataChanged path:/clusterstate.json, has occurred - updating... (live nodes size: 7)
   [junit4]   2> 17423 T77 oascc.ZkStateReader$2.process A cluster state change: WatchedEvent state:SyncConnected type:NodeDataChanged path:/clusterstate.json, has occurred - updating... (live nodes size: 7)
   [junit4]   2> 17423 T118 oascc.ZkStateReader$2.process A cluster state change: WatchedEvent state:SyncConnected type:NodeDataChanged path:/clusterstate.json, has occurred - updating... (live nodes size: 7)
   [junit4]   2> 17422 T132 oascc.ZkStateReader$2.process A cluster state change: WatchedEvent state:SyncConnected type:NodeDataChanged path:/clusterstate.json, has occurred - updating... (live nodes size: 7)
   [junit4]   2> 17422 T90 oascc.ZkStateReader$2.process A cluster state change: WatchedEvent state:SyncConnected type:NodeDataChanged path:/clusterstate.json, has occurred - updating... (live nodes size: 7)
   [junit4]   2> 17422 T146 oascc.ZkStateReader$2.process A cluster state change: WatchedEvent state:SyncConnected type:NodeDataChanged path:/clusterstate.json, has occurred - updating... (live nodes size: 7)
   [junit4]   2> 17502 T74 oasc.OverseerCollectionProcessor.createCollection Creating SolrCores for new collection, shardNames [shard1, shard2, shard3, shard4] , replicationFactor : 2
   [junit4]   2> 17507 T74 oasc.OverseerCollectionProcessor.createCollection Creating shard testOverseerQuit_shard1_replica1 as part of slice shard1 of collection testOverseerQuit on 127.0.0.1:48234_eyr%2Fe
   [junit4]   2> 17517 T74 oasc.OverseerCollectionProcessor.createCollection Creating shard testOverseerQuit_shard1_replica2 as part of slice shard1 of collection testOverseerQuit on 127.0.0.1:44704_eyr%2Fe
   [junit4]   2> 17520 T74 oasc.OverseerCollectionProcessor.createCollection Creating shard testOverseerQuit_shard2_replica1 as part of slice shard2 of collection testOverseerQuit on 127.0.0.1:32833_eyr%2Fe
   [junit4]   2> 17521 T74 oasc.OverseerCollectionProcessor.createCollection Creating shard testOverseerQuit_shard2_replica2 as part of slice shard2 of collection testOverseerQuit on 127.0.0.1:35599_eyr%2Fe
   [junit4]   2> 17522 T74 oasc.OverseerCollectionProcessor.createCollection Creating shard testOverseerQuit_shard3_replica1 as part of slice shard3 of collection testOverseerQuit on 127.0.0.1:50269_eyr%2Fe
   [junit4]   2> 17524 T74 oasc.OverseerCollectionProcessor.createCollection Creating shard testOverseerQuit_shard3_replica2 as part of slice shard3 of collection testOverseerQuit on 127.0.0.1:55506_eyr%2Fe
   [junit4]   2> 17524 T74 oasc.OverseerCollectionProcessor.createCollection Creating shard testOverseerQuit_shard4_replica1 as part of slice shard4 of collection testOverseerQuit on 127.0.0.1:39985_eyr%2Fe
   [junit4]   2> 17530 T74 oasc.OverseerCollectionProcessor.createCollection Creating shard testOverseerQuit_shard4_replica2 as part of slice shard4 of collection testOverseerQuit on 127.0.0.1:48234_eyr%2Fe
   [junit4]   2> 17556 T139 oasha.CoreAdminHandler.handleCreateAction core create command qt=/admin/cores&collection.configName=conf1&name=testOverseerQuit_shard4_replica1&action=CREATE&numShards=4&collection=testOverseerQuit&shard=shard4&wt=javabin&version=2
   [junit4]   2> 17556 T100 oasha.CoreAdminHandler.handleCreateAction core create command qt=/admin/cores&collection.configName=conf1&name=testOverseerQuit_shard4_replica2&action=CREATE&numShards=4&collection=testOverseerQuit&shard=shard4&wt=javabin&version=2
   [junit4]   2> 17560 T125 oasha.CoreAdminHandler.handleCreateAction core create command qt=/admin/cores&collection.configName=conf1&name=testOverseerQuit_shard2_replica2&action=CREATE&numShards=4&collection=testOverseerQuit&shard=shard2&wt=javabin&version=2
   [junit4]   2> 17560 T85 oasha.CoreAdminHandler.handleCreateAction core create command qt=/admin/cores&collection.configName=conf1&name=testOverseerQuit_shard1_replica2&action=CREATE&numShards=4&collection=testOverseerQuit&shard=shard1&wt=javabin&version=2
   [junit4]   2> 17560 T114 oasha.CoreAdminHandler.handleCreateAction core create command qt=/admin/cores&collection.configName=conf1&name=testOverseerQuit_shard2_replica1&action=CREATE&numShards=4&collection=testOverseerQuit&shard=shard2&wt=javabin&version=2
   [junit4]   2> 17557 T67 oasha.CoreAdminHandler.handleCreateAction core create command qt=/admin/cores&collection.configName=conf1&name=testOverseerQuit_shard3_replica1&action=CREATE&numShards=4&collection=testOverseerQuit&shard=shard3&wt=javabin&version=2
   [junit4]   2> 17556 T98 oasha.CoreAdminHandler.handleCreateAction core create command qt=/admin/cores&collection.configName=conf1&name=testOverseerQuit_shard1_replica1&action=CREATE&numShards=4&collection=testOverseerQuit&shard=shard1&wt=javabin&version=2
   [junit4]   2> 17556 T155 oasha.CoreAdminHandler.handleCreateAction core create command qt=/admin/cores&collection.configName=conf1&name=testOverseerQuit_shard3_replica2&action=CREATE&numShards=4&collection=testOverseerQuit&shard=shard3&wt=javabin&version=2
   [junit4]   2> 17570 T114 oasc.ZkController.publish publishing core=testOverseerQuit_shard2_replica1 state=down collection=testOverseerQuit
   [junit4]   2> 17570 T100 oasc.ZkController.publish publishing core=testOverseerQuit_shard4_replica2 state=down collection=testOverseerQuit
   [junit4]   2> 17565 T139 oasc.ZkController.publish publishing core=testOverseerQuit_shard4_replica1 state=down collection=testOverseerQuit
   [junit4]   2> 17565 T85 oasc.ZkController.publish publishing core=testOverseerQuit_shard1_replica2 state=down collection=testOverseerQuit
   [junit4]   2> 17565 T125 oasc.ZkController.publish publishing core=testOverseerQuit_shard2_replica2 state=down collection=testOverseerQuit
   [junit4]   2> 17572 T98 oasc.ZkController.publish publishing core=testOverseerQuit_shard1_replica1 state=down collection=testOverseerQuit
   [junit4]   2> 17571 T67 oasc.ZkController.publish publishing core=testOverseerQuit_shard3_replica1 state=down collection=testOverseerQuit
   [junit4]   2> 17652 T72 oasc.DistributedQueue$LatchChildWatcher.process LatchChildWatcher fired on path: /overseer/queue state: SyncConnected type NodeChildrenChanged
   [junit4]   2> 17652 T114 oasc.ZkController.waitForCoreNodeName look for our core node name
   [junit4]   2> 17655 T100 oasc.ZkController.waitForCoreNodeName look for our core node name
   [junit4]   2> 17656 T125 oasc.ZkController.waitForCoreNodeName look for our core node name
   [junit4]   2> 17655 T155 oasc.ZkController.publish publishing core=testOverseerQuit_shard3_replica2 state=down collection=testOverseerQuit
   [junit4]   2> 17656 T85 oasc.ZkController.waitForCoreNodeName look for our core node name
   [junit4]   2> 17655 T139 oasc.ZkController.waitForCoreNodeName look for our core node name
   [junit4]   2> 17658 T73 oascc.ZkStateReader.updateClusterState Updating cloud state from ZooKeeper... 
   [junit4]   2> 17659 T155 oasc.ZkController.waitForCoreNodeName look for our core node name
   [junit4]   2> 17656 T67 oasc.ZkController.waitForCoreNodeName look for our core node name
   [junit4]   2> 17656 T98 oasc.ZkController.waitForCoreNodeName look for our core node name
   [junit4]   2> 17659 T72 oasc.DistributedQueue$LatchChildWatcher.process LatchChildWatcher fired on path: /overseer/queue state: SyncConnected type NodeChildrenChanged
   [junit4]   2> 17661 T73 oasc.Overseer$ClusterStateUpdater.updateState Update state numShards=4 message={
   [junit4]   2> 	  "operation":"state",
   [junit4]   2> 	  "state":"down",
   [junit4]   2> 	  "base_url":"http://127.0.0.1:32833/eyr/e",
   [junit4]   2> 	  "core":"testOverseerQuit_shard2_replica1",
   [junit4]   2> 	  "roles":null,
   [junit4]   2> 	  "node_name":"127.0.0.1:32833_eyr%2Fe",
   [junit4]   2> 	  "shard":"shard2",
   [junit4]   2> 	  "collection":"testOverseerQuit",
   [junit4]   2> 	  "numShards":"4",
   [junit4]   2> 	  "core_node_name":null}
   [junit4]   2> 17678 T73 oasc.Overseer$ClusterStateUpdater.updateState Update state numShards=4 message={
   [junit4]   2> 	  "operation":"state",
   [junit4]   2> 	  "state":"down",
   [junit4]   2> 	  "base_url":"http://127.0.0.1:48234/eyr/e",
   [junit4]   2> 	  "core":"testOverseerQuit_shard4_replica2",
   [junit4]   2> 	  "roles":null,
   [junit4]   2> 	  "node_name":"127.0.0.1:48234_eyr%2Fe",
   [junit4]   2> 	  "shard":"shard4",
   [junit4]   2> 	  "collection":"testOverseerQuit",
   [junit4]   2> 	  "numShards":"4",
   [junit4]   2> 	  "core_node_name":null}
   [junit4]   2> 17684 T72 oasc.DistributedQueue$LatchChildWatcher.process LatchChildWatcher fired on path: /overseer/queue state: SyncConnected type NodeChildrenChanged
   [junit4]   2> 17687 T73 oasc.Overseer$ClusterStateUpdater.updateState Update state numShards=4 message={
   [junit4]   2> 	  "operation":"state",
   [junit4]   2> 	  "state":"down",
   [junit4]   2> 	  "base_url":"http://127.0.0.1:39985/eyr/e",
   [junit4]   2> 	  "core":"testOverseerQuit_shard4_replica1",
   [junit4]   2> 	  "roles":null,
   [junit4]   2> 	  "node_name":"127.0.0.1:39985_eyr%2Fe",
   [junit4]   2> 	  "shard":"shard4",
   [junit4]   2> 	  "collection":"testOverseerQuit",
   [junit4]   2> 	  "numShards":"4",
   [junit4]   2> 	  "core_node_name":null}
   [junit4]   2> 17692 T72 oasc.DistributedQueue$LatchChildWatcher.process LatchChildWatcher fired on path: /overseer/queue state: SyncConnected type NodeChildrenChanged
   [junit4]   2> 17694 T73 oasc.Overseer$ClusterStateUpdater.updateState Update state numShards=4 message={
   [junit4]   2> 	  "operation":"state",
   [junit4]   2> 	  "state":"down",
   [junit4]   2> 	  "base_url":"http://127.0.0.1:44704/eyr/e",
   [junit4]   2> 	  "core":"testOverseerQuit_shard1_replica2",
   [junit4]   2> 	  "roles":null,
   [junit4]   2> 	  "node_name":"127.0.0.1:44704_eyr%2Fe",
   [junit4]   2> 	  "shard":"shard1",
   [junit4]   2> 	  "collection":"testOverseerQuit",
   [junit4]   2> 	  "numShards":"4",
   [junit4]   2> 	  "core_node_name":null}
   [junit4]   2> 17701 T72 oasc.DistributedQueue$LatchChildWatcher.process LatchChildWatcher fired on path: /overseer/queue state: SyncConnected type NodeChildrenChanged
   [junit4]   2> 17704 T73 oasc.Overseer$ClusterStateUpdater.updateState Update state numShards=4 message={
   [junit4]   2> 	  "operation":"state",
   [junit4]   2> 	  "state":"down",
   [junit4]   2> 	  "base_url":"http://127.0.0.1:35599/eyr/e",
   [junit4]   2> 	  "core":"testOverseerQuit_shard2_replica2",
   [junit4]   2> 	  "roles":null,
   [junit4]   2> 	  "node_name":"127.0.0.1:35599_eyr%2Fe",
   [junit4]   2> 	  "shard":"shard2",
   [junit4]   2> 	  "collection":"testOverseerQuit",
   [junit4]   2> 	  "numShards":"4",
   [junit4]   2> 	  "core_node_name":null}
   [junit4]   2> 17710 T72 oasc.DistributedQueue$LatchChildWatcher.process LatchChildWatcher fired on path: /overseer/queue state: SyncConnected type NodeChildrenChanged
   [junit4]   2> 17712 T73 oasc.Overseer$ClusterStateUpdater.updateState Update state numShards=4 message={
   [junit4]   2> 	  "operation":"state",
   [junit4]   2> 	  "state":"down",
   [junit4]   2> 	  "base_url":"http://127.0.0.1:48234/eyr/e",
   [junit4]   2> 	  "core":"testOverseerQuit_shard1_replica1",
   [junit4]   2> 	  "roles":null,
   [junit4]   2> 	  "node_name":"127.0.0.1:48234_eyr%2Fe",
   [junit4]   2> 	  "shard":"shard1",
   [junit4]   2> 	  "collection":"testOverseerQuit",
   [junit4]   2> 	  "numShards":"4",
   [junit4]   2> 	  "core_node_name":null}
   [junit4]   2> 17726 T72 oasc.DistributedQueue$LatchChildWatcher.process LatchChildWatcher fired on path: /overseer/queue state: SyncConnected type NodeChildrenChanged
   [junit4]   2> 17727 T73 oasc.Overseer$ClusterStateUpdater.updateState Update state numShards=4 message={
   [junit4]   2> 	  "operation":"state",
   [junit4]   2> 	  "state":"down",
   [junit4]   2> 	  "base_url":"http://127.0.0.1:50269/eyr/e",
   [junit4]   2> 	  "core":"testOverseerQuit_shard3_replica1",
   [junit4]   2> 	  "roles":null,
   [junit4]   2> 	  "node_name":"127.0.0.1:50269_eyr%2Fe",
   [junit4]   2> 	  "shard":"shard3",
   [junit4]   2> 	  "collection":"testOverseerQuit",
   [junit4]   2> 	  "numShards":"4",
   [junit4]   2> 	  "core_node_name":null}
   [junit4]   2> 17730 T72 oasc.DistributedQueue$LatchChildWatcher.process LatchChildWatcher fired on path: /overseer/queue state: SyncConnected type NodeChildrenChanged
   [junit4]   2> 17732 T73 oasc.Overseer$ClusterStateUpdater.updateState Update state numShards=4 message={
   [junit4]   2> 	  "operation":"state",
   [junit4]   2> 	  "state":"down",
   [junit4]   2> 	  "base_url":"http://127.0.0.1:55506/eyr/e",
   [junit4]   2> 	  "core":"testOverseerQuit_shard3_replica2",
   [junit4]   2> 	  "roles":null,
   [junit4]   2> 	  "node_name":"127.0.0.1:55506_eyr%2Fe",
   [junit4]   2> 	  "shard":"shard3",
   [junit4]   2> 	  "collection":"testOverseerQuit",
   [junit4]   2> 	  "numShards":"4",
   [junit4]   2> 	  "core_node_name":null}
   [junit4]   2> 17734 T72 oasc.DistributedQueue$LatchChildWatcher.process LatchChildWatcher fired on path: /overseer/queue state: SyncConnected type NodeChildrenChanged
   [junit4]   2> 17843 T146 oascc.ZkStateReader$2.process A cluster state change: WatchedEvent state:SyncConnected type:NodeDataChanged path:/clusterstate.json, has occurred - updating... (live nodes size: 7)
   [junit4]   2> 17843 T72 oascc.ZkStateReader$2.process A cluster state change: WatchedEvent state:SyncConnected type:NodeDataChanged path:/clusterstate.json, has occurred - updating... (live nodes size: 7)
   [junit4]   2> 17843 T104 oascc.ZkStateReader$2.process A cluster state change: WatchedEvent state:SyncConnected type:NodeDataChanged path:/clusterstate.json, has occurred - updating... (live nodes size: 7)
   [junit4]   2> 17843 T90 oascc.ZkStateReader$2.process A cluster state change: WatchedEvent state:SyncConnected type:NodeDataChanged path:/clusterstate.json, has occurred - updating... (live nodes size: 7)
   [junit4]   2> 17843 T160 oascc.ZkStateReader$2.process A cluster state change: WatchedEvent state:SyncConnected type:NodeDataChanged path:/clusterstate.json, has occurred - updating... (live nodes size: 7)
   [junit4]   2> 17843 T77 oascc.ZkStateReader$2.process A cluster state change: WatchedEvent state:SyncConnected type:NodeDataChanged path:/clusterstate.json, has occurred - updating... (live nodes size: 7)
   [junit4]   2> 17844 T132 oascc.ZkStateReader$2.process A cluster state change: WatchedEvent state:SyncConnected type:NodeDataChanged path:/clusterstate.json, has occurred - updating... (live nodes size: 7)
   [junit4]   2> 17844 T118 oascc.ZkStateReader$2.process A cluster state change: WatchedEvent state:SyncConnected type:NodeDataChanged path:/clusterstate.json, has occurred - updating... (live nodes size: 7)
   [junit4]   2> 17844 T165 oascc.ZkStateReader$2.process A cluster state change: WatchedEvent state:SyncConnected type:NodeDataChanged path:/clusterstate.json, has occurred - updating... (live nodes size: 7)
   [junit4]   2> 17843 T163 oascc.ZkStateReader$2.process A cluster state change: WatchedEvent state:SyncConnected type:NodeDataChanged path:/clusterstate.json, has occurred - updating... (live nodes size: 7)
   [junit4]   2> 18654 T114 oasc.ZkController.waitForShardId waiting to find shard id in clusterstate for testOverseerQuit_shard2_replica1
   [junit4]   2> 18656 T100 oasc.ZkController.waitForShardId waiting to find shard id in clusterstate for testOverseerQuit_shard4_replica2
   [junit4]   2> 18656 T125 oasc.ZkController.waitForShardId waiting to find shard id in clusterstate for testOverseerQuit_shard2_replica2
   [junit4]   2> 18667 T85 oasc.ZkController.waitForShardId waiting to find shard id in clusterstate for testOverseerQuit_shard1_replica2
   [junit4]   2> 18667 T139 oasc.ZkController.waitForShardId waiting to find shard id in clusterstate for testOverseerQuit_shard4_replica1
   [junit4]   2> 18667 T155 oasc.ZkController.waitForShardId waiting to find shard id in clusterstate for testOverseerQuit_shard3_replica2
   [junit4]   2> 18697 T139 oasc.ZkController.createCollectionZkNode Check for collection zkNode:testOverseerQuit
   [junit4]   2> 18667 T98 oasc.ZkController.waitForShardId waiting to find shard id in clusterstate for testOverseerQuit_shard1_replica1
   [junit4]   2> 18698 T139 oasc.ZkController.createCollectionZkNode Collection zkNode exists
   [junit4]   2> 18667 T67 oasc.ZkController.waitForShardId waiting to find shard id in clusterstate for testOverseerQuit_shard3_replica1
   [junit4]   2> 18699 T139 oascc.ZkStateReader.readConfigName Load collection config from:/collections/testOverseerQuit
   [junit4]   2> 18699 T98 oasc.ZkController.createCollectionZkNode Check for collection zkNode:testOverseerQuit
   [junit4]   2> 18697 T155 oasc.ZkController.createCollectionZkNode Check for collection zkNode:testOverseerQuit
   [junit4]   2> 18701 T98 oasc.ZkController.createCollectionZkNode Collection zkNode exists
   [junit4]   2> 18701 T98 oascc.ZkStateReader.readConfigName Load collection config from:/collections/testOverseerQuit
   [junit4]   2> 18696 T100 oasc.ZkController.createCollectionZkNode Check for collection zkNode:testOverseerQuit
   [junit4]   2> 18681 T125 oasc.ZkController.createCollectionZkNode Check for collection zkNode:testOverseerQuit
   [junit4]   2> 18703 T125 oasc.ZkController.createCollectionZkNode Collection zkNode exists
   [junit4]   2> 18704 T125 oascc.ZkStateReader.readConfigName Load collection config from:/collections/testOverseerQuit
   [junit4]   2> 18681 T114 oasc.ZkController.createCollectionZkNode Check for collection zkNode:testOverseerQuit
   [junit4]   2> 18705 T100 oasc.ZkController.createCollectionZkNode Collection zkNode exists
   [junit4]   2> 18705 T98 oascc.ZkStateReader.readConfigName path=/collections/testOverseerQuit configName=conf1 specified config exists in ZooKeeper
   [junit4]   2> 18702 T139 oascc.ZkStateReader.readConfigName path=/collections/testOverseerQuit configName=conf1 specified config exists in ZooKeeper
   [junit4]   2> 18701 T155 oasc.ZkController.createCollectionZkNode Collection zkNode exists
   [junit4]   2> 18701 T85 oasc.ZkController.createCollectionZkNode Check for collection zkNode:testOverseerQuit
   [junit4]   2> 18700 T67 oasc.ZkController.createCollectionZkNode Check for collection zkNode:testOverseerQuit
   [junit4]   2> 18706 T98 oasc.SolrResourceLoader.<init> new SolrResourceLoader for directory: '../../../../../../../../../../mnt/ssd/jenkins/workspace/Lucene-Solr-trunk-Linux/solr/build/solr-core/test/J1/./solr.cloud.OverseerRolesTest-DAEA0732652EAE59-001/tempDir-004/testOverseerQuit_shard1_replica1/'
   [junit4]   2> 18706 T139 oasc.SolrResourceLoader.<init> new SolrResourceLoader for directory: '../../../../../../../../../../mnt/ssd/jenkins/workspace/Lucene-Solr-trunk-Linux/solr/build/solr-core/test/J1/./solr.cloud.OverseerRolesTest-DAEA0732652EAE59-001/tempDir-007/testOverseerQuit_shard4_replica1/'
   [junit4]   2> 18707 T155 oascc.ZkStateReader.readConfigName Load collection config from:/collections/testOverseerQuit
   [junit4]   2> 18715 T85 oasc.ZkController.createCollectionZkNode Collection zkNode exists
   [junit4]   2> 18715 T85 oascc.ZkStateReader.readConfigName Load collection config from:/collections/testOverseerQuit
   [junit4]   2> 18717 T85 oascc.ZkStateReader.readConfigName path=/collections/testOverseerQuit configName=conf1 specified config exists in ZooKeeper
   [junit4]   2> 18717 T85 oasc.SolrResourceLoader.<init> new SolrResourceLoader for directory: './solr.cloud.OverseerRolesTest-DAEA0732652EAE59-001/tempDir-003/testOverseerQuit_shard1_replica2/'
   [junit4]   2> 18705 T100 oascc.ZkStateReader.readConfigName Load collection config from:/collections/testOverseerQuit
   [junit4]   2> 18705 T114 oasc.ZkController.createCollectionZkNode Collection zkNode exists
   [junit4]   2> 18705 T125 oascc.ZkStateReader.readConfigName path=/collections/testOverseerQuit configName=conf1 specified config exists in ZooKeeper
   [junit4]   2> 18750 T100 oascc.ZkStateReader.readConfigName path=/collections/testOverseerQuit configName=conf1 specified config exists in ZooKeeper
   [junit4]   2> 18737 T114 oascc.ZkStateReader.readConfigName Load collection config from:/collections/testOverseerQuit
   [junit4]   2> 18717 T155 oascc.ZkStateReader.readConfigName path=/collections/testOverseerQuit configName=conf1 specified config exists in ZooKeeper
   [junit4]   2> 18714 T67 oasc.ZkController.createCollectionZkNode Collection zkNode exists
   [junit4]   2> 18762 T67 oascc.ZkStateReader.readConfigName Load collection config from:/collections/testOverseerQuit
   [junit4]   2> 18761 T155 oasc.SolrResourceLoader.<init> new SolrResourceLoader for directory: './solr.cloud.OverseerRolesTest-DAEA0732652EAE59-001/tempDir-008/testOverseerQuit_shard3_replica2/'
   [junit4]   2> 18760 T100 oasc.SolrResourceLoader.<init> new SolrResourceLoader for directory: '../../../../../../../../../../mnt/ssd/jenkins/workspace/Lucene-Solr-trunk-Linux/solr/build/solr-core/test/J1/./solr.cloud.OverseerRolesTest-DAEA0732652EAE59-001/tempDir-004/testOverseerQuit_shard4_replica2/'
   [junit4]   2> 18760 T125 oasc.SolrResourceLoader.<init> new SolrResourceLoader for directory: './solr.cloud.OverseerRolesTest-DAEA0732652EAE59-001/tempDir-006/testOverseerQuit_shard2_replica2/'
   [junit4]   2> 18765 T114 oascc.ZkStateReader.readConfigName path=/collections/testOverseerQuit configName=conf1 specified config exists in ZooKeeper
   [junit4]   2> 18771 T114 oasc.SolrResourceLoader.<init> new SolrResourceLoader for directory: './solr.cloud.OverseerRolesTest-DAEA0732652EAE59-001/tempDir-005/testOverseerQuit_shard2_replica1/'
   [junit4]   2> 18779 T67 oascc.ZkStateReader.readConfigName path=/collections/testOverseerQuit configName=conf1 specified config exists in ZooKeeper
   [junit4]   2> 18779 T67 oasc.SolrResourceLoader.<init> new SolrResourceLoader for directory: '../../../../../../../../../../mnt/ssd/jenkins/workspace/Lucene-Solr-trunk-Linux/solr/build/solr-core/test/J1/./solr.cloud.OverseerRolesTest-DAEA0732652EAE59-001/tempDir-002/testOverseerQuit_shard3_replica1/'
   [junit4]   2> 19821 T114 oasc.SolrConfig.<init> Using Lucene MatchVersion: LUCENE_5_0
   [junit4]   2> 19850 T67 oasc.SolrConfig.<init> Using Lucene MatchVersion: LUCENE_5_0
   [junit4]   2> 19976 T98 oasc.SolrConfig.<init> Using Lucene MatchVersion: LUCENE_5_0
   [junit4]   2> 20117 T85 oasc.SolrConfig.<init> Using Lucene MatchVersion: LUCENE_5_0
   [junit4]   2> 20258 T139 oasc.SolrConfig.<init> Using Lucene MatchVersion: LUCENE_5_0
   [junit4]   2> 20345 T100 oasc.SolrConfig.<init> Using Lucene MatchVersion: LUCENE_5_0
   [junit4]   2> 20372 T125 oasc.SolrConfig.<init> Using Lucene MatchVersion: LUCENE_5_0
   [junit4]   2> 20375 T155 oasc.SolrConfig.<init> Using Lucene MatchVersion: LUCENE_5_0
   [junit4]   2> 21088 T98 oasc.SolrConfig.<init> Loaded SolrConfig: solrconfig.xml
   [junit4]   2> 21092 T67 oasc.SolrConfig.<init> Loaded SolrConfig: solrconfig.xml
   [junit4]   2> 21239 T100 oasc.SolrConfig.<init> Loaded SolrConfig: solrconfig.xml
   [junit4]   2> 21276 T155 oasc.SolrConfig.<init> Loaded SolrConfig: solrconfig.xml
   [junit4]   2> 21290 T139 oasc.SolrConfig.<init> Loaded SolrConfig: solrconfig.xml
   [junit4]   2> 21292 T85 oasc.SolrConfig.<init> Loaded SolrConfig: solrconfig.xml
   [junit4]   2> 21280 T67 oass.IndexSchema.readSchema Reading Solr Schema from schema.xml
   [junit4]   2> 21280 T125 oasc.SolrConfig.<init> Loaded SolrConfig: solrconfig.xml
   [junit4]   2> 21280 T98 oass.IndexSchema.readSchema Reading Solr Schema from schema.xml
   [junit4]   2> 21306 T85 oass.IndexSchema.readSchema Reading Solr Schema from schema.xml
   [junit4]   2> 21314 T139 oass.IndexSchema.readSchema Reading Solr Schema from schema.xml
   [junit4]   2> 21304 T155 oass.IndexSchema.readSchema Reading Solr Schema from schema.xml
   [junit4]   2> 21326 T125 oass.IndexSchema.readSchema Reading Solr Schema from schema.xml
   [junit4]   2> 21342 T114 oasc.SolrConfig.<init> Loaded SolrConfig: solrconfig.xml
   [junit4]   2> 21381 T100 oass.IndexSchema.readSchema Reading Solr Schema from schema.xml
   [junit4]   2> 21383 T114 oass.IndexSchema.readSchema Reading Solr Schema from schema.xml
   [junit4]   2> 21621 T139 oass.IndexSchema.readSchema [testOverseerQuit_shard4_replica1] Schema name=test
   [junit4]   2> 21655 T100 oass.IndexSchema.readSchema [testOverseerQuit_shard4_replica2] Schema name=test
   [junit4]   2> 21711 T85 oass.IndexSchema.readSchema [testOverseerQuit_shard1_replica2] Schema name=test
   [junit4]   2> 21732 T98 oass.IndexSchema.readSchema [testOverseerQuit_shard1_replica1] Schema name=test
   [junit4]   2> 21731 T125 oass.IndexSchema.readSchema [testOverseerQuit_shard2_replica2] Schema name=test
   [junit4]   2> 21760 T155 oass.IndexSchema.readSchema [testOverseerQuit_shard3_replica2] Schema name=test
   [junit4]   2> 21844 T114 oass.IndexSchema.readSchema [testOverseerQuit_shard2_replica1] Schema name=test
   [junit4]   2> 21900 T67 oass.IndexSchema.readSchema [testOverseerQuit_shard3_replica1] Schema name=test
   [junit4]   2> 31801 T85 oass.OpenExchangeRatesOrgProvider.init Initialized with rates=open-exchange-rates.json, refreshInterval=1440.
   [junit4]   2> 31802 T114 oass.OpenExchangeRatesOrgProvider.init Initialized with rates=open-exchange-rates.json, refreshInterval=1440.
   [junit4]   2> 31805 T139 oass.OpenExchangeRatesOrgProvider.init Initialized with rates=open-exchange-rates.json, refreshInterval=1440.
   [junit4]   2> 31811 T125 oass.OpenExchangeRatesOrgProvider.init Initialized with rates=open-exchange-rates.json, refreshInterval=1440.
   [junit4]   2> 31811 T155 oass.OpenExchangeRatesOrgProvider.init Initialized with rates=open-exchange-rates.json, refreshInterval=1440.
   [junit4]   2> 31821 T67 oass.OpenExchangeRatesOrgProvider.init Initialized with rates=open-exchange-rates.json, refreshInterval=1440.
   [junit4]   2> 31811 T98 oass.OpenExchangeRatesOrgProvider.init Initialized with rates=open-exchange-rates.json, refreshInterval=1440.
   [junit4]   2> 31817 T100 oass.OpenExchangeRatesOrgProvider.init Initialized with rates=open-exchange-rates.json, refreshInterval=1440.
   [junit4]   2> 31892 T114 oass.IndexSchema.readSchema default search field in schema is text
   [junit4]   2> 31892 T155 oass.IndexSchema.readSchema default search field in schema is text
   [junit4]   2> 31907 T85 oass.IndexSchema.readSchema default search field in schema is text
   [junit4]   2> 31912 T139 oass.IndexSchema.readSchema default search field in schema is text
   [junit4]   2> 31911 T114 oass.IndexSchema.readSchema unique key field: id
   [junit4]   2> 31924 T155 oass.IndexSchema.readSchema unique key field: id
   [junit4]   2> 31924 T98 oass.IndexSchema.readSchema default search field in schema is text
   [junit4]   2> 31921 T100 oass.IndexSchema.readSchema default search field in schema is text
   [junit4]   2> 31932 T125 oass.IndexSchema.readSchema default search field in schema is text
   [junit4]   2> 31938 T98 oass.IndexSchema.readSchema unique key field: id
   [junit4]   2> 31938 T85 oass.IndexSchema.readSchema unique key field: id
   [junit4]   2> 31958 T125 oass.IndexSchema.readSchema unique key field: id
   [junit4]   2> 31952 T100 oass.IndexSchema.readSchema unique key field: id
   [junit4]   2> 31952 T67 oass.IndexSchema.readSchema default search field in schema is text
   [junit4]   2> 31952 T139 oass.IndexSchema.readSchema unique key field: id
   [junit4]   2> 31976 T67 oass.IndexSchema.readSchema unique key field: id
   [junit4]   2> 32137 T98 oass.FileExchangeRateProvider.reload Reloading exchange rates from file currency.xml
   [junit4]   2> 32165 T125 oass.FileExchangeRateProvider.reload Reloading exchange rates from file currency.xml
   [junit4]   2> 32166 T139 oass.FileExchangeRateProvider.reload Reloading exchange rates from file currency.xml
   [junit4]   2> 32168 T114 oass.FileExchangeRateProvider.reload Reloading exchange rates from file currency.xml
   [junit4]   2> 32184 T155 oass.FileExchangeRateProvider.reload Reloading exchange rates from file currency.xml
   [junit4]   2> 32185 T67 oass.FileExchangeRateProvider.reload Reloading exchange rates from file currency.xml
   [junit4]   2> 32199 T139 oass.FileExchangeRateProvider.reload Reloading exchange rates from file currency.xml
   [junit4]   2> 32219 T67 oass.FileExchangeRateProvider.reload Reloading exchange rates from file currency.xml
   [junit4]   2> 32219 T85 oass.FileExchangeRateProvider.reload Reloading exchange rates from file currency.xml
   [junit4]   2> 32206 T114 oass.FileExchangeRateProvider.reload Reloading exchange rates from file currency.xml
   [junit4]   2> 32200 T98 oass.FileExchangeRateProvider.reload Reloading exchange rates from file currency.xml
   [junit4]   2> 32232 T155 oass.FileExchangeRateProvider.reload Reloading exchange rates from file currency.xml
   [junit4]   2> 32239 T125 oass.FileExchangeRateProvider.reload Reloading exchange rates from file currency.xml
   [junit4]   2> 32248 T139 oass.OpenExchangeRatesOrgProvider.reload Reloading exchange rates from open-exchange-rates.json
   [junit4]   2> 32258 T85 oass.FileExchangeRateProvider.reload Reloading exchange rates from file currency.xml
   [junit4]   2> 32258 T139 oass.OpenExchangeRatesOrgProvider$OpenExchangeRates.<init> WARN Unknown key IMPORTANT NOTE
   [junit4]   2> 32275 T67 oass.OpenExchangeRatesOrgProvider.reload Reloading exchange rates from open-exchange-rates.json
   [junit4]   2> 32275 T100 oass.FileExchangeRateProvider.reload Reloading exchange rates from file currency.xml
   [junit4]   2> 32278 T139 oass.OpenExchangeRatesOrgProvider$OpenExchangeRates.<init> WARN Expected key, got STRING
   [junit4]   2> 32280 T139 oass.OpenExchangeRatesOrgProvider.reload Reloading exchange rates from open-exchange-rates.json
   [junit4]   2> 32281 T67 oass.OpenExchangeRatesOrgProvider$OpenExchangeRates.<init> WARN Unknown key IMPORTANT NOTE
   [junit4]   2> 32292 T67 oass.OpenExchangeRatesOrgProvider$OpenExchangeRates.<init> WARN Expected key, got STRING
   [junit4]   2> 32293 T67 oass.OpenExchangeRatesOrgProvider.reload Reloading exchange rates from open-exchange-rates.json
   [junit4]   2> 32292 T125 oass.OpenExchangeRatesOrgProvider.reload Reloading exchange rates from open-exchange-rates.json
   [junit4]   2> 32292 T85 oass.OpenExchangeRatesOrgProvider.reload Reloading exchange rates from open-exchange-rates.json
   [junit4]   2> 32289 T155 oass.OpenExchangeRatesOrgProvider.reload Reloading exchange rates from open-exchange-rates.json
   [junit4]   2> 32281 T139 oass.OpenExchangeRatesOrgProvider$OpenExchangeRates.<init> WARN Unknown key IMPORTANT NOTE
   [junit4]   2> 32301 T139 oass.OpenExchangeRatesOrgProvider$OpenExchangeRates.<init> WARN Expected key, got STRING
   [junit4]   2> 32311 T85 oass.OpenExchangeRatesOrgProvider$OpenExchangeRates.<init> WARN Unknown key IMPORTANT NOTE
   [junit4]   2> 32315 T85 oass.OpenExchangeRatesOrgProvider$OpenExchangeRates.<init> WARN Expected key, got STRING
   [junit4]   2> 32315 T85 oass.OpenExchangeRatesOrgProvider.reload Reloading exchange rates from open-exchange-rates.json
   [junit4]   2> 32301 T67 oass.OpenExchangeRatesOrgProvider$OpenExchangeRates.<init> WARN Unknown key IMPORTANT NOTE
   [junit4]   2> 32317 T67 oass.OpenExchangeRatesOrgProvider$OpenExchangeRates.<init> WARN Expected key, got STRING
   [junit4]   2> 32299 T114 oass.OpenExchangeRatesOrgProvider.reload Reloading exchange rates from open-exchange-rates.json
   [junit4]   2> 32317 T67 oasc.CoreContainer.create Creating SolrCore 'testOverseerQuit_shard3_replica1' using configuration from collection testOverseerQuit
   [junit4]   2> 32317 T85 oass.OpenExchangeRatesOrgProvider$OpenExchangeRates.<init> WARN Unknown key IMPORTANT NOTE
   [junit4]   2> 32318 T85 oass.OpenExchangeRatesOrgProvider$OpenExchangeRates.<init> WARN Expected key, got STRING
   [junit4]   2> 32316 T139 oasc.CoreContainer.create Creating SolrCore 'testOverseerQuit_shard4_replica1' using configuration from collection testOverseerQuit
   [junit4]   2> 32315 T155 oass.OpenExchangeRatesOrgProvider$OpenExchangeRates.<init> WARN Unknown key IMPORTANT NOTE
   [junit4]   2> 32321 T155 oass.OpenExchangeRatesOrgProvider$OpenExchangeRates.<init> WARN Expected key, got STRING
   [junit4]   2> 32314 T125 oass.OpenExchangeRatesOrgProvider$OpenExchangeRates.<init> WARN Unknown key IMPORTANT NOTE
   [junit4]   2> 32322 T125 oass.OpenExchangeRatesOrgProvider$OpenExchangeRates.<init> WARN Expected key, got STRING
   [junit4]   2> 32322 T155 oass.OpenExchangeRatesOrgProvider.reload Reloading exchange rates from open-exchange-rates.json
   [junit4]   2> 32311 T100 oass.FileExchangeRateProvider.reload Reloading exchange rates from file currency.xml
   [junit4]   2> 32311 T98 oass.OpenExchangeRatesOrgProvider.reload Reloading exchange rates from open-exchange-rates.json
   [junit4]   2> 32323 T125 oass.OpenExchangeRatesOrgProvider.reload Reloading exchange rates from open-exchange-rates.json
   [junit4]   2> 32320 T139 oasc.SolrCore.initDirectoryFactory org.apache.solr.core.MockDirectoryFactory
   [junit4]   2> 32320 T85 oasc.CoreContainer.create Creating SolrCore 'testOverseerQuit_shard1_replica2' using configuration from collection testOverseerQuit
   [junit4]   2> 32345 T85 oasc.SolrCore.initDirectoryFactory org.apache.solr.core.MockDirectoryFactory
   [junit4]   2> 32320 T67 oasc.SolrCore.initDirectoryFactory org.apache.solr.core.MockDirectoryFactory
   [junit4]   2> 32320 T114 oass.OpenExchangeRatesOrgProvider$OpenExchangeRates.<init> WARN Unknown key IMPORTANT NOTE
   [junit4]   2> 32347 T100 oass.OpenExchangeRatesOrgProvider.reload Reloading exchange rates from open-exchange-rates.json
   [junit4]   2> 32347 T125 oass.OpenExchangeRatesOrgProvider$OpenExchangeRates.<init> WARN Unknown key IMPORTANT NOTE
   [junit4]   2> 32348 T125 oass.OpenExchangeRatesOrgProvider$OpenExchangeRates.<init> WARN Expected key, got STRING
   [junit4]   2> 32327 T155 oass.OpenExchangeRatesOrgProvider$OpenExchangeRates.<init> WARN Unknown key IMPORTANT NOTE
   [junit4]   2> 32327 T98 oass.OpenExchangeRatesOrgProvider$OpenExchangeRates.<init> WARN Unknown key IMPORTANT NOTE
   [junit4]   2> 32352 T100 oass.OpenExchangeRatesOrgProvider$OpenExchangeRates.<init> WARN Unknown key IMPORTANT NOTE
   [junit4]   2> 32353 T100 oass.OpenExchangeRatesOrgProvider$OpenExchangeRates.<init> WARN Expected key, got STRING
   [junit4]   2> 32354 T100 oass.OpenExchangeRatesOrgProvider.reload Reloading exchange rates from open-exchange-rates.json
   [junit4]   2> 32352 T155 oass.OpenExchangeRatesOrgProvider$OpenExchangeRates.<init> WARN Expected key, got STRING
   [junit4]   2> 32352 T125 oasc.CoreContainer.create Creating SolrCore 'testOverseerQuit_shard2_replica2' using configuration from collection testOverseerQuit
   [junit4]   2> 32348 T114 oass.OpenExchangeRatesOrgProvider$OpenExchangeRates.<init> WARN Expected key, got STRING
   [junit4]   2> 32355 T125 oasc.SolrCore.initDirectoryFactory org.apache.solr.core.MockDirectoryFactory
   [junit4]   2> 32355 T155 oasc.CoreContainer.create Creating SolrCore 'testOverseerQuit_shard3_replica2' using configuration from collection testOverseerQuit
   [junit4]   2> 32357 T155 oasc.SolrCore.initDirectoryFactory org.apache.solr.core.MockDire

[...truncated too long message...]

5)
   [junit4]   2> 		at org.apache.solr.common.cloud.SolrZkClient$3.execute(SolrZkClient.java:209)
   [junit4]   2> 		at org.apache.solr.common.cloud.SolrZkClient$3.execute(SolrZkClient.java:206)
   [junit4]   2> 		at org.apache.solr.common.cloud.ZkCmdExecutor.retryOperation(ZkCmdExecutor.java:73)
   [junit4]   2> 		at org.apache.solr.common.cloud.SolrZkClient.exists(SolrZkClient.java:206)
   [junit4]   2> 		at org.apache.solr.common.cloud.SolrZkClient.makePath(SolrZkClient.java:417)
   [junit4]   2> 		at org.apache.solr.common.cloud.SolrZkClient.makePath(SolrZkClient.java:386)
   [junit4]   2> 		at org.apache.solr.common.cloud.SolrZkClient.makePath(SolrZkClient.java:373)
   [junit4]   2> 		at org.apache.solr.cloud.ShardLeaderElectionContextBase$1.execute(ElectionContext.java:127)
   [junit4]   2> 		at org.apache.solr.common.util.RetryUtil.retryOnThrowable(RetryUtil.java:31)
   [junit4]   2> 		at org.apache.solr.cloud.ShardLeaderElectionContextBase.runLeaderProcess(ElectionContext.java:122)
   [junit4]   2> 		... 7 more
   [junit4]   2> 	
   [junit4]   2> 71640 T160 oascc.ZkStateReader$2.process A cluster state change: WatchedEvent state:SyncConnected type:NodeDataChanged path:/clusterstate.json, has occurred - updating... (live nodes size: 5)
   [junit4]   2> 71641 T104 oascc.ZkStateReader$3.process WARN ZooKeeper watch triggered, but Solr cannot talk to ZK
   [junit4]   2> 71641 T160 oascc.ZkStateReader$2.process WARN ZooKeeper watch triggered, but Solr cannot talk to ZK
   [junit4]   2> ASYNC  NEW_CORE C103 name=testOverseerCol_shard1_replica1 org.apache.solr.core.SolrCore@2be6eff4 url=http://127.0.0.1:39985/eyr/e/testOverseerCol_shard1_replica1 node=127.0.0.1:39985_eyr%2Fe C103_STATE=coll:testOverseerCol core:testOverseerCol_shard1_replica1 props:{state=active, base_url=http://127.0.0.1:39985/eyr/e, core=testOverseerCol_shard1_replica1, node_name=127.0.0.1:39985_eyr%2Fe}
   [junit4]   2> 71871 T146 C103 P39985 oasc.SyncStrategy.sync WARN Closed, skipping sync up.
   [junit4]   2> 71872 T146 oasc.ShardLeaderElectionContext.runLeaderProcess We failed sync, but we have no versions - we can't sync in that case - we were active before, so become leader anyway
   [junit4]   2> 71872 T146 oasc.ShardLeaderElectionContext.runLeaderProcess I am the new leader: http://127.0.0.1:39985/eyr/e/testOverseerCol_shard1_replica1/ shard1
   [junit4]   2> 71872 T146 oasc.SolrCore.close [testOverseerCol_shard1_replica1]  CLOSING SolrCore org.apache.solr.core.SolrCore@2be6eff4
   [junit4]   2> 71893 T146 oasu.DirectUpdateHandler2.close closing DirectUpdateHandler2{commits=0,autocommits=0,soft autocommits=0,optimizes=0,rollbacks=0,expungeDeletes=0,docsPending=0,adds=0,deletesById=0,deletesByQuery=0,errors=0,cumulative_adds=0,cumulative_deletesById=0,cumulative_deletesByQuery=0,cumulative_errors=0,transaction_logs_total_size=0,transaction_logs_total_number=0}
   [junit4]   2> 71894 T146 oasu.SolrCoreState.decrefSolrCoreState Closing SolrCoreState
   [junit4]   2> 71894 T146 oasu.DefaultSolrCoreState.closeIndexWriter SolrCoreState ref count has reached 0 - closing IndexWriter
   [junit4]   2> 71894 T146 oasu.DefaultSolrCoreState.closeIndexWriter closing IndexWriter with IndexWriterCloser
   [junit4]   2> 71895 T146 oasc.SolrCore.closeSearcher [testOverseerCol_shard1_replica1] Closing main searcher on request.
   [junit4]   2> 71895 T146 oasc.CachingDirectoryFactory.close Closing MockDirectoryFactory - 2 directories currently being tracked
   [junit4]   2> 71896 T146 oasc.CachingDirectoryFactory.closeCacheValue looking to close ../../../../../../../../../../mnt/ssd/jenkins/workspace/Lucene-Solr-trunk-Linux/solr/build/solr-core/test/J1/./solr.cloud.OverseerRolesTest-DAEA0732652EAE59-001/tempDir-007/testOverseerCol_shard1_replica1/data [CachedDir<<refCount=0;path=../../../../../../../../../../mnt/ssd/jenkins/workspace/Lucene-Solr-trunk-Linux/solr/build/solr-core/test/J1/./solr.cloud.OverseerRolesTest-DAEA0732652EAE59-001/tempDir-007/testOverseerCol_shard1_replica1/data;done=false>>]
   [junit4]   2> 71899 T146 oasc.CachingDirectoryFactory.close Closing directory: ../../../../../../../../../../mnt/ssd/jenkins/workspace/Lucene-Solr-trunk-Linux/solr/build/solr-core/test/J1/./solr.cloud.OverseerRolesTest-DAEA0732652EAE59-001/tempDir-007/testOverseerCol_shard1_replica1/data
   [junit4]   2> 71899 T146 oasc.CachingDirectoryFactory.closeCacheValue looking to close ../../../../../../../../../../mnt/ssd/jenkins/workspace/Lucene-Solr-trunk-Linux/solr/build/solr-core/test/J1/./solr.cloud.OverseerRolesTest-DAEA0732652EAE59-001/tempDir-007/testOverseerCol_shard1_replica1/data/index [CachedDir<<refCount=0;path=../../../../../../../../../../mnt/ssd/jenkins/workspace/Lucene-Solr-trunk-Linux/solr/build/solr-core/test/J1/./solr.cloud.OverseerRolesTest-DAEA0732652EAE59-001/tempDir-007/testOverseerCol_shard1_replica1/data/index;done=false>>]
   [junit4]   2> 71900 T146 oasc.CachingDirectoryFactory.close Closing directory: ../../../../../../../../../../mnt/ssd/jenkins/workspace/Lucene-Solr-trunk-Linux/solr/build/solr-core/test/J1/./solr.cloud.OverseerRolesTest-DAEA0732652EAE59-001/tempDir-007/testOverseerCol_shard1_replica1/data/index
   [junit4]   2> 71900 T146 oascc.SolrZkClient.makePath makePath: /collections/testOverseerCol/leaders/shard1
   [junit4]   2> 71901 T146 oasc.SolrException.log ERROR There was a problem trying to register as the leader:org.apache.solr.common.SolrException: Could not register as the leader because creating the ephemeral registration node in ZooKeeper failed
   [junit4]   2> 		at org.apache.solr.cloud.ShardLeaderElectionContextBase.runLeaderProcess(ElectionContext.java:135)
   [junit4]   2> 		at org.apache.solr.cloud.ShardLeaderElectionContext.runLeaderProcess(ElectionContext.java:290)
   [junit4]   2> 		at org.apache.solr.cloud.LeaderElector.runIamLeaderProcess(LeaderElector.java:142)
   [junit4]   2> 		at org.apache.solr.cloud.LeaderElector.checkIfIamLeader(LeaderElector.java:110)
   [junit4]   2> 		at org.apache.solr.cloud.LeaderElector.access$200(LeaderElector.java:55)
   [junit4]   2> 		at org.apache.solr.cloud.LeaderElector$ElectionWatcher.process(LeaderElector.java:303)
   [junit4]   2> 		at org.apache.zookeeper.ClientCnxn$EventThread.processEvent(ClientCnxn.java:522)
   [junit4]   2> 		at org.apache.zookeeper.ClientCnxn$EventThread.run(ClientCnxn.java:498)
   [junit4]   2> 	Caused by: org.apache.zookeeper.KeeperException$SessionExpiredException: KeeperErrorCode = Session expired for /collections
   [junit4]   2> 		at org.apache.zookeeper.KeeperException.create(KeeperException.java:127)
   [junit4]   2> 		at org.apache.zookeeper.KeeperException.create(KeeperException.java:51)
   [junit4]   2> 		at org.apache.zookeeper.ZooKeeper.exists(ZooKeeper.java:1045)
   [junit4]   2> 		at org.apache.solr.common.cloud.SolrZkClient$3.execute(SolrZkClient.java:209)
   [junit4]   2> 		at org.apache.solr.common.cloud.SolrZkClient$3.execute(SolrZkClient.java:206)
   [junit4]   2> 		at org.apache.solr.common.cloud.ZkCmdExecutor.retryOperation(ZkCmdExecutor.java:73)
   [junit4]   2> 		at org.apache.solr.common.cloud.SolrZkClient.exists(SolrZkClient.java:206)
   [junit4]   2> 		at org.apache.solr.common.cloud.SolrZkClient.makePath(SolrZkClient.java:417)
   [junit4]   2> 		at org.apache.solr.common.cloud.SolrZkClient.makePath(SolrZkClient.java:386)
   [junit4]   2> 		at org.apache.solr.common.cloud.SolrZkClient.makePath(SolrZkClient.java:373)
   [junit4]   2> 		at org.apache.solr.cloud.ShardLeaderElectionContextBase$1.execute(ElectionContext.java:127)
   [junit4]   2> 		at org.apache.solr.common.util.RetryUtil.retryOnThrowable(RetryUtil.java:31)
   [junit4]   2> 		at org.apache.solr.cloud.ShardLeaderElectionContextBase.runLeaderProcess(ElectionContext.java:122)
   [junit4]   2> 		... 7 more
   [junit4]   2> 	
   [junit4]   2> 71901 T146 oascc.ZkStateReader$3.process WARN ZooKeeper watch triggered, but Solr cannot talk to ZK
   [junit4]   2> NOTE: leaving temporary files on disk at: /mnt/ssd/jenkins/workspace/Lucene-Solr-trunk-Linux/solr/build/solr-core/test/J1/./solr.cloud.OverseerRolesTest-DAEA0732652EAE59-001
   [junit4]   2> NOTE: test params are: codec=Lucene46: {}, docValues:{}, sim=RandomSimilarityProvider(queryNorm=true,coord=crazy): {}, locale=ar_AE, timezone=Etc/GMT-10
   [junit4]   2> NOTE: Linux 3.8.0-39-generic amd64/Oracle Corporation 1.8.0_20-ea (64-bit)/cpus=8,threads=1,free=160249208,total=247787520
   [junit4]   2> NOTE: All tests run in this JVM: [TestStressLucene, OverseerRolesTest]
   [junit4] Completed on J1 in 70.39s, 1 test, 1 failure <<< FAILURES!

[...truncated 1189 lines...]
BUILD FAILED
/mnt/ssd/jenkins/workspace/Lucene-Solr-trunk-Linux/build.xml:467: The following error occurred while executing this line:
/mnt/ssd/jenkins/workspace/Lucene-Solr-trunk-Linux/build.xml:447: The following error occurred while executing this line:
/mnt/ssd/jenkins/workspace/Lucene-Solr-trunk-Linux/build.xml:45: The following error occurred while executing this line:
/mnt/ssd/jenkins/workspace/Lucene-Solr-trunk-Linux/extra-targets.xml:37: The following error occurred while executing this line:
/mnt/ssd/jenkins/workspace/Lucene-Solr-trunk-Linux/solr/build.xml:189: The following error occurred while executing this line:
/mnt/ssd/jenkins/workspace/Lucene-Solr-trunk-Linux/solr/common-build.xml:496: The following error occurred while executing this line:
/mnt/ssd/jenkins/workspace/Lucene-Solr-trunk-Linux/lucene/common-build.xml:1296: The following error occurred while executing this line:
/mnt/ssd/jenkins/workspace/Lucene-Solr-trunk-Linux/lucene/common-build.xml:920: There were test failures: 403 suites, 1681 tests, 1 failure, 37 ignored (16 assumptions)

Total time: 57 minutes 35 seconds
Build step 'Invoke Ant' marked build as failure
Description set: Java: 64bit/jdk1.8.0_20-ea-b11 -XX:-UseCompressedOops -XX:+UseConcMarkSweepGC
Archiving artifacts
Recording test results
Email was triggered for: Failure
Sending email for trigger: Failure



Mime
View raw message