lucene-dev mailing list archives

Site index · List index
Message view « Date » · « Thread »
Top « Date » · « Thread »
From Policeman Jenkins Server <jenk...@thetaphi.de>
Subject [JENKINS] Lucene-Solr-4.x-Linux (32bit/jdk1.7.0_55) - Build # 10163 - Failure!
Date Sun, 11 May 2014 04:04:41 GMT
Build: http://jenkins.thetaphi.de/job/Lucene-Solr-4.x-Linux/10163/
Java: 32bit/jdk1.7.0_55 -server -XX:+UseG1GC

3 tests failed.
FAILED:  junit.framework.TestSuite.org.apache.solr.handler.admin.CoreAdminRequestStatusTest

Error Message:
1 thread leaked from SUITE scope at org.apache.solr.handler.admin.CoreAdminRequestStatusTest:     1) Thread[id=3834, name=parallelCoreAdminExecutor-2006-thread-1, state=WAITING, group=TGRP-CoreAdminRequestStatusTest]         at sun.misc.Unsafe.park(Native Method)         at java.util.concurrent.locks.LockSupport.park(LockSupport.java:186)         at java.util.concurrent.locks.AbstractQueuedSynchronizer$ConditionObject.await(AbstractQueuedSynchronizer.java:2043)         at java.util.concurrent.LinkedBlockingQueue.take(LinkedBlockingQueue.java:442)         at java.util.concurrent.ThreadPoolExecutor.getTask(ThreadPoolExecutor.java:1068)         at java.util.concurrent.ThreadPoolExecutor.runWorker(ThreadPoolExecutor.java:1130)         at java.util.concurrent.ThreadPoolExecutor$Worker.run(ThreadPoolExecutor.java:615)         at java.lang.Thread.run(Thread.java:745)

Stack Trace:
com.carrotsearch.randomizedtesting.ThreadLeakError: 1 thread leaked from SUITE scope at org.apache.solr.handler.admin.CoreAdminRequestStatusTest: 
   1) Thread[id=3834, name=parallelCoreAdminExecutor-2006-thread-1, state=WAITING, group=TGRP-CoreAdminRequestStatusTest]
        at sun.misc.Unsafe.park(Native Method)
        at java.util.concurrent.locks.LockSupport.park(LockSupport.java:186)
        at java.util.concurrent.locks.AbstractQueuedSynchronizer$ConditionObject.await(AbstractQueuedSynchronizer.java:2043)
        at java.util.concurrent.LinkedBlockingQueue.take(LinkedBlockingQueue.java:442)
        at java.util.concurrent.ThreadPoolExecutor.getTask(ThreadPoolExecutor.java:1068)
        at java.util.concurrent.ThreadPoolExecutor.runWorker(ThreadPoolExecutor.java:1130)
        at java.util.concurrent.ThreadPoolExecutor$Worker.run(ThreadPoolExecutor.java:615)
        at java.lang.Thread.run(Thread.java:745)
	at __randomizedtesting.SeedInfo.seed([249C2328AC207A86]:0)


FAILED:  junit.framework.TestSuite.org.apache.solr.handler.admin.CoreAdminRequestStatusTest

Error Message:
There are still zombie threads that couldn't be terminated:    1) Thread[id=3834, name=parallelCoreAdminExecutor-2006-thread-1, state=WAITING, group=TGRP-CoreAdminRequestStatusTest]         at sun.misc.Unsafe.park(Native Method)         at java.util.concurrent.locks.LockSupport.park(LockSupport.java:186)         at java.util.concurrent.locks.AbstractQueuedSynchronizer$ConditionObject.await(AbstractQueuedSynchronizer.java:2043)         at java.util.concurrent.LinkedBlockingQueue.take(LinkedBlockingQueue.java:442)         at java.util.concurrent.ThreadPoolExecutor.getTask(ThreadPoolExecutor.java:1068)         at java.util.concurrent.ThreadPoolExecutor.runWorker(ThreadPoolExecutor.java:1130)         at java.util.concurrent.ThreadPoolExecutor$Worker.run(ThreadPoolExecutor.java:615)         at java.lang.Thread.run(Thread.java:745)

Stack Trace:
com.carrotsearch.randomizedtesting.ThreadLeakError: There are still zombie threads that couldn't be terminated:
   1) Thread[id=3834, name=parallelCoreAdminExecutor-2006-thread-1, state=WAITING, group=TGRP-CoreAdminRequestStatusTest]
        at sun.misc.Unsafe.park(Native Method)
        at java.util.concurrent.locks.LockSupport.park(LockSupport.java:186)
        at java.util.concurrent.locks.AbstractQueuedSynchronizer$ConditionObject.await(AbstractQueuedSynchronizer.java:2043)
        at java.util.concurrent.LinkedBlockingQueue.take(LinkedBlockingQueue.java:442)
        at java.util.concurrent.ThreadPoolExecutor.getTask(ThreadPoolExecutor.java:1068)
        at java.util.concurrent.ThreadPoolExecutor.runWorker(ThreadPoolExecutor.java:1130)
        at java.util.concurrent.ThreadPoolExecutor$Worker.run(ThreadPoolExecutor.java:615)
        at java.lang.Thread.run(Thread.java:745)
	at __randomizedtesting.SeedInfo.seed([249C2328AC207A86]:0)


REGRESSION:  org.apache.solr.handler.admin.CoreAdminRequestStatusTest.testCoreAdminRequestStatus

Error Message:
The status of request was expected to be completed expected:<[completed]> but was:<[running]>

Stack Trace:
org.junit.ComparisonFailure: The status of request was expected to be completed expected:<[completed]> but was:<[running]>
	at __randomizedtesting.SeedInfo.seed([249C2328AC207A86:2820D2C12B6CE3C]:0)
	at org.junit.Assert.assertEquals(Assert.java:125)
	at org.apache.solr.handler.admin.CoreAdminRequestStatusTest.testCoreAdminRequestStatus(CoreAdminRequestStatusTest.java:84)
	at sun.reflect.NativeMethodAccessorImpl.invoke0(Native Method)
	at sun.reflect.NativeMethodAccessorImpl.invoke(NativeMethodAccessorImpl.java:57)
	at sun.reflect.DelegatingMethodAccessorImpl.invoke(DelegatingMethodAccessorImpl.java:43)
	at java.lang.reflect.Method.invoke(Method.java:606)
	at com.carrotsearch.randomizedtesting.RandomizedRunner.invoke(RandomizedRunner.java:1618)
	at com.carrotsearch.randomizedtesting.RandomizedRunner$6.evaluate(RandomizedRunner.java:827)
	at com.carrotsearch.randomizedtesting.RandomizedRunner$7.evaluate(RandomizedRunner.java:863)
	at com.carrotsearch.randomizedtesting.RandomizedRunner$8.evaluate(RandomizedRunner.java:877)
	at com.carrotsearch.randomizedtesting.rules.SystemPropertiesRestoreRule$1.evaluate(SystemPropertiesRestoreRule.java:53)
	at org.apache.lucene.util.TestRuleSetupTeardownChained$1.evaluate(TestRuleSetupTeardownChained.java:50)
	at org.apache.lucene.util.TestRuleFieldCacheSanity$1.evaluate(TestRuleFieldCacheSanity.java:51)
	at org.apache.lucene.util.AbstractBeforeAfterRule$1.evaluate(AbstractBeforeAfterRule.java:46)
	at com.carrotsearch.randomizedtesting.rules.SystemPropertiesInvariantRule$1.evaluate(SystemPropertiesInvariantRule.java:55)
	at org.apache.lucene.util.TestRuleThreadAndTestName$1.evaluate(TestRuleThreadAndTestName.java:49)
	at org.apache.lucene.util.TestRuleIgnoreAfterMaxFailures$1.evaluate(TestRuleIgnoreAfterMaxFailures.java:65)
	at org.apache.lucene.util.TestRuleMarkFailure$1.evaluate(TestRuleMarkFailure.java:48)
	at com.carrotsearch.randomizedtesting.rules.StatementAdapter.evaluate(StatementAdapter.java:36)
	at com.carrotsearch.randomizedtesting.ThreadLeakControl$StatementRunner.run(ThreadLeakControl.java:360)
	at com.carrotsearch.randomizedtesting.ThreadLeakControl.forkTimeoutingTask(ThreadLeakControl.java:793)
	at com.carrotsearch.randomizedtesting.ThreadLeakControl$3.evaluate(ThreadLeakControl.java:453)
	at com.carrotsearch.randomizedtesting.RandomizedRunner.runSingleTest(RandomizedRunner.java:836)
	at com.carrotsearch.randomizedtesting.RandomizedRunner$3.evaluate(RandomizedRunner.java:738)
	at com.carrotsearch.randomizedtesting.RandomizedRunner$4.evaluate(RandomizedRunner.java:772)
	at com.carrotsearch.randomizedtesting.RandomizedRunner$5.evaluate(RandomizedRunner.java:783)
	at com.carrotsearch.randomizedtesting.rules.StatementAdapter.evaluate(StatementAdapter.java:36)
	at com.carrotsearch.randomizedtesting.rules.SystemPropertiesRestoreRule$1.evaluate(SystemPropertiesRestoreRule.java:53)
	at org.apache.lucene.util.AbstractBeforeAfterRule$1.evaluate(AbstractBeforeAfterRule.java:46)
	at org.apache.lucene.util.TestRuleStoreClassName$1.evaluate(TestRuleStoreClassName.java:42)
	at com.carrotsearch.randomizedtesting.rules.SystemPropertiesInvariantRule$1.evaluate(SystemPropertiesInvariantRule.java:55)
	at com.carrotsearch.randomizedtesting.rules.NoShadowingOrOverridesOnMethodsRule$1.evaluate(NoShadowingOrOverridesOnMethodsRule.java:39)
	at com.carrotsearch.randomizedtesting.rules.NoShadowingOrOverridesOnMethodsRule$1.evaluate(NoShadowingOrOverridesOnMethodsRule.java:39)
	at com.carrotsearch.randomizedtesting.rules.StatementAdapter.evaluate(StatementAdapter.java:36)
	at com.carrotsearch.randomizedtesting.rules.StatementAdapter.evaluate(StatementAdapter.java:36)
	at com.carrotsearch.randomizedtesting.rules.StatementAdapter.evaluate(StatementAdapter.java:36)
	at org.apache.lucene.util.TestRuleAssertionsRequired$1.evaluate(TestRuleAssertionsRequired.java:43)
	at org.apache.lucene.util.TestRuleMarkFailure$1.evaluate(TestRuleMarkFailure.java:48)
	at org.apache.lucene.util.TestRuleIgnoreAfterMaxFailures$1.evaluate(TestRuleIgnoreAfterMaxFailures.java:65)
	at org.apache.lucene.util.TestRuleIgnoreTestSuites$1.evaluate(TestRuleIgnoreTestSuites.java:55)
	at com.carrotsearch.randomizedtesting.rules.StatementAdapter.evaluate(StatementAdapter.java:36)
	at com.carrotsearch.randomizedtesting.ThreadLeakControl$StatementRunner.run(ThreadLeakControl.java:360)
	at java.lang.Thread.run(Thread.java:745)




Build Log:
[...truncated 11291 lines...]
   [junit4] Suite: org.apache.solr.handler.admin.CoreAdminRequestStatusTest
   [junit4]   2> Creating dataDir: /mnt/ssd/jenkins/workspace/Lucene-Solr-4.x-Linux/solr/build/solr-core/test/J0/./solr.handler.admin.CoreAdminRequestStatusTest-249C2328AC207A86-001/init-core-data-001
   [junit4]   2> 691532 T3830 oas.SolrTestCaseJ4.buildSSLConfig Randomized ssl (false) and clientAuth (true)
   [junit4]   2> 691533 T3830 oas.SolrTestCaseJ4.initCore ####initCore
   [junit4]   2> 691533 T3830 oasc.SolrResourceLoader.<init> new SolrResourceLoader for directory: '/mnt/ssd/jenkins/workspace/Lucene-Solr-4.x-Linux/solr/core/src/test-files/solr/collection1/'
   [junit4]   2> 691534 T3830 oasc.SolrResourceLoader.replaceClassLoader Adding 'file:/mnt/ssd/jenkins/workspace/Lucene-Solr-4.x-Linux/solr/core/src/test-files/solr/collection1/lib/.svn/' to classloader
   [junit4]   2> 691534 T3830 oasc.SolrResourceLoader.replaceClassLoader Adding 'file:/mnt/ssd/jenkins/workspace/Lucene-Solr-4.x-Linux/solr/core/src/test-files/solr/collection1/lib/classes/' to classloader
   [junit4]   2> 691534 T3830 oasc.SolrResourceLoader.replaceClassLoader Adding 'file:/mnt/ssd/jenkins/workspace/Lucene-Solr-4.x-Linux/solr/core/src/test-files/solr/collection1/lib/README' to classloader
   [junit4]   2> 691581 T3830 oasc.SolrConfig.<init> Using Lucene MatchVersion: LUCENE_4_9
   [junit4]   2> 691632 T3830 oasc.SolrConfig.<init> Loaded SolrConfig: solrconfig.xml
   [junit4]   2> 691632 T3830 oass.IndexSchema.readSchema Reading Solr Schema from schema.xml
   [junit4]   2> 691640 T3830 oass.IndexSchema.readSchema [null] Schema name=test
   [junit4]   2> 691986 T3830 oass.ByteField.init WARN ByteField is deprecated and will be removed in 5.0. You should use TrieIntField instead.
   [junit4]   2> 691986 T3830 oass.ShortField.init WARN ShortField is deprecated and will be removed in 5.0. You should use TrieIntField instead.
   [junit4]   2> 691987 T3830 oass.OpenExchangeRatesOrgProvider.init Initialized with rates=open-exchange-rates.json, refreshInterval=1440.
   [junit4]   2> 691992 T3830 oass.IndexSchema.readSchema default search field in schema is text
   [junit4]   2> 691994 T3830 oass.IndexSchema.readSchema unique key field: id
   [junit4]   2> 691999 T3830 oass.FileExchangeRateProvider.reload Reloading exchange rates from file currency.xml
   [junit4]   2> 692002 T3830 oass.FileExchangeRateProvider.reload Reloading exchange rates from file currency.xml
   [junit4]   2> 692004 T3830 oass.OpenExchangeRatesOrgProvider.reload Reloading exchange rates from open-exchange-rates.json
   [junit4]   2> 692004 T3830 oass.OpenExchangeRatesOrgProvider$OpenExchangeRates.<init> WARN Unknown key IMPORTANT NOTE
   [junit4]   2> 692004 T3830 oass.OpenExchangeRatesOrgProvider$OpenExchangeRates.<init> WARN Expected key, got STRING
   [junit4]   2> 692005 T3830 oass.OpenExchangeRatesOrgProvider.reload Reloading exchange rates from open-exchange-rates.json
   [junit4]   2> 692005 T3830 oass.OpenExchangeRatesOrgProvider$OpenExchangeRates.<init> WARN Unknown key IMPORTANT NOTE
   [junit4]   2> 692005 T3830 oass.OpenExchangeRatesOrgProvider$OpenExchangeRates.<init> WARN Expected key, got STRING
   [junit4]   2> 692005 T3830 oasc.SolrResourceLoader.locateSolrHome JNDI not configured for solr (NoInitialContextEx)
   [junit4]   2> 692006 T3830 oasc.SolrResourceLoader.locateSolrHome using system property solr.solr.home: /mnt/ssd/jenkins/workspace/Lucene-Solr-4.x-Linux/solr/core/src/test-files/solr
   [junit4]   2> 692006 T3830 oasc.SolrResourceLoader.<init> new SolrResourceLoader for directory: '/mnt/ssd/jenkins/workspace/Lucene-Solr-4.x-Linux/solr/core/src/test-files/solr/'
   [junit4]   2> 692047 T3830 oasc.CoreContainer.<init> New CoreContainer 20177708
   [junit4]   2> 692047 T3830 oasc.CoreContainer.load Loading cores into CoreContainer [instanceDir=/mnt/ssd/jenkins/workspace/Lucene-Solr-4.x-Linux/solr/core/src/test-files/solr/]
   [junit4]   2> 692048 T3830 oashc.HttpShardHandlerFactory.getParameter Setting socketTimeout to: 0
   [junit4]   2> 692049 T3830 oashc.HttpShardHandlerFactory.getParameter Setting urlScheme to: null
   [junit4]   2> 692049 T3830 oashc.HttpShardHandlerFactory.getParameter Setting connTimeout to: 0
   [junit4]   2> 692049 T3830 oashc.HttpShardHandlerFactory.getParameter Setting maxConnectionsPerHost to: 20
   [junit4]   2> 692049 T3830 oashc.HttpShardHandlerFactory.getParameter Setting corePoolSize to: 0
   [junit4]   2> 692049 T3830 oashc.HttpShardHandlerFactory.getParameter Setting maximumPoolSize to: 2147483647
   [junit4]   2> 692050 T3830 oashc.HttpShardHandlerFactory.getParameter Setting maxThreadIdleTime to: 5
   [junit4]   2> 692050 T3830 oashc.HttpShardHandlerFactory.getParameter Setting sizeOfQueue to: -1
   [junit4]   2> 692050 T3830 oashc.HttpShardHandlerFactory.getParameter Setting fairnessPolicy to: false
   [junit4]   2> 692051 T3830 oasl.LogWatcher.createWatcher SLF4J impl is org.slf4j.impl.Log4jLoggerFactory
   [junit4]   2> 692051 T3830 oasl.LogWatcher.newRegisteredLogWatcher Registering Log Listener [Log4j (org.slf4j.impl.Log4jLoggerFactory)]
   [junit4]   2> 692051 T3830 oasc.CoreContainer.load Host Name: 
   [junit4]   2> 692054 T3831 oasc.SolrResourceLoader.<init> new SolrResourceLoader for directory: '/mnt/ssd/jenkins/workspace/Lucene-Solr-4.x-Linux/solr/core/src/test-files/solr/collection1/'
   [junit4]   2> 692055 T3831 oasc.SolrResourceLoader.replaceClassLoader Adding 'file:/mnt/ssd/jenkins/workspace/Lucene-Solr-4.x-Linux/solr/core/src/test-files/solr/collection1/lib/.svn/' to classloader
   [junit4]   2> 692055 T3831 oasc.SolrResourceLoader.replaceClassLoader Adding 'file:/mnt/ssd/jenkins/workspace/Lucene-Solr-4.x-Linux/solr/core/src/test-files/solr/collection1/lib/classes/' to classloader
   [junit4]   2> 692055 T3831 oasc.SolrResourceLoader.replaceClassLoader Adding 'file:/mnt/ssd/jenkins/workspace/Lucene-Solr-4.x-Linux/solr/core/src/test-files/solr/collection1/lib/README' to classloader
   [junit4]   2> 692110 T3831 oasc.SolrConfig.<init> Using Lucene MatchVersion: LUCENE_4_9
   [junit4]   2> 692162 T3831 oasc.SolrConfig.<init> Loaded SolrConfig: solrconfig.xml
   [junit4]   2> 692163 T3831 oass.IndexSchema.readSchema Reading Solr Schema from schema.xml
   [junit4]   2> 692170 T3831 oass.IndexSchema.readSchema [collection1] Schema name=test
   [junit4]   2> 692528 T3831 oass.ByteField.init WARN ByteField is deprecated and will be removed in 5.0. You should use TrieIntField instead.
   [junit4]   2> 692528 T3831 oass.ShortField.init WARN ShortField is deprecated and will be removed in 5.0. You should use TrieIntField instead.
   [junit4]   2> 692529 T3831 oass.OpenExchangeRatesOrgProvider.init Initialized with rates=open-exchange-rates.json, refreshInterval=1440.
   [junit4]   2> 692536 T3831 oass.IndexSchema.readSchema default search field in schema is text
   [junit4]   2> 692538 T3831 oass.IndexSchema.readSchema unique key field: id
   [junit4]   2> 692543 T3831 oass.FileExchangeRateProvider.reload Reloading exchange rates from file currency.xml
   [junit4]   2> 692546 T3831 oass.FileExchangeRateProvider.reload Reloading exchange rates from file currency.xml
   [junit4]   2> 692548 T3831 oass.OpenExchangeRatesOrgProvider.reload Reloading exchange rates from open-exchange-rates.json
   [junit4]   2> 692548 T3831 oass.OpenExchangeRatesOrgProvider$OpenExchangeRates.<init> WARN Unknown key IMPORTANT NOTE
   [junit4]   2> 692548 T3831 oass.OpenExchangeRatesOrgProvider$OpenExchangeRates.<init> WARN Expected key, got STRING
   [junit4]   2> 692548 T3831 oass.OpenExchangeRatesOrgProvider.reload Reloading exchange rates from open-exchange-rates.json
   [junit4]   2> 692549 T3831 oass.OpenExchangeRatesOrgProvider$OpenExchangeRates.<init> WARN Unknown key IMPORTANT NOTE
   [junit4]   2> 692549 T3831 oass.OpenExchangeRatesOrgProvider$OpenExchangeRates.<init> WARN Expected key, got STRING
   [junit4]   2> 692549 T3831 oasc.CoreContainer.create Creating SolrCore 'collection1' using configuration from instancedir /mnt/ssd/jenkins/workspace/Lucene-Solr-4.x-Linux/solr/core/src/test-files/solr/collection1/
   [junit4]   2> 692549 T3831 oasc.SolrCore.initDirectoryFactory org.apache.solr.core.MockDirectoryFactory
   [junit4]   2> 692550 T3831 oasc.SolrCore.<init> [collection1] Opening new SolrCore at /mnt/ssd/jenkins/workspace/Lucene-Solr-4.x-Linux/solr/core/src/test-files/solr/collection1/, dataDir=/mnt/ssd/jenkins/workspace/Lucene-Solr-4.x-Linux/solr/build/solr-core/test/J0/./solr.handler.admin.CoreAdminRequestStatusTest-249C2328AC207A86-001/init-core-data-001/
   [junit4]   2> 692550 T3831 oasc.JmxMonitoredMap.<init> JMX monitoring is enabled. Adding Solr mbeans to JMX Server: com.sun.jmx.mbeanserver.JmxMBeanServer@13f7d84
   [junit4]   2> 692550 T3831 oasc.CachingDirectoryFactory.get return new directory for /mnt/ssd/jenkins/workspace/Lucene-Solr-4.x-Linux/solr/build/solr-core/test/J0/./solr.handler.admin.CoreAdminRequestStatusTest-249C2328AC207A86-001/init-core-data-001
   [junit4]   2> 692551 T3831 oasc.SolrCore.getNewIndexDir New index directory detected: old=null new=/mnt/ssd/jenkins/workspace/Lucene-Solr-4.x-Linux/solr/build/solr-core/test/J0/./solr.handler.admin.CoreAdminRequestStatusTest-249C2328AC207A86-001/init-core-data-001/index/
   [junit4]   2> 692551 T3831 oasc.SolrCore.initIndex WARN [collection1] Solr index directory '/mnt/ssd/jenkins/workspace/Lucene-Solr-4.x-Linux/solr/build/solr-core/test/J0/./solr.handler.admin.CoreAdminRequestStatusTest-249C2328AC207A86-001/init-core-data-001/index' doesn't exist. Creating new index...
   [junit4]   2> 692551 T3831 oasc.CachingDirectoryFactory.get return new directory for /mnt/ssd/jenkins/workspace/Lucene-Solr-4.x-Linux/solr/build/solr-core/test/J0/./solr.handler.admin.CoreAdminRequestStatusTest-249C2328AC207A86-001/init-core-data-001/index
   [junit4]   2> 692551 T3831 oasu.RandomMergePolicy.<init> RandomMergePolicy wrapping class org.apache.lucene.index.TieredMergePolicy: [TieredMergePolicy: maxMergeAtOnce=22, maxMergeAtOnceExplicit=48, maxMergedSegmentMB=85.2705078125, floorSegmentMB=0.66796875, forceMergeDeletesPctAllowed=21.27959796670652, segmentsPerTier=50.0, maxCFSSegmentSizeMB=8.796093022207999E12, noCFSRatio=1.0
   [junit4]   2> 692552 T3831 oasc.SolrDeletionPolicy.onCommit SolrDeletionPolicy.onCommit: commits: num=1
   [junit4]   2> 		commit{dir=RateLimitedDirectoryWrapper(MockDirectoryWrapper(RAMDirectory@78e94a lockFactory=org.apache.lucene.store.SingleInstanceLockFactory@15b8952)),segFN=segments_1,generation=1}
   [junit4]   2> 692552 T3831 oasc.SolrDeletionPolicy.updateCommits newest commit generation = 1
   [junit4]   2> 692552 T3831 oasc.SolrCore.initWriters created xml: solr.XMLResponseWriter
   [junit4]   2> 692555 T3831 oasup.UpdateRequestProcessorChain.init creating updateRequestProcessorChain "dedupe"
   [junit4]   2> 692556 T3831 oasup.UpdateRequestProcessorChain.init inserting DistributedUpdateProcessorFactory into updateRequestProcessorChain "dedupe"
   [junit4]   2> 692556 T3831 oasup.UpdateRequestProcessorChain.init creating updateRequestProcessorChain "dedupe-allfields"
   [junit4]   2> 692556 T3831 oasup.UpdateRequestProcessorChain.init inserting DistributedUpdateProcessorFactory into updateRequestProcessorChain "dedupe-allfields"
   [junit4]   2> 692556 T3831 oasup.UpdateRequestProcessorChain.init creating updateRequestProcessorChain "stored_sig"
   [junit4]   2> 692556 T3831 oasup.UpdateRequestProcessorChain.init inserting DistributedUpdateProcessorFactory into updateRequestProcessorChain "stored_sig"
   [junit4]   2> 692557 T3831 oasup.UpdateRequestProcessorChain.init creating updateRequestProcessorChain "uniq-fields"
   [junit4]   2> 692557 T3831 oasup.UniqFieldsUpdateProcessorFactory.init WARN Use of the 'fields' init param in UniqFieldsUpdateProcessorFactory is deprecated, please use 'fieldName' (or another FieldMutatingUpdateProcessorFactory selector option) instead
   [junit4]   2> 692557 T3831 oasup.UniqFieldsUpdateProcessorFactory.init Replacing 'fields' init param with (individual) 'fieldName' params
   [junit4]   2> 692557 T3831 oasup.UpdateRequestProcessorChain.init inserting DistributedUpdateProcessorFactory into updateRequestProcessorChain "uniq-fields"
   [junit4]   2> 692557 T3831 oasup.UpdateRequestProcessorChain.init creating updateRequestProcessorChain "distrib-dup-test-chain-explicit"
   [junit4]   2> 692558 T3831 oasup.UpdateRequestProcessorChain.init creating updateRequestProcessorChain "distrib-dup-test-chain-implicit"
   [junit4]   2> 692558 T3831 oasup.UpdateRequestProcessorChain.init inserting DistributedUpdateProcessorFactory into updateRequestProcessorChain "distrib-dup-test-chain-implicit"
   [junit4]   2> 692558 T3831 oasc.SolrCore.loadUpdateProcessorChains no updateRequestProcessorChain defined as default, creating implicit default
   [junit4]   2> 692558 T3831 oasc.RequestHandlers.initHandlersFromConfig adding lazy requestHandler: solr.ReplicationHandler
   [junit4]   2> 692559 T3831 oasc.RequestHandlers.initHandlersFromConfig created /replication: solr.ReplicationHandler
   [junit4]   2> 692559 T3831 oasc.RequestHandlers.initHandlersFromConfig created standard: solr.StandardRequestHandler
   [junit4]   2> 692559 T3831 oasc.RequestHandlers.initHandlersFromConfig created /get: solr.RealTimeGetHandler
   [junit4]   2> 692560 T3831 oasc.RequestHandlers.initHandlersFromConfig created dismax: solr.SearchHandler
   [junit4]   2> 692560 T3831 oasc.RequestHandlers.initHandlersFromConfig created mock: org.apache.solr.core.MockQuerySenderListenerReqHandler
   [junit4]   2> 692560 T3831 oasc.RequestHandlers.initHandlersFromConfig created /admin/: org.apache.solr.handler.admin.AdminHandlers
   [junit4]   2> 692561 T3831 oasc.RequestHandlers.initHandlersFromConfig created /admin/file: solr.admin.ShowFileRequestHandler
   [junit4]   2> 692561 T3831 oasc.RequestHandlers.initHandlersFromConfig created defaults: solr.StandardRequestHandler
   [junit4]   2> 692561 T3831 oasc.RequestHandlers.initHandlersFromConfig adding lazy requestHandler: solr.StandardRequestHandler
   [junit4]   2> 692561 T3831 oasc.RequestHandlers.initHandlersFromConfig created lazy: solr.StandardRequestHandler
   [junit4]   2> 692562 T3831 oasc.RequestHandlers.initHandlersFromConfig created /update: solr.UpdateRequestHandler
   [junit4]   2> 692562 T3831 oasc.RequestHandlers.initHandlersFromConfig created /terms: org.apache.solr.handler.component.SearchHandler
   [junit4]   2> 692562 T3831 oasc.RequestHandlers.initHandlersFromConfig created spellCheckCompRH: org.apache.solr.handler.component.SearchHandler
   [junit4]   2> 692563 T3831 oasc.RequestHandlers.initHandlersFromConfig created spellCheckCompRH_Direct: org.apache.solr.handler.component.SearchHandler
   [junit4]   2> 692563 T3831 oasc.RequestHandlers.initHandlersFromConfig created spellCheckWithWordbreak: org.apache.solr.handler.component.SearchHandler
   [junit4]   2> 692563 T3831 oasc.RequestHandlers.initHandlersFromConfig created spellCheckWithWordbreak_Direct: org.apache.solr.handler.component.SearchHandler
   [junit4]   2> 692564 T3831 oasc.RequestHandlers.initHandlersFromConfig created spellCheckCompRH1: org.apache.solr.handler.component.SearchHandler
   [junit4]   2> 692564 T3831 oasc.RequestHandlers.initHandlersFromConfig created mltrh: org.apache.solr.handler.component.SearchHandler
   [junit4]   2> 692564 T3831 oasc.RequestHandlers.initHandlersFromConfig created tvrh: org.apache.solr.handler.component.SearchHandler
   [junit4]   2> 692565 T3831 oasc.RequestHandlers.initHandlersFromConfig created /mlt: solr.MoreLikeThisHandler
   [junit4]   2> 692565 T3831 oasc.RequestHandlers.initHandlersFromConfig created /debug/dump: solr.DumpRequestHandler
   [junit4]   2> 692567 T3831 oashl.XMLLoader.init xsltCacheLifetimeSeconds=60
   [junit4]   2> 692569 T3831 oasc.SolrCore.initDeprecatedSupport WARN solrconfig.xml uses deprecated <admin/gettableFiles>, Please update your config to use the ShowFileRequestHandler.
   [junit4]   2> 692571 T3831 oasu.CommitTracker.<init> Hard AutoCommit: disabled
   [junit4]   2> 692571 T3831 oasu.CommitTracker.<init> Soft AutoCommit: disabled
   [junit4]   2> 692571 T3831 oasu.RandomMergePolicy.<init> RandomMergePolicy wrapping class org.apache.lucene.index.TieredMergePolicy: [TieredMergePolicy: maxMergeAtOnce=43, maxMergeAtOnceExplicit=20, maxMergedSegmentMB=38.064453125, floorSegmentMB=1.82421875, forceMergeDeletesPctAllowed=14.93242318055582, segmentsPerTier=42.0, maxCFSSegmentSizeMB=8.796093022207999E12, noCFSRatio=1.0
   [junit4]   2> 692572 T3831 oasc.SolrDeletionPolicy.onInit SolrDeletionPolicy.onInit: commits: num=1
   [junit4]   2> 		commit{dir=RateLimitedDirectoryWrapper(MockDirectoryWrapper(RAMDirectory@78e94a lockFactory=org.apache.lucene.store.SingleInstanceLockFactory@15b8952)),segFN=segments_1,generation=1}
   [junit4]   2> 692572 T3831 oasc.SolrDeletionPolicy.updateCommits newest commit generation = 1
   [junit4]   2> 692572 T3831 oass.SolrIndexSearcher.<init> Opening Searcher@1418c29[collection1] main
   [junit4]   2> 692573 T3831 oasr.RestManager.init Initializing RestManager with initArgs: {storageIO=org.apache.solr.rest.ManagedResourceStorage$InMemoryStorageIO}
   [junit4]   2> 692573 T3831 oasr.ManagedResourceStorage.load Reading _rest_managed.json using InMemoryStorage
   [junit4]   2> 692573 T3831 oasr.ManagedResource.reloadFromStorage WARN No stored data found for /rest/managed
   [junit4]   2> 692573 T3831 oasr.ManagedResource.notifyObserversDuringInit WARN No registered observers for /rest/managed
   [junit4]   2> 692573 T3831 oasr.RestManager.init Initializing 0 registered ManagedResources
   [junit4]   2> 692574 T3831 oashc.SpellCheckComponent.inform Initializing spell checkers
   [junit4]   2> 692981 T3831 oass.DirectSolrSpellChecker.init init: {name=direct,classname=DirectSolrSpellChecker,field=lowerfilt,minQueryLength=3}
   [junit4]   2> 693002 T3832 oasc.SolrCore.registerSearcher [collection1] Registered new searcher Searcher@1418c29[collection1] main{StandardDirectoryReader(segments_1:1:nrt)}
   [junit4]   2> 693006 T3831 oasc.CoreContainer.registerCore registering core: collection1
   [junit4]   2> 693007 T3830 oas.SolrTestCaseJ4.initCore ####initCore end
   [junit4]   2> 693010 T3830 oas.SolrTestCaseJ4.setUp ###Starting testCoreAdminRequestStatus
   [junit4]   2> 693200 T3830 oasha.CoreAdminHandler.handleRequestActionStatus Checking request status for : 42
   [junit4]   2> 693200 T3834 oasha.CoreAdminHandler.handleCreateAction core create command name=dummycore&async=42&action=CREATE&instanceDir=/mnt/ssd/jenkins/workspace/Lucene-Solr-4.x-Linux/solr/build/solr-core/test/J0/./solr.handler.admin.CoreAdminRequestStatusTest-249C2328AC207A86-001/tempDir-001/instProp
   [junit4]   2> 693201 T3834 oasc.SolrResourceLoader.<init> new SolrResourceLoader for directory: '/mnt/ssd/jenkins/workspace/Lucene-Solr-4.x-Linux/solr/build/solr-core/test/J0/./solr.handler.admin.CoreAdminRequestStatusTest-249C2328AC207A86-001/tempDir-001/instProp/'
   [junit4]   2> 693202 T3834 oasc.SolrResourceLoader.replaceClassLoader Adding 'file:/mnt/ssd/jenkins/workspace/Lucene-Solr-4.x-Linux/solr/build/solr-core/test/J0/solr.handler.admin.CoreAdminRequestStatusTest-249C2328AC207A86-001/tempDir-001/instProp/lib/.svn/' to classloader
   [junit4]   2> 693202 T3834 oasc.SolrResourceLoader.replaceClassLoader Adding 'file:/mnt/ssd/jenkins/workspace/Lucene-Solr-4.x-Linux/solr/build/solr-core/test/J0/solr.handler.admin.CoreAdminRequestStatusTest-249C2328AC207A86-001/tempDir-001/instProp/lib/classes/' to classloader
   [junit4]   2> 693203 T3834 oasc.SolrResourceLoader.replaceClassLoader Adding 'file:/mnt/ssd/jenkins/workspace/Lucene-Solr-4.x-Linux/solr/build/solr-core/test/J0/solr.handler.admin.CoreAdminRequestStatusTest-249C2328AC207A86-001/tempDir-001/instProp/lib/README' to classloader
   [junit4]   2> 693263 T3834 oasc.SolrConfig.<init> Using Lucene MatchVersion: LUCENE_4_9
   [junit4]   2> 693351 T3834 oasc.SolrConfig.<init> Loaded SolrConfig: solrconfig.xml
   [junit4]   2> 693352 T3834 oass.IndexSchema.readSchema Reading Solr Schema from schema.xml
   [junit4]   2> 693363 T3834 oass.IndexSchema.readSchema [dummycore] Schema name=test
   [junit4]   2> 693846 T3834 oass.ByteField.init WARN ByteField is deprecated and will be removed in 5.0. You should use TrieIntField instead.
   [junit4]   2> 693847 T3834 oass.ShortField.init WARN ShortField is deprecated and will be removed in 5.0. You should use TrieIntField instead.
   [junit4]   2> 693847 T3834 oass.OpenExchangeRatesOrgProvider.init Initialized with rates=open-exchange-rates.json, refreshInterval=1440.
   [junit4]   2> 693852 T3834 oass.IndexSchema.readSchema default search field in schema is text
   [junit4]   2> 693855 T3834 oass.IndexSchema.readSchema unique key field: id
   [junit4]   2> 693860 T3834 oass.FileExchangeRateProvider.reload Reloading exchange rates from file currency.xml
   [junit4]   2> 693863 T3834 oass.FileExchangeRateProvider.reload Reloading exchange rates from file currency.xml
   [junit4]   2> 693865 T3834 oass.OpenExchangeRatesOrgProvider.reload Reloading exchange rates from open-exchange-rates.json
   [junit4]   2> 693865 T3834 oass.OpenExchangeRatesOrgProvider$OpenExchangeRates.<init> WARN Unknown key IMPORTANT NOTE
   [junit4]   2> 693866 T3834 oass.OpenExchangeRatesOrgProvider$OpenExchangeRates.<init> WARN Expected key, got STRING
   [junit4]   2> 693866 T3834 oass.OpenExchangeRatesOrgProvider.reload Reloading exchange rates from open-exchange-rates.json
   [junit4]   2> 693866 T3834 oass.OpenExchangeRatesOrgProvider$OpenExchangeRates.<init> WARN Unknown key IMPORTANT NOTE
   [junit4]   2> 693866 T3834 oass.OpenExchangeRatesOrgProvider$OpenExchangeRates.<init> WARN Expected key, got STRING
   [junit4]   2> 693867 T3834 oasc.CoreContainer.create Creating SolrCore 'dummycore' using configuration from instancedir /mnt/ssd/jenkins/workspace/Lucene-Solr-4.x-Linux/solr/build/solr-core/test/J0/./solr.handler.admin.CoreAdminRequestStatusTest-249C2328AC207A86-001/tempDir-001/instProp/
   [junit4]   2> 693867 T3834 oasc.SolrCore.initDirectoryFactory org.apache.solr.core.MockDirectoryFactory
   [junit4]   2> 693867 T3834 oasc.SolrCore.<init> [dummycore] Opening new SolrCore at /mnt/ssd/jenkins/workspace/Lucene-Solr-4.x-Linux/solr/build/solr-core/test/J0/./solr.handler.admin.CoreAdminRequestStatusTest-249C2328AC207A86-001/tempDir-001/instProp/, dataDir=/mnt/ssd/jenkins/workspace/Lucene-Solr-4.x-Linux/solr/build/solr-core/test/J0/./solr.handler.admin.CoreAdminRequestStatusTest-249C2328AC207A86-001/tempDir-001/instProp/data/
   [junit4]   2> 693867 T3834 oasc.JmxMonitoredMap.<init> JMX monitoring is enabled. Adding Solr mbeans to JMX Server: com.sun.jmx.mbeanserver.JmxMBeanServer@13f7d84
   [junit4]   2> 693868 T3834 oasc.CachingDirectoryFactory.get return new directory for /mnt/ssd/jenkins/workspace/Lucene-Solr-4.x-Linux/solr/build/solr-core/test/J0/./solr.handler.admin.CoreAdminRequestStatusTest-249C2328AC207A86-001/tempDir-001/instProp/data
   [junit4]   2> 693868 T3834 oasc.SolrCore.getNewIndexDir New index directory detected: old=null new=/mnt/ssd/jenkins/workspace/Lucene-Solr-4.x-Linux/solr/build/solr-core/test/J0/./solr.handler.admin.CoreAdminRequestStatusTest-249C2328AC207A86-001/tempDir-001/instProp/data/index/
   [junit4]   2> 693868 T3834 oasc.SolrCore.initIndex WARN [dummycore] Solr index directory '/mnt/ssd/jenkins/workspace/Lucene-Solr-4.x-Linux/solr/build/solr-core/test/J0/./solr.handler.admin.CoreAdminRequestStatusTest-249C2328AC207A86-001/tempDir-001/instProp/data/index' doesn't exist. Creating new index...
   [junit4]   2> 693869 T3834 oasc.CachingDirectoryFactory.get return new directory for /mnt/ssd/jenkins/workspace/Lucene-Solr-4.x-Linux/solr/build/solr-core/test/J0/./solr.handler.admin.CoreAdminRequestStatusTest-249C2328AC207A86-001/tempDir-001/instProp/data/index
   [junit4]   2> 693869 T3834 oasu.RandomMergePolicy.<init> RandomMergePolicy wrapping class org.apache.lucene.index.TieredMergePolicy: [TieredMergePolicy: maxMergeAtOnce=22, maxMergeAtOnceExplicit=48, maxMergedSegmentMB=85.2705078125, floorSegmentMB=0.66796875, forceMergeDeletesPctAllowed=21.27959796670652, segmentsPerTier=50.0, maxCFSSegmentSizeMB=8.796093022207999E12, noCFSRatio=1.0
   [junit4]   2> 693869 T3834 oasc.SolrDeletionPolicy.onCommit SolrDeletionPolicy.onCommit: commits: num=1
   [junit4]   2> 		commit{dir=RateLimitedDirectoryWrapper(MockDirectoryWrapper(RAMDirectory@db943c lockFactory=org.apache.lucene.store.SingleInstanceLockFactory@1aa3259)),segFN=segments_1,generation=1}
   [junit4]   2> 693870 T3834 oasc.SolrDeletionPolicy.updateCommits newest commit generation = 1
   [junit4]   2> 693870 T3834 oasc.SolrCore.initWriters created xml: solr.XMLResponseWriter
   [junit4]   2> 693873 T3834 oasup.UpdateRequestProcessorChain.init creating updateRequestProcessorChain "dedupe"
   [junit4]   2> 693873 T3834 oasup.UpdateRequestProcessorChain.init inserting DistributedUpdateProcessorFactory into updateRequestProcessorChain "dedupe"
   [junit4]   2> 693873 T3834 oasup.UpdateRequestProcessorChain.init creating updateRequestProcessorChain "dedupe-allfields"
   [junit4]   2> 693873 T3834 oasup.UpdateRequestProcessorChain.init inserting DistributedUpdateProcessorFactory into updateRequestProcessorChain "dedupe-allfields"
   [junit4]   2> 693874 T3834 oasup.UpdateRequestProcessorChain.init creating updateRequestProcessorChain "stored_sig"
   [junit4]   2> 693874 T3834 oasup.UpdateRequestProcessorChain.init inserting DistributedUpdateProcessorFactory into updateRequestProcessorChain "stored_sig"
   [junit4]   2> 693874 T3834 oasup.UpdateRequestProcessorChain.init creating updateRequestProcessorChain "uniq-fields"
   [junit4]   2> 693874 T3834 oasup.UniqFieldsUpdateProcessorFactory.init WARN Use of the 'fields' init param in UniqFieldsUpdateProcessorFactory is deprecated, please use 'fieldName' (or another FieldMutatingUpdateProcessorFactory selector option) instead
   [junit4]   2> 693874 T3834 oasup.UniqFieldsUpdateProcessorFactory.init Replacing 'fields' init param with (individual) 'fieldName' params
   [junit4]   2> 693875 T3834 oasup.UpdateRequestProcessorChain.init inserting DistributedUpdateProcessorFactory into updateRequestProcessorChain "uniq-fields"
   [junit4]   2> 693875 T3834 oasup.UpdateRequestProcessorChain.init creating updateRequestProcessorChain "distrib-dup-test-chain-explicit"
   [junit4]   2> 693875 T3834 oasup.UpdateRequestProcessorChain.init creating updateRequestProcessorChain "distrib-dup-test-chain-implicit"
   [junit4]   2> 693875 T3834 oasup.UpdateRequestProcessorChain.init inserting DistributedUpdateProcessorFactory into updateRequestProcessorChain "distrib-dup-test-chain-implicit"
   [junit4]   2> 693876 T3834 oasc.SolrCore.loadUpdateProcessorChains no updateRequestProcessorChain defined as default, creating implicit default
   [junit4]   2> 693876 T3834 oasc.RequestHandlers.initHandlersFromConfig adding lazy requestHandler: solr.ReplicationHandler
   [junit4]   2> 693876 T3834 oasc.RequestHandlers.initHandlersFromConfig created /replication: solr.ReplicationHandler
   [junit4]   2> 693876 T3834 oasc.RequestHandlers.initHandlersFromConfig created standard: solr.StandardRequestHandler
   [junit4]   2> 693877 T3834 oasc.RequestHandlers.initHandlersFromConfig created /get: solr.RealTimeGetHandler
   [junit4]   2> 693877 T3834 oasc.RequestHandlers.initHandlersFromConfig created dismax: solr.SearchHandler
   [junit4]   2> 693877 T3834 oasc.RequestHandlers.initHandlersFromConfig created mock: org.apache.solr.core.MockQuerySenderListenerReqHandler
   [junit4]   2> 693878 T3834 oasc.RequestHandlers.initHandlersFromConfig created /admin/: org.apache.solr.handler.admin.AdminHandlers
   [junit4]   2> 693878 T3834 oasc.RequestHandlers.initHandlersFromConfig created /admin/file: solr.admin.ShowFileRequestHandler
   [junit4]   2> 693878 T3834 oasc.RequestHandlers.initHandlersFromConfig created defaults: solr.StandardRequestHandler
   [junit4]   2> 693878 T3834 oasc.RequestHandlers.initHandlersFromConfig adding lazy requestHandler: solr.StandardRequestHandler
   [junit4]   2> 693879 T3834 oasc.RequestHandlers.initHandlersFromConfig created lazy: solr.StandardRequestHandler
   [junit4]   2> 693879 T3834 oasc.RequestHandlers.initHandlersFromConfig created /update: solr.UpdateRequestHandler
   [junit4]   2> 693879 T3834 oasc.RequestHandlers.initHandlersFromConfig created /terms: org.apache.solr.handler.component.SearchHandler
   [junit4]   2> 693880 T3834 oasc.RequestHandlers.initHandlersFromConfig created spellCheckCompRH: org.apache.solr.handler.component.SearchHandler
   [junit4]   2> 693880 T3834 oasc.RequestHandlers.initHandlersFromConfig created spellCheckCompRH_Direct: org.apache.solr.handler.component.SearchHandler
   [junit4]   2> 693880 T3834 oasc.RequestHandlers.initHandlersFromConfig created spellCheckWithWordbreak: org.apache.solr.handler.component.SearchHandler
   [junit4]   2> 693881 T3834 oasc.RequestHandlers.initHandlersFromConfig created spellCheckWithWordbreak_Direct: org.apache.solr.handler.component.SearchHandler
   [junit4]   2> 693881 T3834 oasc.RequestHandlers.initHandlersFromConfig created spellCheckCompRH1: org.apache.solr.handler.component.SearchHandler
   [junit4]   2> 693881 T3834 oasc.RequestHandlers.initHandlersFromConfig created mltrh: org.apache.solr.handler.component.SearchHandler
   [junit4]   2> 693882 T3834 oasc.RequestHandlers.initHandlersFromConfig created tvrh: org.apache.solr.handler.component.SearchHandler
   [junit4]   2> 693882 T3834 oasc.RequestHandlers.initHandlersFromConfig created /mlt: solr.MoreLikeThisHandler
   [junit4]   2> 693882 T3834 oasc.RequestHandlers.initHandlersFromConfig created /debug/dump: solr.DumpRequestHandler
   [junit4]   2> 693885 T3834 oashl.XMLLoader.init xsltCacheLifetimeSeconds=60
   [junit4]   2> 693886 T3834 oasc.SolrCore.initDeprecatedSupport WARN solrconfig.xml uses deprecated <admin/gettableFiles>, Please update your config to use the ShowFileRequestHandler.
   [junit4]   2> 693888 T3834 oasu.CommitTracker.<init> Hard AutoCommit: disabled
   [junit4]   2> 693888 T3834 oasu.CommitTracker.<init> Soft AutoCommit: disabled
   [junit4]   2> 693889 T3834 oasu.RandomMergePolicy.<init> RandomMergePolicy wrapping class org.apache.lucene.index.TieredMergePolicy: [TieredMergePolicy: maxMergeAtOnce=43, maxMergeAtOnceExplicit=20, maxMergedSegmentMB=38.064453125, floorSegmentMB=1.82421875, forceMergeDeletesPctAllowed=14.93242318055582, segmentsPerTier=42.0, maxCFSSegmentSizeMB=8.796093022207999E12, noCFSRatio=1.0
   [junit4]   2> 693889 T3834 oasc.SolrDeletionPolicy.onInit SolrDeletionPolicy.onInit: commits: num=1
   [junit4]   2> 		commit{dir=RateLimitedDirectoryWrapper(MockDirectoryWrapper(RAMDirectory@db943c lockFactory=org.apache.lucene.store.SingleInstanceLockFactory@1aa3259)),segFN=segments_1,generation=1}
   [junit4]   2> 693889 T3834 oasc.SolrDeletionPolicy.updateCommits newest commit generation = 1
   [junit4]   2> 693890 T3834 oass.SolrIndexSearcher.<init> Opening Searcher@116968[dummycore] main
   [junit4]   2> 693890 T3834 oasr.RestManager.init Initializing RestManager with initArgs: {storageIO=org.apache.solr.rest.ManagedResourceStorage$InMemoryStorageIO}
   [junit4]   2> 693890 T3834 oasr.ManagedResourceStorage.load Reading _rest_managed.json using InMemoryStorage
   [junit4]   2> 693890 T3834 oasr.ManagedResource.reloadFromStorage WARN No stored data found for /rest/managed
   [junit4]   2> 693890 T3834 oasr.ManagedResource.notifyObserversDuringInit WARN No registered observers for /rest/managed
   [junit4]   2> 693891 T3834 oasr.RestManager.init Initializing 0 registered ManagedResources
   [junit4]   2> 693891 T3834 oashc.SpellCheckComponent.inform Initializing spell checkers
   [junit4]   2> 694201 T3830 oasha.CoreAdminHandler.handleRequestActionStatus Checking request status for : 42
   [junit4]   2> 695202 T3830 oasha.CoreAdminHandler.handleRequestActionStatus Checking request status for : 42
   [junit4]   2> 696202 T3830 oasha.CoreAdminHandler.handleRequestActionStatus Checking request status for : 42
   [junit4]   2> 697203 T3830 oasha.CoreAdminHandler.handleRequestActionStatus Checking request status for : 42
   [junit4]   2> 698204 T3830 oasha.CoreAdminHandler.handleRequestActionStatus Checking request status for : 42
   [junit4]   2> 699205 T3830 oasha.CoreAdminHandler.handleRequestActionStatus Checking request status for : 42
   [junit4]   2> 700206 T3830 oasha.CoreAdminHandler.handleRequestActionStatus Checking request status for : 42
   [junit4]   2> 701206 T3830 oasha.CoreAdminHandler.handleRequestActionStatus Checking request status for : 42
   [junit4]   2> 702207 T3830 oasha.CoreAdminHandler.handleRequestActionStatus Checking request status for : 42
   [junit4]   2> 703208 T3830 oas.SolrTestCaseJ4.tearDown ###Ending testCoreAdminRequestStatus
   [junit4]   2> NOTE: reproduce with: ant test  -Dtestcase=CoreAdminRequestStatusTest -Dtests.method=testCoreAdminRequestStatus -Dtests.seed=249C2328AC207A86 -Dtests.multiplier=3 -Dtests.slow=true -Dtests.locale=lv_LV -Dtests.timezone=Pacific/Wallis -Dtests.file.encoding=ISO-8859-1
   [junit4] FAILURE 10.2s J0 | CoreAdminRequestStatusTest.testCoreAdminRequestStatus <<<
   [junit4]    > Throwable #1: org.junit.ComparisonFailure: The status of request was expected to be completed expected:<[completed]> but was:<[running]>
   [junit4]    > 	at __randomizedtesting.SeedInfo.seed([249C2328AC207A86:2820D2C12B6CE3C]:0)
   [junit4]    > 	at org.apache.solr.handler.admin.CoreAdminRequestStatusTest.testCoreAdminRequestStatus(CoreAdminRequestStatusTest.java:84)
   [junit4]    > 	at java.lang.Thread.run(Thread.java:745)
   [junit4]   2> 703225 T3830 oas.SolrTestCaseJ4.deleteCore ###deleteCore
   [junit4]   2> 703225 T3830 oasc.CoreContainer.shutdown Shutting down CoreContainer instance=20177708
   [junit4]   2> 703226 T3830 oasc.SolrCore.close [collection1]  CLOSING SolrCore org.apache.solr.core.SolrCore@13bf5f7
   [junit4]   2> 703239 T3830 oasu.DirectUpdateHandler2.close closing DirectUpdateHandler2{commits=0,autocommits=0,soft autocommits=0,optimizes=0,rollbacks=0,expungeDeletes=0,docsPending=0,adds=0,deletesById=0,deletesByQuery=0,errors=0,cumulative_adds=0,cumulative_deletesById=0,cumulative_deletesByQuery=0,cumulative_errors=0,transaction_logs_total_size=0,transaction_logs_total_number=0}
   [junit4]   2> 703239 T3830 oasu.SolrCoreState.decrefSolrCoreState Closing SolrCoreState
   [junit4]   2> 703239 T3830 oasu.DefaultSolrCoreState.closeIndexWriter SolrCoreState ref count has reached 0 - closing IndexWriter
   [junit4]   2> 703239 T3830 oasu.DefaultSolrCoreState.closeIndexWriter closing IndexWriter with IndexWriterCloser
   [junit4]   2> 703240 T3830 oasc.SolrCore.closeSearcher [collection1] Closing main searcher on request.
   [junit4]   2> 703241 T3830 oasc.CachingDirectoryFactory.close Closing MockDirectoryFactory - 2 directories currently being tracked
   [junit4]   2> 703241 T3830 oasc.CachingDirectoryFactory.closeCacheValue looking to close /mnt/ssd/jenkins/workspace/Lucene-Solr-4.x-Linux/solr/build/solr-core/test/J0/./solr.handler.admin.CoreAdminRequestStatusTest-249C2328AC207A86-001/init-core-data-001 [CachedDir<<refCount=0;path=/mnt/ssd/jenkins/workspace/Lucene-Solr-4.x-Linux/solr/build/solr-core/test/J0/./solr.handler.admin.CoreAdminRequestStatusTest-249C2328AC207A86-001/init-core-data-001;done=false>>]
   [junit4]   2> 703241 T3830 oasc.CachingDirectoryFactory.close Closing directory: /mnt/ssd/jenkins/workspace/Lucene-Solr-4.x-Linux/solr/build/solr-core/test/J0/./solr.handler.admin.CoreAdminRequestStatusTest-249C2328AC207A86-001/init-core-data-001
   [junit4]   2> 703242 T3830 oasc.CachingDirectoryFactory.closeCacheValue looking to close /mnt/ssd/jenkins/workspace/Lucene-Solr-4.x-Linux/solr/build/solr-core/test/J0/./solr.handler.admin.CoreAdminRequestStatusTest-249C2328AC207A86-001/init-core-data-001/index [CachedDir<<refCount=0;path=/mnt/ssd/jenkins/workspace/Lucene-Solr-4.x-Linux/solr/build/solr-core/test/J0/./solr.handler.admin.CoreAdminRequestStatusTest-249C2328AC207A86-001/init-core-data-001/index;done=false>>]
   [junit4]   2> 703242 T3830 oasc.CachingDirectoryFactory.close Closing directory: /mnt/ssd/jenkins/workspace/Lucene-Solr-4.x-Linux/solr/build/solr-core/test/J0/./solr.handler.admin.CoreAdminRequestStatusTest-249C2328AC207A86-001/init-core-data-001/index
   [junit4]   2> 705769 T3834 oass.DirectSolrSpellChecker.init init: {name=direct,classname=DirectSolrSpellChecker,field=lowerfilt,minQueryLength=3}
   [junit4]   2> 705800 T3835 oasc.SolrCore.registerSearcher [dummycore] Registered new searcher Searcher@116968[dummycore] main{StandardDirectoryReader(segments_1:1:nrt)}
   [junit4]   2> 705805 T3834 oasc.SolrCore.close [dummycore]  CLOSING SolrCore org.apache.solr.core.SolrCore@17d7a67
   [junit4]   2> 705821 T3834 oasu.DirectUpdateHandler2.close closing DirectUpdateHandler2{commits=0,autocommits=0,soft autocommits=0,optimizes=0,rollbacks=0,expungeDeletes=0,docsPending=0,adds=0,deletesById=0,deletesByQuery=0,errors=0,cumulative_adds=0,cumulative_deletesById=0,cumulative_deletesByQuery=0,cumulative_errors=0,transaction_logs_total_size=0,transaction_logs_total_number=0}
   [junit4]   2> 705821 T3834 oasu.SolrCoreState.decrefSolrCoreState Closing SolrCoreState
   [junit4]   2> 705821 T3834 oasu.DefaultSolrCoreState.closeIndexWriter SolrCoreState ref count has reached 0 - closing IndexWriter
   [junit4]   2> 705821 T3834 oasu.DefaultSolrCoreState.closeIndexWriter closing IndexWriter with IndexWriterCloser
   [junit4]   2> 705822 T3834 oasc.SolrCore.closeSearcher [dummycore] Closing main searcher on request.
   [junit4]   2> 705822 T3834 oasc.CachingDirectoryFactory.close Closing MockDirectoryFactory - 2 directories currently being tracked
   [junit4]   2> 705823 T3834 oasc.CachingDirectoryFactory.closeCacheValue looking to close /mnt/ssd/jenkins/workspace/Lucene-Solr-4.x-Linux/solr/build/solr-core/test/J0/./solr.handler.admin.CoreAdminRequestStatusTest-249C2328AC207A86-001/tempDir-001/instProp/data [CachedDir<<refCount=0;path=/mnt/ssd/jenkins/workspace/Lucene-Solr-4.x-Linux/solr/build/solr-core/test/J0/./solr.handler.admin.CoreAdminRequestStatusTest-249C2328AC207A86-001/tempDir-001/instProp/data;done=false>>]
   [junit4]   2> 705823 T3834 oasc.CachingDirectoryFactory.close Closing directory: /mnt/ssd/jenkins/workspace/Lucene-Solr-4.x-Linux/solr/build/solr-core/test/J0/./solr.handler.admin.CoreAdminRequestStatusTest-249C2328AC207A86-001/tempDir-001/instProp/data
   [junit4]   2> 705823 T3834 oasc.CachingDirectoryFactory.closeCacheValue looking to close /mnt/ssd/jenkins/workspace/Lucene-Solr-4.x-Linux/solr/build/solr-core/test/J0/./solr.handler.admin.CoreAdminRequestStatusTest-249C2328AC207A86-001/tempDir-001/instProp/data/index [CachedDir<<refCount=0;path=/mnt/ssd/jenkins/workspace/Lucene-Solr-4.x-Linux/solr/build/solr-core/test/J0/./solr.handler.admin.CoreAdminRequestStatusTest-249C2328AC207A86-001/tempDir-001/instProp/data/index;done=false>>]
   [junit4]   2> 705823 T3834 oasc.CachingDirectoryFactory.close Closing directory: /mnt/ssd/jenkins/workspace/Lucene-Solr-4.x-Linux/solr/build/solr-core/test/J0/./solr.handler.admin.CoreAdminRequestStatusTest-249C2328AC207A86-001/tempDir-001/instProp/data/index
   [junit4]   2> NOTE: leaving temporary files on disk at: /mnt/ssd/jenkins/workspace/Lucene-Solr-4.x-Linux/solr/build/solr-core/test/J0/./solr.handler.admin.CoreAdminRequestStatusTest-249C2328AC207A86-001
   [junit4]   2> 14715 T3829 ccr.ThreadLeakControl.checkThreadLeaks WARNING Will linger awaiting termination of 1 leaked thread(s).
   [junit4]   2> 34809 T3829 ccr.ThreadLeakControl.checkThreadLeaks SEVERE 1 thread leaked from SUITE scope at org.apache.solr.handler.admin.CoreAdminRequestStatusTest: 
   [junit4]   2> 	   1) Thread[id=3834, name=parallelCoreAdminExecutor-2006-thread-1, state=WAITING, group=TGRP-CoreAdminRequestStatusTest]
   [junit4]   2> 	        at sun.misc.Unsafe.park(Native Method)
   [junit4]   2> 	        at java.util.concurrent.locks.LockSupport.park(LockSupport.java:186)
   [junit4]   2> 	        at java.util.concurrent.locks.AbstractQueuedSynchronizer$ConditionObject.await(AbstractQueuedSynchronizer.java:2043)
   [junit4]   2> 	        at java.util.concurrent.LinkedBlockingQueue.take(LinkedBlockingQueue.java:442)
   [junit4]   2> 	        at java.util.concurrent.ThreadPoolExecutor.getTask(ThreadPoolExecutor.java:1068)
   [junit4]   2> 	        at java.util.concurrent.ThreadPoolExecutor.runWorker(ThreadPoolExecutor.java:1130)
   [junit4]   2> 	        at java.util.concurrent.ThreadPoolExecutor$Worker.run(ThreadPoolExecutor.java:615)
   [junit4]   2> 	        at java.lang.Thread.run(Thread.java:745)
   [junit4]   2> 34809 T3829 ccr.ThreadLeakControl.tryToInterruptAll Starting to interrupt leaked threads:
   [junit4]   2> 	   1) Thread[id=3834, name=parallelCoreAdminExecutor-2006-thread-1, state=WAITING, group=TGRP-CoreAdminRequestStatusTest]
   [junit4]   2> 37812 T3829 ccr.ThreadLeakControl.tryToInterruptAll SEVERE There are still zombie threads that couldn't be terminated:
   [junit4]   2> 	   1) Thread[id=3834, name=parallelCoreAdminExecutor-2006-thread-1, state=WAITING, group=TGRP-CoreAdminRequestStatusTest]
   [junit4]   2> 	        at sun.misc.Unsafe.park(Native Method)
   [junit4]   2> 	        at java.util.concurrent.locks.LockSupport.park(LockSupport.java:186)
   [junit4]   2> 	        at java.util.concurrent.locks.AbstractQueuedSynchronizer$ConditionObject.await(AbstractQueuedSynchronizer.java:2043)
   [junit4]   2> 	        at java.util.concurrent.LinkedBlockingQueue.take(LinkedBlockingQueue.java:442)
   [junit4]   2> 	        at java.util.concurrent.ThreadPoolExecutor.getTask(ThreadPoolExecutor.java:1068)
   [junit4]   2> 	        at java.util.concurrent.ThreadPoolExecutor.runWorker(ThreadPoolExecutor.java:1130)
   [junit4]   2> 	        at java.util.concurrent.ThreadPoolExecutor$Worker.run(ThreadPoolExecutor.java:615)
   [junit4]   2> 	        at java.lang.Thread.run(Thread.java:745)
   [junit4]   2> NOTE: test params are: codec=Lucene46: {}, docValues:{}, sim=DefaultSimilarity, locale=lv_LV, timezone=Pacific/Wallis
   [junit4]   2> NOTE: Linux 3.8.0-39-generic i386/Oracle Corporation 1.7.0_55 (32-bit)/cpus=8,threads=2,free=214605320,total=376438784
   [junit4]   2> NOTE: All tests run in this JVM: [QueryParsingTest, OverseerTest, AssignTest, TestImplicitCoreProperties, TestMergePolicyConfig, DistributedQueryComponentCustomSortTest, TestQueryUtils, TestDocumentBuilder, CollectionsAPIAsyncDistributedZkTest, TestJoin, BasicDistributedZkTest, ShowFileRequestHandlerTest, UnloadDistributedZkTest, TestSurroundQueryParser, MBeansHandlerTest, AddSchemaFieldsUpdateProcessorFactoryTest, TestSolrXmlPersistor, CacheHeaderTest, TestSolrQueryParser, ClusterStateUpdateTest, SSLMigrationTest, TermVectorComponentTest, AnalysisAfterCoreReloadTest, TestStressVersions, SolrXmlInZkTest, LegacyHTMLStripCharFilterTest, TestBM25SimilarityFactory, TestBadConfig, ResourceLoaderTest, TestCloudManagedSchemaAddField, TermsComponentTest, TestSort, DistributedQueryElevationComponentTest, DistributedSpellCheckComponentTest, TestLMJelinekMercerSimilarityFactory, QueryEqualityTest, OverseerStatusTest, FileBasedSpellCheckerTest, SimpleFacetsTest, TestHighlightDedupGrouping, SoftAutoCommitTest, PolyFieldTest, ResponseLogComponentTest, TestExtendedDismaxParser, SuggesterTest, DocumentBuilderTest, TestSystemIdResolver, StressHdfsTest, TestPseudoReturnFields, TestSolrDeletionPolicy1, TestDynamicFieldCollectionResource, SolrInfoMBeanTest, InfoHandlerTest, FastVectorHighlighterTest, SolrTestCaseJ4Test, TestPHPSerializedResponseWriter, TestSolrXmlPersistence, TestDistribDocBasedVersion, TestCloudManagedSchema, TestSolrXMLSerializer, TestFieldSortValues, TestCursorMarkWithoutUniqueKey, DirectUpdateHandlerOptimizeTest, TestElisionMultitermQuery, BlockDirectoryTest, BadComponentTest, ExternalFileFieldSortTest, TestTrie, TestSchemaNameResource, TestReplicationHandler, UUIDFieldTest, ClusterStateTest, TestManagedStopFilterFactory, CoreAdminRequestStatusTest]
   [junit4]   2> NOTE: reproduce with: ant test  -Dtestcase=CoreAdminRequestStatusTest -Dtests.seed=249C2328AC207A86 -Dtests.multiplier=3 -Dtests.slow=true -Dtests.locale=lv_LV -Dtests.timezone=Pacific/Wallis -Dtests.file.encoding=ISO-8859-1
   [junit4] ERROR   0.00s J0 | CoreAdminRequestStatusTest (suite) <<<
   [junit4]    > Throwable #1: com.carrotsearch.randomizedtesting.ThreadLeakError: 1 thread leaked from SUITE scope at org.apache.solr.handler.admin.CoreAdminRequestStatusTest: 
   [junit4]    >    1) Thread[id=3834, name=parallelCoreAdminExecutor-2006-thread-1, state=WAITING, group=TGRP-CoreAdminRequestStatusTest]
   [junit4]    >         at sun.misc.Unsafe.park(Native Method)
   [junit4]    >         at java.util.concurrent.locks.LockSupport.park(LockSupport.java:186)
   [junit4]    >         at java.util.concurrent.locks.AbstractQueuedSynchronizer$ConditionObject.await(AbstractQueuedSynchronizer.java:2043)
   [junit4]    >         at java.util.concurrent.LinkedBlockingQueue.take(LinkedBlockingQueue.java:442)
   [junit4]    >         at java.util.concurrent.ThreadPoolExecutor.getTask(ThreadPoolExecutor.java:1068)
   [junit4]    >         at java.util.concurrent.ThreadPoolExecutor.runWorker(ThreadPoolExecutor.java:1130)
   [junit4]    >         at java.util.concurrent.ThreadPoolExecutor$Worker.run(ThreadPoolExecutor.java:615)
   [junit4]    >         at java.lang.Thread.run(Thread.java:745)
   [junit4]    > 	at __randomizedtesting.SeedInfo.seed([249C2328AC207A86]:0)Throwable #2: com.carrotsearch.randomizedtesting.ThreadLeakError: There are still zombie threads that couldn't be terminated:
   [junit4]    >    1) Thread[id=3834, name=parallelCoreAdminExecutor-2006-thread-1, state=WAITING, group=TGRP-CoreAdminRequestStatusTest]
   [junit4]    >         at sun.misc.Unsafe.park(Native Method)
   [junit4]    >         at java.util.concurrent.locks.LockSupport.park(LockSupport.java:186)
   [junit4]    >         at java.util.concurrent.locks.AbstractQueuedSynchronizer$ConditionObject.await(AbstractQueuedSynchronizer.java:2043)
   [junit4]    >         at java.util.concurrent.LinkedBlockingQueue.take(LinkedBlockingQueue.java:442)
   [junit4]    >         at java.util.concurrent.ThreadPoolExecutor.getTask(ThreadPoolExecutor.java:1068)
   [junit4]    >         at java.util.concurrent.ThreadPoolExecutor.runWorker(ThreadPoolExecutor.java:1130)
   [junit4]    >         at java.util.concurrent.ThreadPoolExecutor$Worker.run(ThreadPoolExecutor.java:615)
   [junit4]    >         at java.lang.Thread.run(Thread.java:745)
   [junit4]    > 	at __randomizedtesting.SeedInfo.seed([249C2328AC207A86]:0)
   [junit4] Completed on J0 in 37.84s, 1 test, 1 failure, 2 errors <<< FAILURES!

[...truncated 669 lines...]
BUILD FAILED
/mnt/ssd/jenkins/workspace/Lucene-Solr-4.x-Linux/build.xml:467: The following error occurred while executing this line:
/mnt/ssd/jenkins/workspace/Lucene-Solr-4.x-Linux/build.xml:447: The following error occurred while executing this line:
/mnt/ssd/jenkins/workspace/Lucene-Solr-4.x-Linux/build.xml:45: The following error occurred while executing this line:
/mnt/ssd/jenkins/workspace/Lucene-Solr-4.x-Linux/extra-targets.xml:37: The following error occurred while executing this line:
/mnt/ssd/jenkins/workspace/Lucene-Solr-4.x-Linux/solr/build.xml:189: The following error occurred while executing this line:
/mnt/ssd/jenkins/workspace/Lucene-Solr-4.x-Linux/solr/common-build.xml:496: The following error occurred while executing this line:
/mnt/ssd/jenkins/workspace/Lucene-Solr-4.x-Linux/lucene/common-build.xml:1297: The following error occurred while executing this line:
/mnt/ssd/jenkins/workspace/Lucene-Solr-4.x-Linux/lucene/common-build.xml:921: There were test failures: 390 suites, 1635 tests, 2 suite-level errors, 1 failure, 882 ignored (13 assumptions)

Total time: 52 minutes 5 seconds
Build step 'Invoke Ant' marked build as failure
Description set: Java: 32bit/jdk1.7.0_55 -server -XX:+UseG1GC
Archiving artifacts
Recording test results
Email was triggered for: Failure
Sending email for trigger: Failure



Mime
View raw message