lucene-dev mailing list archives

Site index · List index
Message view « Date » · « Thread »
Top « Date » · « Thread »
From buil...@flonkings.com
Subject [JENKINS] Lucene-4x-Linux-Java7-64-test-only - Build # 21354 - Failure!
Date Tue, 13 May 2014 04:22:29 GMT
Build: builds.flonkings.com/job/Lucene-4x-Linux-Java7-64-test-only/21354/

2 tests failed.
FAILED:  junit.framework.TestSuite.org.apache.lucene.index.TestIndexWriterThreadsToSegments

Error Message:
The test or suite printed 18316 bytes to stdout and stderr, even though the limit was set
to 8192 bytes. Increase the limit with @Limit, ignore it completely with @SuppressSysoutChecks
or run with -Dtests.verbose=true

Stack Trace:
java.lang.AssertionError: The test or suite printed 18316 bytes to stdout and stderr, even
though the limit was set to 8192 bytes. Increase the limit with @Limit, ignore it completely
with @SuppressSysoutChecks or run with -Dtests.verbose=true
	at __randomizedtesting.SeedInfo.seed([5373C01FEEF4F0D6]:0)
	at org.apache.lucene.util.TestRuleLimitSysouts.afterIfSuccessful(TestRuleLimitSysouts.java:210)
	at com.carrotsearch.randomizedtesting.rules.TestRuleAdapter$1.afterIfSuccessful(TestRuleAdapter.java:36)
	at com.carrotsearch.randomizedtesting.rules.StatementAdapter.evaluate(StatementAdapter.java:37)
	at org.apache.lucene.util.TestRuleAssertionsRequired$1.evaluate(TestRuleAssertionsRequired.java:43)
	at org.apache.lucene.util.TestRuleMarkFailure$1.evaluate(TestRuleMarkFailure.java:48)
	at org.apache.lucene.util.TestRuleIgnoreAfterMaxFailures$1.evaluate(TestRuleIgnoreAfterMaxFailures.java:65)
	at org.apache.lucene.util.TestRuleIgnoreTestSuites$1.evaluate(TestRuleIgnoreTestSuites.java:55)
	at com.carrotsearch.randomizedtesting.rules.StatementAdapter.evaluate(StatementAdapter.java:36)
	at com.carrotsearch.randomizedtesting.ThreadLeakControl$StatementRunner.run(ThreadLeakControl.java:360)
	at java.lang.Thread.run(Thread.java:724)


REGRESSION:  org.apache.lucene.index.TestIndexWriterThreadsToSegments.testSegmentCountOnFlushRandom

Error Message:
Captured an uncaught exception in thread: Thread[id=307, name=Thread-235, state=RUNNABLE,
group=TGRP-TestIndexWriterThreadsToSegments]

Stack Trace:
com.carrotsearch.randomizedtesting.UncaughtExceptionError: Captured an uncaught exception
in thread: Thread[id=307, name=Thread-235, state=RUNNABLE, group=TGRP-TestIndexWriterThreadsToSegments]
Caused by: java.lang.OutOfMemoryError: Java heap space
	at __randomizedtesting.SeedInfo.seed([5373C01FEEF4F0D6]:0)
	at org.apache.lucene.util.BytesRef.copyBytes(BytesRef.java:187)
	at org.apache.lucene.util.BytesRef.deepCopyOf(BytesRef.java:334)
	at org.apache.lucene.codecs.memory.MemoryPostingsFormat$TermsWriter.finishTerm(MemoryPostingsFormat.java:265)
	at org.apache.lucene.index.FreqProxTermsWriterPerField.flush(FreqProxTermsWriterPerField.java:501)
	at org.apache.lucene.index.FreqProxTermsWriter.flush(FreqProxTermsWriter.java:80)
	at org.apache.lucene.index.DefaultIndexingChain.flush(DefaultIndexingChain.java:117)
	at org.apache.lucene.index.DocumentsWriterPerThread.flush(DocumentsWriterPerThread.java:415)
	at org.apache.lucene.index.DocumentsWriter.doFlush(DocumentsWriter.java:512)
	at org.apache.lucene.index.DocumentsWriter.flushAllThreads(DocumentsWriter.java:622)
	at org.apache.lucene.index.IndexWriter.getReader(IndexWriter.java:377)
	at org.apache.lucene.index.StandardDirectoryReader.doOpenFromWriter(StandardDirectoryReader.java:287)
	at org.apache.lucene.index.StandardDirectoryReader.doOpenIfChanged(StandardDirectoryReader.java:262)
	at org.apache.lucene.index.StandardDirectoryReader.doOpenIfChanged(StandardDirectoryReader.java:252)
	at org.apache.lucene.index.DirectoryReader.openIfChanged(DirectoryReader.java:171)
	at org.apache.lucene.index.TestIndexWriterThreadsToSegments$CheckSegmentCount.run(TestIndexWriterThreadsToSegments.java:128)
	at java.util.concurrent.CyclicBarrier.dowait(CyclicBarrier.java:213)
	at java.util.concurrent.CyclicBarrier.await(CyclicBarrier.java:355)
	at org.apache.lucene.index.TestIndexWriterThreadsToSegments$2.run(TestIndexWriterThreadsToSegments.java:221)




Build Log:
[...truncated 783 lines...]
   [junit4] Suite: org.apache.lucene.index.TestIndexWriterThreadsToSegments
   [junit4]   2> мај 12, 2014 11:19:51 PM com.carrotsearch.randomizedtesting.RandomizedRunner$QueueUncaughtExceptionsHandler
uncaughtException
   [junit4]   2> WARNING: Uncaught exception in thread: Thread[Thread-235,5,TGRP-TestIndexWriterThreadsToSegments]
   [junit4]   2> java.lang.OutOfMemoryError: Java heap space
   [junit4]   2> 	at __randomizedtesting.SeedInfo.seed([5373C01FEEF4F0D6]:0)
   [junit4]   2> 	at org.apache.lucene.util.BytesRef.copyBytes(BytesRef.java:187)
   [junit4]   2> 	at org.apache.lucene.util.BytesRef.deepCopyOf(BytesRef.java:334)
   [junit4]   2> 	at org.apache.lucene.codecs.memory.MemoryPostingsFormat$TermsWriter.finishTerm(MemoryPostingsFormat.java:265)
   [junit4]   2> 	at org.apache.lucene.index.FreqProxTermsWriterPerField.flush(FreqProxTermsWriterPerField.java:501)
   [junit4]   2> 	at org.apache.lucene.index.FreqProxTermsWriter.flush(FreqProxTermsWriter.java:80)
   [junit4]   2> 	at org.apache.lucene.index.DefaultIndexingChain.flush(DefaultIndexingChain.java:117)
   [junit4]   2> 	at org.apache.lucene.index.DocumentsWriterPerThread.flush(DocumentsWriterPerThread.java:415)
   [junit4]   2> 	at org.apache.lucene.index.DocumentsWriter.doFlush(DocumentsWriter.java:512)
   [junit4]   2> 	at org.apache.lucene.index.DocumentsWriter.flushAllThreads(DocumentsWriter.java:622)
   [junit4]   2> 	at org.apache.lucene.index.IndexWriter.getReader(IndexWriter.java:377)
   [junit4]   2> 	at org.apache.lucene.index.StandardDirectoryReader.doOpenFromWriter(StandardDirectoryReader.java:287)
   [junit4]   2> 	at org.apache.lucene.index.StandardDirectoryReader.doOpenIfChanged(StandardDirectoryReader.java:262)
   [junit4]   2> 	at org.apache.lucene.index.StandardDirectoryReader.doOpenIfChanged(StandardDirectoryReader.java:252)
   [junit4]   2> 	at org.apache.lucene.index.DirectoryReader.openIfChanged(DirectoryReader.java:171)
   [junit4]   2> 	at org.apache.lucene.index.TestIndexWriterThreadsToSegments$CheckSegmentCount.run(TestIndexWriterThreadsToSegments.java:128)
   [junit4]   2> 	at java.util.concurrent.CyclicBarrier.dowait(CyclicBarrier.java:213)
   [junit4]   2> 	at java.util.concurrent.CyclicBarrier.await(CyclicBarrier.java:355)
   [junit4]   2> 	at org.apache.lucene.index.TestIndexWriterThreadsToSegments$2.run(TestIndexWriterThreadsToSegments.java:221)
   [junit4]   2> 
   [junit4]   2> мај 12, 2014 11:19:51 PM com.carrotsearch.randomizedtesting.RandomizedRunner$QueueUncaughtExceptionsHandler
uncaughtException
   [junit4]   2> WARNING: Uncaught exception in thread: Thread[Thread-227,5,TGRP-TestIndexWriterThreadsToSegments]
   [junit4]   2> java.lang.RuntimeException: java.util.concurrent.BrokenBarrierException
   [junit4]   2> 	at __randomizedtesting.SeedInfo.seed([5373C01FEEF4F0D6]:0)
   [junit4]   2> 	at org.apache.lucene.index.TestIndexWriterThreadsToSegments$2.run(TestIndexWriterThreadsToSegments.java:224)
   [junit4]   2> Caused by: java.util.concurrent.BrokenBarrierException
   [junit4]   2> 	at java.util.concurrent.CyclicBarrier.dowait(CyclicBarrier.java:243)
   [junit4]   2> 	at java.util.concurrent.CyclicBarrier.await(CyclicBarrier.java:355)
   [junit4]   2> 	at org.apache.lucene.index.TestIndexWriterThreadsToSegments$2.run(TestIndexWriterThreadsToSegments.java:221)
   [junit4]   2> 
   [junit4]   2> мај 12, 2014 11:19:51 PM com.carrotsearch.randomizedtesting.RandomizedRunner$QueueUncaughtExceptionsHandler
uncaughtException
   [junit4]   2> WARNING: Uncaught exception in thread: Thread[Thread-234,5,TGRP-TestIndexWriterThreadsToSegments]
   [junit4]   2> java.lang.RuntimeException: java.util.concurrent.BrokenBarrierException
   [junit4]   2> 	at __randomizedtesting.SeedInfo.seed([5373C01FEEF4F0D6]:0)
   [junit4]   2> 	at org.apache.lucene.index.TestIndexWriterThreadsToSegments$2.run(TestIndexWriterThreadsToSegments.java:224)
   [junit4]   2> Caused by: java.util.concurrent.BrokenBarrierException
   [junit4]   2> 	at java.util.concurrent.CyclicBarrier.dowait(CyclicBarrier.java:243)
   [junit4]   2> 	at java.util.concurrent.CyclicBarrier.await(CyclicBarrier.java:355)
   [junit4]   2> 	at org.apache.lucene.index.TestIndexWriterThreadsToSegments$2.run(TestIndexWriterThreadsToSegments.java:221)
   [junit4]   2> 
   [junit4]   2> мај 12, 2014 11:19:51 PM com.carrotsearch.randomizedtesting.RandomizedRunner$QueueUncaughtExceptionsHandler
uncaughtException
   [junit4]   2> WARNING: Uncaught exception in thread: Thread[Thread-228,5,TGRP-TestIndexWriterThreadsToSegments]
   [junit4]   2> java.lang.RuntimeException: java.util.concurrent.BrokenBarrierException
   [junit4]   2> 	at __randomizedtesting.SeedInfo.seed([5373C01FEEF4F0D6]:0)
   [junit4]   2> 	at org.apache.lucene.index.TestIndexWriterThreadsToSegments$2.run(TestIndexWriterThreadsToSegments.java:224)
   [junit4]   2> Caused by: java.util.concurrent.BrokenBarrierException
   [junit4]   2> 	at java.util.concurrent.CyclicBarrier.dowait(CyclicBarrier.java:243)
   [junit4]   2> 	at java.util.concurrent.CyclicBarrier.await(CyclicBarrier.java:355)
   [junit4]   2> 	at org.apache.lucene.index.TestIndexWriterThreadsToSegments$2.run(TestIndexWriterThreadsToSegments.java:221)
   [junit4]   2> 
   [junit4]   2> мај 12, 2014 11:19:51 PM com.carrotsearch.randomizedtesting.RandomizedRunner$QueueUncaughtExceptionsHandler
uncaughtException
   [junit4]   2> WARNING: Uncaught exception in thread: Thread[Thread-230,5,TGRP-TestIndexWriterThreadsToSegments]
   [junit4]   2> java.lang.RuntimeException: java.util.concurrent.BrokenBarrierException
   [junit4]   2> 	at __randomizedtesting.SeedInfo.seed([5373C01FEEF4F0D6]:0)
   [junit4]   2> 	at org.apache.lucene.index.TestIndexWriterThreadsToSegments$2.run(TestIndexWriterThreadsToSegments.java:224)
   [junit4]   2> Caused by: java.util.concurrent.BrokenBarrierException
   [junit4]   2> 	at java.util.concurrent.CyclicBarrier.dowait(CyclicBarrier.java:243)
   [junit4]   2> 	at java.util.concurrent.CyclicBarrier.await(CyclicBarrier.java:355)
   [junit4]   2> 	at org.apache.lucene.index.TestIndexWriterThreadsToSegments$2.run(TestIndexWriterThreadsToSegments.java:221)
   [junit4]   2> 
   [junit4]   2> мај 12, 2014 11:19:51 PM com.carrotsearch.randomizedtesting.RandomizedRunner$QueueUncaughtExceptionsHandler
uncaughtException
   [junit4]   2> WARNING: Uncaught exception in thread: Thread[Thread-231,5,TGRP-TestIndexWriterThreadsToSegments]
   [junit4]   2> java.lang.RuntimeException: java.util.concurrent.BrokenBarrierException
   [junit4]   2> 	at __randomizedtesting.SeedInfo.seed([5373C01FEEF4F0D6]:0)
   [junit4]   2> 	at org.apache.lucene.index.TestIndexWriterThreadsToSegments$2.run(TestIndexWriterThreadsToSegments.java:224)
   [junit4]   2> Caused by: java.util.concurrent.BrokenBarrierException
   [junit4]   2> 	at java.util.concurrent.CyclicBarrier.dowait(CyclicBarrier.java:243)
   [junit4]   2> 	at java.util.concurrent.CyclicBarrier.await(CyclicBarrier.java:355)
   [junit4]   2> 	at org.apache.lucene.index.TestIndexWriterThreadsToSegments$2.run(TestIndexWriterThreadsToSegments.java:221)
   [junit4]   2> 
   [junit4]   2> мај 12, 2014 11:19:51 PM com.carrotsearch.randomizedtesting.RandomizedRunner$QueueUncaughtExceptionsHandler
uncaughtException
   [junit4]   2> WARNING: Uncaught exception in thread: Thread[Thread-233,5,TGRP-TestIndexWriterThreadsToSegments]
   [junit4]   2> java.lang.RuntimeException: java.util.concurrent.BrokenBarrierException
   [junit4]   2> 	at __randomizedtesting.SeedInfo.seed([5373C01FEEF4F0D6]:0)
   [junit4]   2> 	at org.apache.lucene.index.TestIndexWriterThreadsToSegments$2.run(TestIndexWriterThreadsToSegments.java:224)
   [junit4]   2> Caused by: java.util.concurrent.BrokenBarrierException
   [junit4]   2> 	at java.util.concurrent.CyclicBarrier.dowait(CyclicBarrier.java:243)
   [junit4]   2> 	at java.util.concurrent.CyclicBarrier.await(CyclicBarrier.java:355)
   [junit4]   2> 	at org.apache.lucene.index.TestIndexWriterThreadsToSegments$2.run(TestIndexWriterThreadsToSegments.java:221)
   [junit4]   2> 
   [junit4]   2> мај 12, 2014 11:19:51 PM com.carrotsearch.randomizedtesting.RandomizedRunner$QueueUncaughtExceptionsHandler
uncaughtException
   [junit4]   2> WARNING: Uncaught exception in thread: Thread[Thread-229,5,TGRP-TestIndexWriterThreadsToSegments]
   [junit4]   2> java.lang.RuntimeException: java.util.concurrent.BrokenBarrierException
   [junit4]   2> 	at __randomizedtesting.SeedInfo.seed([5373C01FEEF4F0D6]:0)
   [junit4]   2> 	at org.apache.lucene.index.TestIndexWriterThreadsToSegments$2.run(TestIndexWriterThreadsToSegments.java:224)
   [junit4]   2> Caused by: java.util.concurrent.BrokenBarrierException
   [junit4]   2> 	at java.util.concurrent.CyclicBarrier.dowait(CyclicBarrier.java:243)
   [junit4]   2> 	at java.util.concurrent.CyclicBarrier.await(CyclicBarrier.java:355)
   [junit4]   2> 	at org.apache.lucene.index.TestIndexWriterThreadsToSegments$2.run(TestIndexWriterThreadsToSegments.java:221)
   [junit4]   2> 
   [junit4]   2> мај 12, 2014 11:19:51 PM com.carrotsearch.randomizedtesting.RandomizedRunner$QueueUncaughtExceptionsHandler
uncaughtException
   [junit4]   2> WARNING: Uncaught exception in thread: Thread[Thread-226,5,TGRP-TestIndexWriterThreadsToSegments]
   [junit4]   2> java.lang.RuntimeException: java.util.concurrent.BrokenBarrierException
   [junit4]   2> 	at __randomizedtesting.SeedInfo.seed([5373C01FEEF4F0D6]:0)
   [junit4]   2> 	at org.apache.lucene.index.TestIndexWriterThreadsToSegments$2.run(TestIndexWriterThreadsToSegments.java:224)
   [junit4]   2> Caused by: java.util.concurrent.BrokenBarrierException
   [junit4]   2> 	at java.util.concurrent.CyclicBarrier.dowait(CyclicBarrier.java:243)
   [junit4]   2> 	at java.util.concurrent.CyclicBarrier.await(CyclicBarrier.java:355)
   [junit4]   2> 	at org.apache.lucene.index.TestIndexWriterThreadsToSegments$2.run(TestIndexWriterThreadsToSegments.java:221)
   [junit4]   2> 
   [junit4]   2> мај 12, 2014 11:19:51 PM com.carrotsearch.randomizedtesting.RandomizedRunner$QueueUncaughtExceptionsHandler
uncaughtException
   [junit4]   2> WARNING: Uncaught exception in thread: Thread[Thread-232,5,TGRP-TestIndexWriterThreadsToSegments]
   [junit4]   2> java.lang.RuntimeException: java.util.concurrent.BrokenBarrierException
   [junit4]   2> 	at __randomizedtesting.SeedInfo.seed([5373C01FEEF4F0D6]:0)
   [junit4]   2> 	at org.apache.lucene.index.TestIndexWriterThreadsToSegments$2.run(TestIndexWriterThreadsToSegments.java:224)
   [junit4]   2> Caused by: java.util.concurrent.BrokenBarrierException
   [junit4]   2> 	at java.util.concurrent.CyclicBarrier.dowait(CyclicBarrier.java:243)
   [junit4]   2> 	at java.util.concurrent.CyclicBarrier.await(CyclicBarrier.java:355)
   [junit4]   2> 	at org.apache.lucene.index.TestIndexWriterThreadsToSegments$2.run(TestIndexWriterThreadsToSegments.java:221)
   [junit4]   2> 
   [junit4]   2> NOTE: reproduce with: ant test  -Dtestcase=TestIndexWriterThreadsToSegments
-Dtests.method=testSegmentCountOnFlushRandom -Dtests.seed=5373C01FEEF4F0D6 -Dtests.slow=true
-Dtests.locale=sr_RS -Dtests.timezone=America/Monterrey -Dtests.file.encoding=UTF-8
   [junit4] ERROR   50.4s J2 | TestIndexWriterThreadsToSegments.testSegmentCountOnFlushRandom
<<<
   [junit4]    > Throwable #1: com.carrotsearch.randomizedtesting.UncaughtExceptionError:
Captured an uncaught exception in thread: Thread[id=307, name=Thread-235, state=RUNNABLE,
group=TGRP-TestIndexWriterThreadsToSegments]
   [junit4]    > Caused by: java.lang.OutOfMemoryError: Java heap space
   [junit4]    > 	at __randomizedtesting.SeedInfo.seed([5373C01FEEF4F0D6]:0)
   [junit4]    > 	at org.apache.lucene.util.BytesRef.copyBytes(BytesRef.java:187)
   [junit4]    > 	at org.apache.lucene.util.BytesRef.deepCopyOf(BytesRef.java:334)
   [junit4]    > 	at org.apache.lucene.codecs.memory.MemoryPostingsFormat$TermsWriter.finishTerm(MemoryPostingsFormat.java:265)
   [junit4]    > 	at org.apache.lucene.index.FreqProxTermsWriterPerField.flush(FreqProxTermsWriterPerField.java:501)
   [junit4]    > 	at org.apache.lucene.index.FreqProxTermsWriter.flush(FreqProxTermsWriter.java:80)
   [junit4]    > 	at org.apache.lucene.index.DefaultIndexingChain.flush(DefaultIndexingChain.java:117)
   [junit4]    > 	at org.apache.lucene.index.DocumentsWriterPerThread.flush(DocumentsWriterPerThread.java:415)
   [junit4]    > 	at org.apache.lucene.index.DocumentsWriter.doFlush(DocumentsWriter.java:512)
   [junit4]    > 	at org.apache.lucene.index.DocumentsWriter.flushAllThreads(DocumentsWriter.java:622)
   [junit4]    > 	at org.apache.lucene.index.IndexWriter.getReader(IndexWriter.java:377)
   [junit4]    > 	at org.apache.lucene.index.StandardDirectoryReader.doOpenFromWriter(StandardDirectoryReader.java:287)
   [junit4]    > 	at org.apache.lucene.index.StandardDirectoryReader.doOpenIfChanged(StandardDirectoryReader.java:262)
   [junit4]    > 	at org.apache.lucene.index.StandardDirectoryReader.doOpenIfChanged(StandardDirectoryReader.java:252)
   [junit4]    > 	at org.apache.lucene.index.DirectoryReader.openIfChanged(DirectoryReader.java:171)
   [junit4]    > 	at org.apache.lucene.index.TestIndexWriterThreadsToSegments$CheckSegmentCount.run(TestIndexWriterThreadsToSegments.java:128)
   [junit4]    > 	at java.util.concurrent.CyclicBarrier.dowait(CyclicBarrier.java:213)
   [junit4]    > 	at java.util.concurrent.CyclicBarrier.await(CyclicBarrier.java:355)
   [junit4]    > 	at org.apache.lucene.index.TestIndexWriterThreadsToSegments$2.run(TestIndexWriterThreadsToSegments.java:221)Throwable
#2: com.carrotsearch.randomizedtesting.UncaughtExceptionError: Captured an uncaught exception
in thread: Thread[id=305, name=Thread-233, state=RUNNABLE, group=TGRP-TestIndexWriterThreadsToSegments]
   [junit4]    > Caused by: java.lang.RuntimeException: java.util.concurrent.BrokenBarrierException
   [junit4]    > 	at __randomizedtesting.SeedInfo.seed([5373C01FEEF4F0D6]:0)
   [junit4]    > 	at org.apache.lucene.index.TestIndexWriterThreadsToSegments$2.run(TestIndexWriterThreadsToSegments.java:224)
   [junit4]    > Caused by: java.util.concurrent.BrokenBarrierException
   [junit4]    > 	at java.util.concurrent.CyclicBarrier.dowait(CyclicBarrier.java:243)
   [junit4]    > 	at java.util.concurrent.CyclicBarrier.await(CyclicBarrier.java:355)
   [junit4]    > 	at org.apache.lucene.index.TestIndexWriterThreadsToSegments$2.run(TestIndexWriterThreadsToSegments.java:221)Throwable
#3: com.carrotsearch.randomizedtesting.UncaughtExceptionError: Captured an uncaught exception
in thread: Thread[id=304, name=Thread-232, state=RUNNABLE, group=TGRP-TestIndexWriterThreadsToSegments]
   [junit4]    > Caused by: java.lang.RuntimeException: java.util.concurrent.BrokenBarrierException
   [junit4]    > 	at __randomizedtesting.SeedInfo.seed([5373C01FEEF4F0D6]:0)
   [junit4]    > 	at org.apache.lucene.index.TestIndexWriterThreadsToSegments$2.run(TestIndexWriterThreadsToSegments.java:224)
   [junit4]    > Caused by: java.util.concurrent.BrokenBarrierException
   [junit4]    > 	at java.util.concurrent.CyclicBarrier.dowait(CyclicBarrier.java:243)
   [junit4]    > 	at java.util.concurrent.CyclicBarrier.await(CyclicBarrier.java:355)
   [junit4]    > 	at org.apache.lucene.index.TestIndexWriterThreadsToSegments$2.run(TestIndexWriterThreadsToSegments.java:221)Throwable
#4: com.carrotsearch.randomizedtesting.UncaughtExceptionError: Captured an uncaught exception
in thread: Thread[id=301, name=Thread-229, state=RUNNABLE, group=TGRP-TestIndexWriterThreadsToSegments]
   [junit4]    > Caused by: java.lang.RuntimeException: java.util.concurrent.BrokenBarrierException
   [junit4]    > 	at __randomizedtesting.SeedInfo.seed([5373C01FEEF4F0D6]:0)
   [junit4]    > 	at org.apache.lucene.index.TestIndexWriterThreadsToSegments$2.run(TestIndexWriterThreadsToSegments.java:224)
   [junit4]    > Caused by: java.util.concurrent.BrokenBarrierException
   [junit4]    > 	at java.util.concurrent.CyclicBarrier.dowait(CyclicBarrier.java:243)
   [junit4]    > 	at java.util.concurrent.CyclicBarrier.await(CyclicBarrier.java:355)
   [junit4]    > 	at org.apache.lucene.index.TestIndexWriterThreadsToSegments$2.run(TestIndexWriterThreadsToSegments.java:221)Throwable
#5: com.carrotsearch.randomizedtesting.UncaughtExceptionError: Captured an uncaught exception
in thread: Thread[id=302, name=Thread-230, state=RUNNABLE, group=TGRP-TestIndexWriterThreadsToSegments]
   [junit4]    > Caused by: java.lang.RuntimeException: java.util.concurrent.BrokenBarrierException
   [junit4]    > 	at __randomizedtesting.SeedInfo.seed([5373C01FEEF4F0D6]:0)
   [junit4]    > 	at org.apache.lucene.index.TestIndexWriterThreadsToSegments$2.run(TestIndexWriterThreadsToSegments.java:224)
   [junit4]    > Caused by: java.util.concurrent.BrokenBarrierException
   [junit4]    > 	at java.util.concurrent.CyclicBarrier.dowait(CyclicBarrier.java:243)
   [junit4]    > 	at java.util.concurrent.CyclicBarrier.await(CyclicBarrier.java:355)
   [junit4]    > 	at org.apache.lucene.index.TestIndexWriterThreadsToSegments$2.run(TestIndexWriterThreadsToSegments.java:221)Throwable
#6: com.carrotsearch.randomizedtesting.UncaughtExceptionError: Captured an uncaught exception
in thread: Thread[id=300, name=Thread-228, state=RUNNABLE, group=TGRP-TestIndexWriterThreadsToSegments]
   [junit4]    > Caused by: java.lang.RuntimeException: java.util.concurrent.BrokenBarrierException
   [junit4]    > 	at __randomizedtesting.SeedInfo.seed([5373C01FEEF4F0D6]:0)
   [junit4]    > 	at org.apache.lucene.index.TestIndexWriterThreadsToSegments$2.run(TestIndexWriterThreadsToSegments.java:224)
   [junit4]    > Caused by: java.util.concurrent.BrokenBarrierException
   [junit4]    > 	at java.util.concurrent.CyclicBarrier.dowait(CyclicBarrier.java:243)
   [junit4]    > 	at java.util.concurrent.CyclicBarrier.await(CyclicBarrier.java:355)
   [junit4]    > 	at org.apache.lucene.index.TestIndexWriterThreadsToSegments$2.run(TestIndexWriterThreadsToSegments.java:221)Throwable
#7: com.carrotsearch.randomizedtesting.UncaughtExceptionError: Captured an uncaught exception
in thread: Thread[id=306, name=Thread-234, state=RUNNABLE, group=TGRP-TestIndexWriterThreadsToSegments]
   [junit4]    > Caused by: java.lang.RuntimeException: java.util.concurrent.BrokenBarrierException
   [junit4]    > 	at __randomizedtesting.SeedInfo.seed([5373C01FEEF4F0D6]:0)
   [junit4]    > 	at org.apache.lucene.index.TestIndexWriterThreadsToSegments$2.run(TestIndexWriterThreadsToSegments.java:224)
   [junit4]    > Caused by: java.util.concurrent.BrokenBarrierException
   [junit4]    > 	at java.util.concurrent.CyclicBarrier.dowait(CyclicBarrier.java:243)
   [junit4]    > 	at java.util.concurrent.CyclicBarrier.await(CyclicBarrier.java:355)
   [junit4]    > 	at org.apache.lucene.index.TestIndexWriterThreadsToSegments$2.run(TestIndexWriterThreadsToSegments.java:221)Throwable
#8: com.carrotsearch.randomizedtesting.UncaughtExceptionError: Captured an uncaught exception
in thread: Thread[id=298, name=Thread-226, state=RUNNABLE, group=TGRP-TestIndexWriterThreadsToSegments]
   [junit4]    > Caused by: java.lang.RuntimeException: java.util.concurrent.BrokenBarrierException
   [junit4]    > 	at __randomizedtesting.SeedInfo.seed([5373C01FEEF4F0D6]:0)
   [junit4]    > 	at org.apache.lucene.index.TestIndexWriterThreadsToSegments$2.run(TestIndexWriterThreadsToSegments.java:224)
   [junit4]    > Caused by: java.util.concurrent.BrokenBarrierException
   [junit4]    > 	at java.util.concurrent.CyclicBarrier.dowait(CyclicBarrier.java:243)
   [junit4]    > 	at java.util.concurrent.CyclicBarrier.await(CyclicBarrier.java:355)
   [junit4]    > 	at org.apache.lucene.index.TestIndexWriterThreadsToSegments$2.run(TestIndexWriterThreadsToSegments.java:221)Throwable
#9: com.carrotsearch.randomizedtesting.UncaughtExceptionError: Captured an uncaught exception
in thread: Thread[id=299, name=Thread-227, state=RUNNABLE, group=TGRP-TestIndexWriterThreadsToSegments]
   [junit4]    > Caused by: java.lang.RuntimeException: java.util.concurrent.BrokenBarrierException
   [junit4]    > 	at __randomizedtesting.SeedInfo.seed([5373C01FEEF4F0D6]:0)
   [junit4]    > 	at org.apache.lucene.index.TestIndexWriterThreadsToSegments$2.run(TestIndexWriterThreadsToSegments.java:224)
   [junit4]    > Caused by: java.util.concurrent.BrokenBarrierException
   [junit4]    > 	at java.util.concurrent.CyclicBarrier.dowait(CyclicBarrier.java:243)
   [junit4]    > 	at java.util.concurrent.CyclicBarrier.await(CyclicBarrier.java:355)
   [junit4]    > 	at org.apache.lucene.index.TestIndexWriterThreadsToSegments$2.run(TestIndexWriterThreadsToSegments.java:221)Throwable
#10: com.carrotsearch.randomizedtesting.UncaughtExceptionError: Captured an uncaught exception
in thread: Thread[id=303, name=Thread-231, state=RUNNABLE, group=TGRP-TestIndexWriterThreadsToSegments]
   [junit4]    > Caused by: java.lang.RuntimeException: java.util.concurrent.BrokenBarrierException
   [junit4]    > 	at __randomizedtesting.SeedInfo.seed([5373C01FEEF4F0D6]:0)
   [junit4]    > 	at org.apache.lucene.index.TestIndexWriterThreadsToSegments$2.run(TestIndexWriterThreadsToSegments.java:224)
   [junit4]    > Caused by: java.util.concurrent.BrokenBarrierException
   [junit4]    > 	at java.util.concurrent.CyclicBarrier.dowait(CyclicBarrier.java:243)
   [junit4]    > 	at java.util.concurrent.CyclicBarrier.await(CyclicBarrier.java:355)
   [junit4]    > 	at org.apache.lucene.index.TestIndexWriterThreadsToSegments$2.run(TestIndexWriterThreadsToSegments.java:221)
   [junit4]   2> NOTE: test params are: codec=Lucene46: {field=PostingsFormat(name=Memory
doPackFST= false)}, docValues:{}, sim=RandomSimilarityProvider(queryNorm=false,coord=yes):
{field=DFR GL3(800.0)}, locale=sr_RS, timezone=America/Monterrey
   [junit4]   2> NOTE: Linux 3.2.0-26-generic amd64/Oracle Corporation 1.7.0_25 (64-bit)/cpus=8,threads=1,free=246490792,total=260243456
   [junit4]   2> NOTE: All tests run in this JVM: [TestTermVectorsReader, TestSegmentTermEnum,
TestConstantScoreQuery, TestNRTThreads, TestSentinelIntSet, TestIsCurrent, TestMockDirectoryWrapper,
TestLiveFieldValues, TestLucene41StoredFieldsFormat, TestBlockPostingsFormat2, TestNIOFSDirectory,
TestIdentityHashSet, TestDoc, TestLucene3xStoredFieldsFormat, TestDocumentsWriterStallControl,
TestPerFieldPostingsFormat, TestLucene45DocValuesFormat, TestAutomatonQuery, TestDocTermOrds,
TestPayloadTermQuery, Test2BSortedDocValues, TestFlushByRamOrCountsPolicy, TestReusableStringReader,
TestOmitPositions, TestIndexWriterThreadsToSegments]
   [junit4]   2> NOTE: reproduce with: ant test  -Dtestcase=TestIndexWriterThreadsToSegments
-Dtests.seed=5373C01FEEF4F0D6 -Dtests.slow=true -Dtests.locale=sr_RS -Dtests.timezone=America/Monterrey
-Dtests.file.encoding=UTF-8
   [junit4] ERROR   0.00s J2 | TestIndexWriterThreadsToSegments (suite) <<<
   [junit4]    > Throwable #1: java.lang.AssertionError: The test or suite printed 18316
bytes to stdout and stderr, even though the limit was set to 8192 bytes. Increase the limit
with @Limit, ignore it completely with @SuppressSysoutChecks or run with -Dtests.verbose=true
   [junit4]    > 	at __randomizedtesting.SeedInfo.seed([5373C01FEEF4F0D6]:0)
   [junit4]    > 	at java.lang.Thread.run(Thread.java:724)
   [junit4] Completed on J2 in 56.03s, 4 tests, 1 failure, 1 error <<< FAILURES!

[...truncated 747 lines...]
BUILD FAILED
/var/lib/jenkins/workspace/Lucene-4x-Linux-Java7-64-test-only/checkout/lucene/build.xml:49:
The following error occurred while executing this line:
/var/lib/jenkins/workspace/Lucene-4x-Linux-Java7-64-test-only/checkout/lucene/common-build.xml:1297:
The following error occurred while executing this line:
/var/lib/jenkins/workspace/Lucene-4x-Linux-Java7-64-test-only/checkout/lucene/common-build.xml:921:
There were test failures: 404 suites, 3143 tests, 1 suite-level error, 1 error, 99 ignored
(89 assumptions)

Total time: 6 minutes 5 seconds
Build step 'Invoke Ant' marked build as failure
Recording test results
Email was triggered for: Failure
Sending email for trigger: Failure



Mime
View raw message