lucene-dev mailing list archives

Site index · List index
Message view « Date » · « Thread »
Top « Date » · « Thread »
From buil...@flonkings.com
Subject [JENKINS] Lucene-4x-Linux-Java7-64-test-only - Build # 21326 - Still Failing!
Date Mon, 12 May 2014 20:58:42 GMT
Build: builds.flonkings.com/job/Lucene-4x-Linux-Java7-64-test-only/21326/

1 tests failed.
FAILED:  org.apache.lucene.index.TestTieredMergePolicy.testUnbalancedMergeSelection

Error Message:
got numDocs=8200

Stack Trace:
java.lang.AssertionError: got numDocs=8200
	at __randomizedtesting.SeedInfo.seed([455D63A09C3AA35D:E130D6170EC6BFAC]:0)
	at org.junit.Assert.fail(Assert.java:93)
	at org.junit.Assert.assertTrue(Assert.java:43)
	at org.apache.lucene.index.TestTieredMergePolicy.testUnbalancedMergeSelection(TestTieredMergePolicy.java:235)
	at sun.reflect.NativeMethodAccessorImpl.invoke0(Native Method)
	at sun.reflect.NativeMethodAccessorImpl.invoke(NativeMethodAccessorImpl.java:57)
	at sun.reflect.DelegatingMethodAccessorImpl.invoke(DelegatingMethodAccessorImpl.java:43)
	at java.lang.reflect.Method.invoke(Method.java:606)
	at com.carrotsearch.randomizedtesting.RandomizedRunner.invoke(RandomizedRunner.java:1618)
	at com.carrotsearch.randomizedtesting.RandomizedRunner$6.evaluate(RandomizedRunner.java:827)
	at com.carrotsearch.randomizedtesting.RandomizedRunner$7.evaluate(RandomizedRunner.java:863)
	at com.carrotsearch.randomizedtesting.RandomizedRunner$8.evaluate(RandomizedRunner.java:877)
	at org.apache.lucene.util.TestRuleSetupTeardownChained$1.evaluate(TestRuleSetupTeardownChained.java:50)
	at org.apache.lucene.util.TestRuleFieldCacheSanity$1.evaluate(TestRuleFieldCacheSanity.java:51)
	at org.apache.lucene.util.AbstractBeforeAfterRule$1.evaluate(AbstractBeforeAfterRule.java:46)
	at com.carrotsearch.randomizedtesting.rules.SystemPropertiesInvariantRule$1.evaluate(SystemPropertiesInvariantRule.java:55)
	at org.apache.lucene.util.TestRuleThreadAndTestName$1.evaluate(TestRuleThreadAndTestName.java:49)
	at org.apache.lucene.util.TestRuleIgnoreAfterMaxFailures$1.evaluate(TestRuleIgnoreAfterMaxFailures.java:65)
	at org.apache.lucene.util.TestRuleMarkFailure$1.evaluate(TestRuleMarkFailure.java:48)
	at com.carrotsearch.randomizedtesting.rules.StatementAdapter.evaluate(StatementAdapter.java:36)
	at com.carrotsearch.randomizedtesting.ThreadLeakControl$StatementRunner.run(ThreadLeakControl.java:360)
	at com.carrotsearch.randomizedtesting.ThreadLeakControl.forkTimeoutingTask(ThreadLeakControl.java:793)
	at com.carrotsearch.randomizedtesting.ThreadLeakControl$3.evaluate(ThreadLeakControl.java:453)
	at com.carrotsearch.randomizedtesting.RandomizedRunner.runSingleTest(RandomizedRunner.java:836)
	at com.carrotsearch.randomizedtesting.RandomizedRunner$3.evaluate(RandomizedRunner.java:738)
	at com.carrotsearch.randomizedtesting.RandomizedRunner$4.evaluate(RandomizedRunner.java:772)
	at com.carrotsearch.randomizedtesting.RandomizedRunner$5.evaluate(RandomizedRunner.java:783)
	at org.apache.lucene.util.AbstractBeforeAfterRule$1.evaluate(AbstractBeforeAfterRule.java:46)
	at org.apache.lucene.util.TestRuleStoreClassName$1.evaluate(TestRuleStoreClassName.java:42)
	at com.carrotsearch.randomizedtesting.rules.SystemPropertiesInvariantRule$1.evaluate(SystemPropertiesInvariantRule.java:55)
	at com.carrotsearch.randomizedtesting.rules.NoShadowingOrOverridesOnMethodsRule$1.evaluate(NoShadowingOrOverridesOnMethodsRule.java:39)
	at com.carrotsearch.randomizedtesting.rules.NoShadowingOrOverridesOnMethodsRule$1.evaluate(NoShadowingOrOverridesOnMethodsRule.java:39)
	at com.carrotsearch.randomizedtesting.rules.StatementAdapter.evaluate(StatementAdapter.java:36)
	at com.carrotsearch.randomizedtesting.rules.StatementAdapter.evaluate(StatementAdapter.java:36)
	at com.carrotsearch.randomizedtesting.rules.StatementAdapter.evaluate(StatementAdapter.java:36)
	at org.apache.lucene.util.TestRuleAssertionsRequired$1.evaluate(TestRuleAssertionsRequired.java:43)
	at org.apache.lucene.util.TestRuleMarkFailure$1.evaluate(TestRuleMarkFailure.java:48)
	at org.apache.lucene.util.TestRuleIgnoreAfterMaxFailures$1.evaluate(TestRuleIgnoreAfterMaxFailures.java:65)
	at org.apache.lucene.util.TestRuleIgnoreTestSuites$1.evaluate(TestRuleIgnoreTestSuites.java:55)
	at com.carrotsearch.randomizedtesting.rules.StatementAdapter.evaluate(StatementAdapter.java:36)
	at com.carrotsearch.randomizedtesting.ThreadLeakControl$StatementRunner.run(ThreadLeakControl.java:360)
	at java.lang.Thread.run(Thread.java:724)




Build Log:
[...truncated 428 lines...]
   [junit4] Suite: org.apache.lucene.index.TestTieredMergePolicy
   [junit4]   2> NOTE: reproduce with: ant test  -Dtestcase=TestTieredMergePolicy -Dtests.method=testUnbalancedMergeSelection
-Dtests.seed=455D63A09C3AA35D -Dtests.slow=true -Dtests.locale=nl_BE -Dtests.timezone=America/Bahia_Banderas
-Dtests.file.encoding=US-ASCII
   [junit4] FAILURE 19.4s J1 | TestTieredMergePolicy.testUnbalancedMergeSelection <<<
   [junit4]    > Throwable #1: java.lang.AssertionError: got numDocs=8200
   [junit4]    > 	at __randomizedtesting.SeedInfo.seed([455D63A09C3AA35D:E130D6170EC6BFAC]:0)
   [junit4]    > 	at org.apache.lucene.index.TestTieredMergePolicy.testUnbalancedMergeSelection(TestTieredMergePolicy.java:235)
   [junit4]    > 	at java.lang.Thread.run(Thread.java:724)
   [junit4]   2> NOTE: leaving temporary files on disk at: /var/lib/jenkins/workspace/Lucene-4x-Linux-Java7-64-test-only/checkout/lucene/build/core/test/J1/./lucene.index.TestTieredMergePolicy-455D63A09C3AA35D-001
   [junit4]   2> NOTE: test params are: codec=Lucene42, sim=DefaultSimilarity, locale=nl_BE,
timezone=America/Bahia_Banderas
   [junit4]   2> NOTE: Linux 3.2.0-26-generic amd64/Oracle Corporation 1.7.0_25 (64-bit)/cpus=8,threads=1,free=179383664,total=247529472
   [junit4]   2> NOTE: All tests run in this JVM: [TestIndexWriterConfig, TestNumericRangeQuery32,
Nested, TestRollback, TestByteArrayDataInput, TestParallelCompositeReader, TestQueryRescorer,
TestIndexWriterCommit, TestLazyProxSkipping, TestPrefixQuery, TestCharTermAttributeImpl, TestCachingTokenFilter,
TestFieldCacheTermsFilter, TestTieredMergePolicy]
   [junit4] Completed on J1 in 25.68s, 6 tests, 1 failure <<< FAILURES!

[...truncated 1159 lines...]
BUILD FAILED
/var/lib/jenkins/workspace/Lucene-4x-Linux-Java7-64-test-only/checkout/lucene/build.xml:49:
The following error occurred while executing this line:
/var/lib/jenkins/workspace/Lucene-4x-Linux-Java7-64-test-only/checkout/lucene/common-build.xml:1297:
The following error occurred while executing this line:
/var/lib/jenkins/workspace/Lucene-4x-Linux-Java7-64-test-only/checkout/lucene/common-build.xml:921:
There were test failures: 404 suites, 3143 tests, 1 failure, 128 ignored (118 assumptions)

Total time: 5 minutes 44 seconds
Build step 'Invoke Ant' marked build as failure
Recording test results
Email was triggered for: Failure
Sending email for trigger: Failure



Mime
View raw message