lucene-dev mailing list archives

Site index · List index
Message view « Date » · « Thread »
Top « Date » · « Thread »
From buil...@flonkings.com
Subject [JENKINS] Lucene-trunk-Linux-Java7-64-test-only - Build # 85005 - Still Failing!
Date Mon, 12 May 2014 21:23:02 GMT
Build: builds.flonkings.com/job/Lucene-trunk-Linux-Java7-64-test-only/85005/

1 tests failed.
FAILED:  org.apache.lucene.index.TestTieredMergePolicy.testUnbalancedMergeSelection

Error Message:
got numDocs=7300

Stack Trace:
java.lang.AssertionError: got numDocs=7300
	at __randomizedtesting.SeedInfo.seed([B24A22B56C9F59FE:16279702FE63450F]:0)
	at org.junit.Assert.fail(Assert.java:93)
	at org.junit.Assert.assertTrue(Assert.java:43)
	at org.apache.lucene.index.TestTieredMergePolicy.testUnbalancedMergeSelection(TestTieredMergePolicy.java:235)
	at sun.reflect.NativeMethodAccessorImpl.invoke0(Native Method)
	at sun.reflect.NativeMethodAccessorImpl.invoke(NativeMethodAccessorImpl.java:57)
	at sun.reflect.DelegatingMethodAccessorImpl.invoke(DelegatingMethodAccessorImpl.java:43)
	at java.lang.reflect.Method.invoke(Method.java:606)
	at com.carrotsearch.randomizedtesting.RandomizedRunner.invoke(RandomizedRunner.java:1618)
	at com.carrotsearch.randomizedtesting.RandomizedRunner$6.evaluate(RandomizedRunner.java:827)
	at com.carrotsearch.randomizedtesting.RandomizedRunner$7.evaluate(RandomizedRunner.java:863)
	at com.carrotsearch.randomizedtesting.RandomizedRunner$8.evaluate(RandomizedRunner.java:877)
	at org.apache.lucene.util.TestRuleSetupTeardownChained$1.evaluate(TestRuleSetupTeardownChained.java:50)
	at org.apache.lucene.util.TestRuleFieldCacheSanity$1.evaluate(TestRuleFieldCacheSanity.java:51)
	at org.apache.lucene.util.AbstractBeforeAfterRule$1.evaluate(AbstractBeforeAfterRule.java:46)
	at com.carrotsearch.randomizedtesting.rules.SystemPropertiesInvariantRule$1.evaluate(SystemPropertiesInvariantRule.java:55)
	at org.apache.lucene.util.TestRuleThreadAndTestName$1.evaluate(TestRuleThreadAndTestName.java:49)
	at org.apache.lucene.util.TestRuleIgnoreAfterMaxFailures$1.evaluate(TestRuleIgnoreAfterMaxFailures.java:65)
	at org.apache.lucene.util.TestRuleMarkFailure$1.evaluate(TestRuleMarkFailure.java:48)
	at com.carrotsearch.randomizedtesting.rules.StatementAdapter.evaluate(StatementAdapter.java:36)
	at com.carrotsearch.randomizedtesting.ThreadLeakControl$StatementRunner.run(ThreadLeakControl.java:360)
	at com.carrotsearch.randomizedtesting.ThreadLeakControl.forkTimeoutingTask(ThreadLeakControl.java:793)
	at com.carrotsearch.randomizedtesting.ThreadLeakControl$3.evaluate(ThreadLeakControl.java:453)
	at com.carrotsearch.randomizedtesting.RandomizedRunner.runSingleTest(RandomizedRunner.java:836)
	at com.carrotsearch.randomizedtesting.RandomizedRunner$3.evaluate(RandomizedRunner.java:738)
	at com.carrotsearch.randomizedtesting.RandomizedRunner$4.evaluate(RandomizedRunner.java:772)
	at com.carrotsearch.randomizedtesting.RandomizedRunner$5.evaluate(RandomizedRunner.java:783)
	at org.apache.lucene.util.AbstractBeforeAfterRule$1.evaluate(AbstractBeforeAfterRule.java:46)
	at org.apache.lucene.util.TestRuleStoreClassName$1.evaluate(TestRuleStoreClassName.java:42)
	at com.carrotsearch.randomizedtesting.rules.SystemPropertiesInvariantRule$1.evaluate(SystemPropertiesInvariantRule.java:55)
	at com.carrotsearch.randomizedtesting.rules.NoShadowingOrOverridesOnMethodsRule$1.evaluate(NoShadowingOrOverridesOnMethodsRule.java:39)
	at com.carrotsearch.randomizedtesting.rules.NoShadowingOrOverridesOnMethodsRule$1.evaluate(NoShadowingOrOverridesOnMethodsRule.java:39)
	at com.carrotsearch.randomizedtesting.rules.StatementAdapter.evaluate(StatementAdapter.java:36)
	at com.carrotsearch.randomizedtesting.rules.StatementAdapter.evaluate(StatementAdapter.java:36)
	at com.carrotsearch.randomizedtesting.rules.StatementAdapter.evaluate(StatementAdapter.java:36)
	at org.apache.lucene.util.TestRuleAssertionsRequired$1.evaluate(TestRuleAssertionsRequired.java:43)
	at org.apache.lucene.util.TestRuleMarkFailure$1.evaluate(TestRuleMarkFailure.java:48)
	at org.apache.lucene.util.TestRuleIgnoreAfterMaxFailures$1.evaluate(TestRuleIgnoreAfterMaxFailures.java:65)
	at org.apache.lucene.util.TestRuleIgnoreTestSuites$1.evaluate(TestRuleIgnoreTestSuites.java:55)
	at com.carrotsearch.randomizedtesting.rules.StatementAdapter.evaluate(StatementAdapter.java:36)
	at com.carrotsearch.randomizedtesting.ThreadLeakControl$StatementRunner.run(ThreadLeakControl.java:360)
	at java.lang.Thread.run(Thread.java:724)




Build Log:
[...truncated 1050 lines...]
   [junit4] Suite: org.apache.lucene.index.TestTieredMergePolicy
   [junit4]   2> NOTE: reproduce with: ant test  -Dtestcase=TestTieredMergePolicy -Dtests.method=testUnbalancedMergeSelection
-Dtests.seed=B24A22B56C9F59FE -Dtests.slow=true -Dtests.locale=es_GT -Dtests.timezone=America/North_Dakota/Beulah
-Dtests.file.encoding=UTF-8
   [junit4] FAILURE 24.7s J6 | TestTieredMergePolicy.testUnbalancedMergeSelection <<<
   [junit4]    > Throwable #1: java.lang.AssertionError: got numDocs=7300
   [junit4]    > 	at __randomizedtesting.SeedInfo.seed([B24A22B56C9F59FE:16279702FE63450F]:0)
   [junit4]    > 	at org.apache.lucene.index.TestTieredMergePolicy.testUnbalancedMergeSelection(TestTieredMergePolicy.java:235)
   [junit4]    > 	at java.lang.Thread.run(Thread.java:724)
   [junit4]   2> NOTE: leaving temporary files on disk at: /var/lib/jenkins/workspace/Lucene-trunk-Linux-Java7-64-test-only/checkout/lucene/build/core/test/J6/./lucene.index.TestTieredMergePolicy-B24A22B56C9F59FE-001
   [junit4]   2> NOTE: test params are: codec=Lucene46: {content=PostingsFormat(name=Memory
doPackFST= false), id=Pulsing41(freqCutoff=2 minBlockSize=21 maxBlockSize=113)}, docValues:{},
sim=RandomSimilarityProvider(queryNorm=true,coord=no): {content=DFR I(ne)2}, locale=es_GT,
timezone=America/North_Dakota/Beulah
   [junit4]   2> NOTE: Linux 3.2.0-26-generic amd64/Oracle Corporation 1.7.0_25 (64-bit)/cpus=8,threads=1,free=150392336,total=263258112
   [junit4]   2> NOTE: All tests run in this JVM: [TestCompressingStoredFieldsFormat, TestUnicodeUtil,
TestTerm, TestBytesRefHash, TestIndexWriterExceptions, TestBytesRefArray, TestDoubleBarrelLRUCache,
TestDocIdBitSet, TestPrefixRandom, TestTermsEnum, TestSubScorerFreqs, TestBooleanScorer, TestIndexWriterOutOfFileDescriptors,
TestPrefixCodedTerms, TestFlex, TestUTF32ToUTF8, TestDateSort, TestBasics, TestTransactions,
TestPriorityQueue, TestSloppyPhraseQuery2, TestEarlyTermination, TestMatchAllDocsQuery, TestNumericUtils,
TestSetOnce, TestMultiMMap, TestRollingUpdates, TestTieredMergePolicy]
   [junit4] Completed on J6 in 32.98s, 6 tests, 1 failure <<< FAILURES!

[...truncated 451 lines...]
BUILD FAILED
/var/lib/jenkins/workspace/Lucene-trunk-Linux-Java7-64-test-only/checkout/lucene/build.xml:49:
The following error occurred while executing this line:
/var/lib/jenkins/workspace/Lucene-trunk-Linux-Java7-64-test-only/checkout/lucene/common-build.xml:1296:
The following error occurred while executing this line:
/var/lib/jenkins/workspace/Lucene-trunk-Linux-Java7-64-test-only/checkout/lucene/common-build.xml:920:
There were test failures: 396 suites, 3092 tests, 1 failure, 96 ignored (86 assumptions)

Total time: 6 minutes 34 seconds
Build step 'Invoke Ant' marked build as failure
Archiving artifacts
Recording test results
Email was triggered for: Failure
Sending email for trigger: Failure



Mime
View raw message