lucene-dev mailing list archives

Site index · List index
Message view « Date » · « Thread »
Top « Date » · « Thread »
From Michael McCandless <luc...@mikemccandless.com>
Subject Re: [JENKINS] Lucene-4x-Linux-Java7-64-test-only - Build # 22242 - Still Failing!
Date Fri, 23 May 2014 11:52:37 GMT
Damned you flonkings!!  Already fixed.

Mike McCandless

http://blog.mikemccandless.com


On Fri, May 23, 2014 at 7:42 AM,  <builder@flonkings.com> wrote:
> Build: builds.flonkings.com/job/Lucene-4x-Linux-Java7-64-test-only/22242/
>
> 2 tests failed.
> FAILED:  org.apache.lucene.index.TestDirectoryReaderReopen.testNPEAfterInvalidReindex1
>
> Error Message:
> this codec cannot write docvalues
>
> Stack Trace:
> java.lang.UnsupportedOperationException: this codec cannot write docvalues
>         at __randomizedtesting.SeedInfo.seed([AC8F07BF2063CAF0:2E55FDF8785F7F62]:0)
>         at org.apache.lucene.codecs.lucene3x.Lucene3xCodec$1.fieldsConsumer(Lucene3xCodec.java:73)
>         at org.apache.lucene.index.DefaultIndexingChain.writeDocValues(DefaultIndexingChain.java:140)
>         at org.apache.lucene.index.DefaultIndexingChain.flush(DefaultIndexingChain.java:98)
>         at org.apache.lucene.index.DocumentsWriterPerThread.flush(DocumentsWriterPerThread.java:415)
>         at org.apache.lucene.index.DocumentsWriter.doFlush(DocumentsWriter.java:512)
>         at org.apache.lucene.index.DocumentsWriter.flushAllThreads(DocumentsWriter.java:622)
>         at org.apache.lucene.index.IndexWriter.prepareCommitInternal(IndexWriter.java:2898)
>         at org.apache.lucene.index.IndexWriter.commitInternal(IndexWriter.java:3057)
>         at org.apache.lucene.index.IndexWriter.commit(IndexWriter.java:3024)
>         at org.apache.lucene.index.TestDirectoryReaderReopen.testNPEAfterInvalidReindex1(TestDirectoryReaderReopen.java:726)
>         at sun.reflect.NativeMethodAccessorImpl.invoke0(Native Method)
>         at sun.reflect.NativeMethodAccessorImpl.invoke(NativeMethodAccessorImpl.java:57)
>         at sun.reflect.DelegatingMethodAccessorImpl.invoke(DelegatingMethodAccessorImpl.java:43)
>         at java.lang.reflect.Method.invoke(Method.java:606)
>         at com.carrotsearch.randomizedtesting.RandomizedRunner.invoke(RandomizedRunner.java:1618)
>         at com.carrotsearch.randomizedtesting.RandomizedRunner$6.evaluate(RandomizedRunner.java:827)
>         at com.carrotsearch.randomizedtesting.RandomizedRunner$7.evaluate(RandomizedRunner.java:863)
>         at com.carrotsearch.randomizedtesting.RandomizedRunner$8.evaluate(RandomizedRunner.java:877)
>         at org.apache.lucene.util.TestRuleSetupTeardownChained$1.evaluate(TestRuleSetupTeardownChained.java:50)
>         at org.apache.lucene.util.TestRuleFieldCacheSanity$1.evaluate(TestRuleFieldCacheSanity.java:51)
>         at org.apache.lucene.util.AbstractBeforeAfterRule$1.evaluate(AbstractBeforeAfterRule.java:46)
>         at com.carrotsearch.randomizedtesting.rules.SystemPropertiesInvariantRule$1.evaluate(SystemPropertiesInvariantRule.java:55)
>         at org.apache.lucene.util.TestRuleThreadAndTestName$1.evaluate(TestRuleThreadAndTestName.java:49)
>         at org.apache.lucene.util.TestRuleIgnoreAfterMaxFailures$1.evaluate(TestRuleIgnoreAfterMaxFailures.java:65)
>         at org.apache.lucene.util.TestRuleMarkFailure$1.evaluate(TestRuleMarkFailure.java:48)
>         at com.carrotsearch.randomizedtesting.rules.StatementAdapter.evaluate(StatementAdapter.java:36)
>         at com.carrotsearch.randomizedtesting.ThreadLeakControl$StatementRunner.run(ThreadLeakControl.java:360)
>         at com.carrotsearch.randomizedtesting.ThreadLeakControl.forkTimeoutingTask(ThreadLeakControl.java:793)
>         at com.carrotsearch.randomizedtesting.ThreadLeakControl$3.evaluate(ThreadLeakControl.java:453)
>         at com.carrotsearch.randomizedtesting.RandomizedRunner.runSingleTest(RandomizedRunner.java:836)
>         at com.carrotsearch.randomizedtesting.RandomizedRunner$3.evaluate(RandomizedRunner.java:738)
>         at com.carrotsearch.randomizedtesting.RandomizedRunner$4.evaluate(RandomizedRunner.java:772)
>         at com.carrotsearch.randomizedtesting.RandomizedRunner$5.evaluate(RandomizedRunner.java:783)
>         at org.apache.lucene.util.AbstractBeforeAfterRule$1.evaluate(AbstractBeforeAfterRule.java:46)
>         at org.apache.lucene.util.TestRuleStoreClassName$1.evaluate(TestRuleStoreClassName.java:42)
>         at com.carrotsearch.randomizedtesting.rules.SystemPropertiesInvariantRule$1.evaluate(SystemPropertiesInvariantRule.java:55)
>         at com.carrotsearch.randomizedtesting.rules.NoShadowingOrOverridesOnMethodsRule$1.evaluate(NoShadowingOrOverridesOnMethodsRule.java:39)
>         at com.carrotsearch.randomizedtesting.rules.NoShadowingOrOverridesOnMethodsRule$1.evaluate(NoShadowingOrOverridesOnMethodsRule.java:39)
>         at com.carrotsearch.randomizedtesting.rules.StatementAdapter.evaluate(StatementAdapter.java:36)
>         at com.carrotsearch.randomizedtesting.rules.StatementAdapter.evaluate(StatementAdapter.java:36)
>         at com.carrotsearch.randomizedtesting.rules.StatementAdapter.evaluate(StatementAdapter.java:36)
>         at org.apache.lucene.util.TestRuleAssertionsRequired$1.evaluate(TestRuleAssertionsRequired.java:43)
>         at org.apache.lucene.util.TestRuleMarkFailure$1.evaluate(TestRuleMarkFailure.java:48)
>         at org.apache.lucene.util.TestRuleIgnoreAfterMaxFailures$1.evaluate(TestRuleIgnoreAfterMaxFailures.java:65)
>         at org.apache.lucene.util.TestRuleIgnoreTestSuites$1.evaluate(TestRuleIgnoreTestSuites.java:55)
>         at com.carrotsearch.randomizedtesting.rules.StatementAdapter.evaluate(StatementAdapter.java:36)
>         at com.carrotsearch.randomizedtesting.ThreadLeakControl$StatementRunner.run(ThreadLeakControl.java:360)
>         at java.lang.Thread.run(Thread.java:745)
>
>
> FAILED:  org.apache.lucene.index.TestDirectoryReaderReopen.testNPEAfterInvalidReindex2
>
> Error Message:
> this codec cannot write docvalues
>
> Stack Trace:
> java.lang.UnsupportedOperationException: this codec cannot write docvalues
>         at __randomizedtesting.SeedInfo.seed([AC8F07BF2063CAF0:CEAC5BA0DCDDB131]:0)
>         at org.apache.lucene.codecs.lucene3x.Lucene3xCodec$1.fieldsConsumer(Lucene3xCodec.java:73)
>         at org.apache.lucene.index.DefaultIndexingChain.writeDocValues(DefaultIndexingChain.java:140)
>         at org.apache.lucene.index.DefaultIndexingChain.flush(DefaultIndexingChain.java:98)
>         at org.apache.lucene.index.DocumentsWriterPerThread.flush(DocumentsWriterPerThread.java:415)
>         at org.apache.lucene.index.DocumentsWriter.doFlush(DocumentsWriter.java:512)
>         at org.apache.lucene.index.DocumentsWriter.flushAllThreads(DocumentsWriter.java:622)
>         at org.apache.lucene.index.IndexWriter.prepareCommitInternal(IndexWriter.java:2898)
>         at org.apache.lucene.index.IndexWriter.commitInternal(IndexWriter.java:3057)
>         at org.apache.lucene.index.IndexWriter.commit(IndexWriter.java:3024)
>         at org.apache.lucene.index.TestDirectoryReaderReopen.testNPEAfterInvalidReindex2(TestDirectoryReaderReopen.java:773)
>         at sun.reflect.NativeMethodAccessorImpl.invoke0(Native Method)
>         at sun.reflect.NativeMethodAccessorImpl.invoke(NativeMethodAccessorImpl.java:57)
>         at sun.reflect.DelegatingMethodAccessorImpl.invoke(DelegatingMethodAccessorImpl.java:43)
>         at java.lang.reflect.Method.invoke(Method.java:606)
>         at com.carrotsearch.randomizedtesting.RandomizedRunner.invoke(RandomizedRunner.java:1618)
>         at com.carrotsearch.randomizedtesting.RandomizedRunner$6.evaluate(RandomizedRunner.java:827)
>         at com.carrotsearch.randomizedtesting.RandomizedRunner$7.evaluate(RandomizedRunner.java:863)
>         at com.carrotsearch.randomizedtesting.RandomizedRunner$8.evaluate(RandomizedRunner.java:877)
>         at org.apache.lucene.util.TestRuleSetupTeardownChained$1.evaluate(TestRuleSetupTeardownChained.java:50)
>         at org.apache.lucene.util.TestRuleFieldCacheSanity$1.evaluate(TestRuleFieldCacheSanity.java:51)
>         at org.apache.lucene.util.AbstractBeforeAfterRule$1.evaluate(AbstractBeforeAfterRule.java:46)
>         at com.carrotsearch.randomizedtesting.rules.SystemPropertiesInvariantRule$1.evaluate(SystemPropertiesInvariantRule.java:55)
>         at org.apache.lucene.util.TestRuleThreadAndTestName$1.evaluate(TestRuleThreadAndTestName.java:49)
>         at org.apache.lucene.util.TestRuleIgnoreAfterMaxFailures$1.evaluate(TestRuleIgnoreAfterMaxFailures.java:65)
>         at org.apache.lucene.util.TestRuleMarkFailure$1.evaluate(TestRuleMarkFailure.java:48)
>         at com.carrotsearch.randomizedtesting.rules.StatementAdapter.evaluate(StatementAdapter.java:36)
>         at com.carrotsearch.randomizedtesting.ThreadLeakControl$StatementRunner.run(ThreadLeakControl.java:360)
>         at com.carrotsearch.randomizedtesting.ThreadLeakControl.forkTimeoutingTask(ThreadLeakControl.java:793)
>         at com.carrotsearch.randomizedtesting.ThreadLeakControl$3.evaluate(ThreadLeakControl.java:453)
>         at com.carrotsearch.randomizedtesting.RandomizedRunner.runSingleTest(RandomizedRunner.java:836)
>         at com.carrotsearch.randomizedtesting.RandomizedRunner$3.evaluate(RandomizedRunner.java:738)
>         at com.carrotsearch.randomizedtesting.RandomizedRunner$4.evaluate(RandomizedRunner.java:772)
>         at com.carrotsearch.randomizedtesting.RandomizedRunner$5.evaluate(RandomizedRunner.java:783)
>         at org.apache.lucene.util.AbstractBeforeAfterRule$1.evaluate(AbstractBeforeAfterRule.java:46)
>         at org.apache.lucene.util.TestRuleStoreClassName$1.evaluate(TestRuleStoreClassName.java:42)
>         at com.carrotsearch.randomizedtesting.rules.SystemPropertiesInvariantRule$1.evaluate(SystemPropertiesInvariantRule.java:55)
>         at com.carrotsearch.randomizedtesting.rules.NoShadowingOrOverridesOnMethodsRule$1.evaluate(NoShadowingOrOverridesOnMethodsRule.java:39)
>         at com.carrotsearch.randomizedtesting.rules.NoShadowingOrOverridesOnMethodsRule$1.evaluate(NoShadowingOrOverridesOnMethodsRule.java:39)
>         at com.carrotsearch.randomizedtesting.rules.StatementAdapter.evaluate(StatementAdapter.java:36)
>         at com.carrotsearch.randomizedtesting.rules.StatementAdapter.evaluate(StatementAdapter.java:36)
>         at com.carrotsearch.randomizedtesting.rules.StatementAdapter.evaluate(StatementAdapter.java:36)
>         at org.apache.lucene.util.TestRuleAssertionsRequired$1.evaluate(TestRuleAssertionsRequired.java:43)
>         at org.apache.lucene.util.TestRuleMarkFailure$1.evaluate(TestRuleMarkFailure.java:48)
>         at org.apache.lucene.util.TestRuleIgnoreAfterMaxFailures$1.evaluate(TestRuleIgnoreAfterMaxFailures.java:65)
>         at org.apache.lucene.util.TestRuleIgnoreTestSuites$1.evaluate(TestRuleIgnoreTestSuites.java:55)
>         at com.carrotsearch.randomizedtesting.rules.StatementAdapter.evaluate(StatementAdapter.java:36)
>         at com.carrotsearch.randomizedtesting.ThreadLeakControl$StatementRunner.run(ThreadLeakControl.java:360)
>         at java.lang.Thread.run(Thread.java:745)
>
>
>
>
> Build Log:
> [...truncated 859 lines...]
>    [junit4] Suite: org.apache.lucene.index.TestDirectoryReaderReopen
>    [junit4]   2> NOTE: reproduce with: ant test  -Dtestcase=TestDirectoryReaderReopen
-Dtests.method=testNPEAfterInvalidReindex1 -Dtests.seed=AC8F07BF2063CAF0 -Dtests.slow=true
-Dtests.locale=es_UY -Dtests.timezone=Asia/Saigon -Dtests.file.encoding=US-ASCII
>    [junit4] ERROR   0.06s J7 | TestDirectoryReaderReopen.testNPEAfterInvalidReindex1
<<<
>    [junit4]    > Throwable #1: java.lang.UnsupportedOperationException: this codec
cannot write docvalues
>    [junit4]    >        at __randomizedtesting.SeedInfo.seed([AC8F07BF2063CAF0:2E55FDF8785F7F62]:0)
>    [junit4]    >        at org.apache.lucene.codecs.lucene3x.Lucene3xCodec$1.fieldsConsumer(Lucene3xCodec.java:73)
>    [junit4]    >        at org.apache.lucene.index.DefaultIndexingChain.writeDocValues(DefaultIndexingChain.java:140)
>    [junit4]    >        at org.apache.lucene.index.DefaultIndexingChain.flush(DefaultIndexingChain.java:98)
>    [junit4]    >        at org.apache.lucene.index.DocumentsWriterPerThread.flush(DocumentsWriterPerThread.java:415)
>    [junit4]    >        at org.apache.lucene.index.DocumentsWriter.doFlush(DocumentsWriter.java:512)
>    [junit4]    >        at org.apache.lucene.index.DocumentsWriter.flushAllThreads(DocumentsWriter.java:622)
>    [junit4]    >        at org.apache.lucene.index.IndexWriter.prepareCommitInternal(IndexWriter.java:2898)
>    [junit4]    >        at org.apache.lucene.index.IndexWriter.commitInternal(IndexWriter.java:3057)
>    [junit4]    >        at org.apache.lucene.index.IndexWriter.commit(IndexWriter.java:3024)
>    [junit4]    >        at org.apache.lucene.index.TestDirectoryReaderReopen.testNPEAfterInvalidReindex1(TestDirectoryReaderReopen.java:726)
>    [junit4]    >        at java.lang.Thread.run(Thread.java:745)
>    [junit4]   2> NOTE: reproduce with: ant test  -Dtestcase=TestDirectoryReaderReopen
-Dtests.method=testNPEAfterInvalidReindex2 -Dtests.seed=AC8F07BF2063CAF0 -Dtests.slow=true
-Dtests.locale=es_UY -Dtests.timezone=Asia/Saigon -Dtests.file.encoding=US-ASCII
>    [junit4] ERROR   0.10s J7 | TestDirectoryReaderReopen.testNPEAfterInvalidReindex2
<<<
>    [junit4]    > Throwable #1: java.lang.UnsupportedOperationException: this codec
cannot write docvalues
>    [junit4]    >        at __randomizedtesting.SeedInfo.seed([AC8F07BF2063CAF0:CEAC5BA0DCDDB131]:0)
>    [junit4]    >        at org.apache.lucene.codecs.lucene3x.Lucene3xCodec$1.fieldsConsumer(Lucene3xCodec.java:73)
>    [junit4]    >        at org.apache.lucene.index.DefaultIndexingChain.writeDocValues(DefaultIndexingChain.java:140)
>    [junit4]    >        at org.apache.lucene.index.DefaultIndexingChain.flush(DefaultIndexingChain.java:98)
>    [junit4]    >        at org.apache.lucene.index.DocumentsWriterPerThread.flush(DocumentsWriterPerThread.java:415)
>    [junit4]    >        at org.apache.lucene.index.DocumentsWriter.doFlush(DocumentsWriter.java:512)
>    [junit4]    >        at org.apache.lucene.index.DocumentsWriter.flushAllThreads(DocumentsWriter.java:622)
>    [junit4]    >        at org.apache.lucene.index.IndexWriter.prepareCommitInternal(IndexWriter.java:2898)
>    [junit4]    >        at org.apache.lucene.index.IndexWriter.commitInternal(IndexWriter.java:3057)
>    [junit4]    >        at org.apache.lucene.index.IndexWriter.commit(IndexWriter.java:3024)
>    [junit4]    >        at org.apache.lucene.index.TestDirectoryReaderReopen.testNPEAfterInvalidReindex2(TestDirectoryReaderReopen.java:773)
>    [junit4]    >        at java.lang.Thread.run(Thread.java:745)
>    [junit4]   2> NOTE: test params are: codec=Lucene3x, sim=RandomSimilarityProvider(queryNorm=true,coord=yes):
{id=IB SPL-L1, field2=DFR GB1, field4=DFR GB3(800.0), field1=DFR GL3(800.0), field3=DFR I(n)1},
locale=es_UY, timezone=Asia/Saigon
>    [junit4]   2> NOTE: Linux 3.2.0-26-generic amd64/Oracle Corporation 1.7.0_55 (64-bit)/cpus=8,threads=1,free=125930184,total=263192576
>    [junit4]   2> NOTE: All tests run in this JVM: [TestIndexWriterMerging, TestIndexCommit,
TestDocTermOrdsRangeFilter, TestPostingsOffsets, Test2BPostingsBytes, TestConstants, TestIndexWriterLockRelease,
TestWAH8DocIdSet, TestTermVectors, TestTermRangeFilter, TestOmitTf, TestLucene40StoredFieldsFormat,
TestEarlyTermination, TestIndexWriterForceMerge, TestMockAnalyzer, TestDeletionPolicy, TestTermVectorsWriter,
Test2BPostings, TestOfflineSorter, TestMockCharFilter, TestDocCount, TestMultiLevelSkipList,
TestBooleanQueryVisitSubscorers, TestNearSpansOrdered, TestCompiledAutomaton, TestBytesStore,
TestGraphTokenizers, TestSloppyPhraseQuery, TestStressAdvance, TestDirectoryReaderReopen]
>    [junit4] Completed on J7 in 5.26s, 9 tests, 2 errors <<< FAILURES!
>
> [...truncated 674 lines...]
> BUILD FAILED
> /var/lib/jenkins/workspace/Lucene-4x-Linux-Java7-64-test-only/checkout/lucene/build.xml:49:
The following error occurred while executing this line:
> /var/lib/jenkins/workspace/Lucene-4x-Linux-Java7-64-test-only/checkout/lucene/common-build.xml:1297:
The following error occurred while executing this line:
> /var/lib/jenkins/workspace/Lucene-4x-Linux-Java7-64-test-only/checkout/lucene/common-build.xml:921:
There were test failures: 405 suites, 3223 tests, 2 errors, 98 ignored (88 assumptions)
>
> Total time: 6 minutes 7 seconds
> Build step 'Invoke Ant' marked build as failure
> Recording test results
> Email was triggered for: Failure
> Sending email for trigger: Failure
>
>
>
>
> ---------------------------------------------------------------------
> To unsubscribe, e-mail: dev-unsubscribe@lucene.apache.org
> For additional commands, e-mail: dev-help@lucene.apache.org

---------------------------------------------------------------------
To unsubscribe, e-mail: dev-unsubscribe@lucene.apache.org
For additional commands, e-mail: dev-help@lucene.apache.org


Mime
View raw message