lucene-dev mailing list archives

Site index · List index
Message view « Date » · « Thread »
Top « Date » · « Thread »
From Michael McCandless <luc...@mikemccandless.com>
Subject Re: [JENKINS] Lucene-trunk-Linux-Java7-64-test-only - Build # 84999 - Still Failing!
Date Mon, 12 May 2014 20:05:42 GMT
I'll dig.

Mike McCandless

http://blog.mikemccandless.com


On Mon, May 12, 2014 at 3:43 PM,  <builder@flonkings.com> wrote:
> Build: builds.flonkings.com/job/Lucene-trunk-Linux-Java7-64-test-only/84999/
>
> 1 tests failed.
> FAILED:  org.apache.lucene.index.TestTieredMergePolicy.testUnbalancedMergeSelection
>
> Error Message:
> got numDocs=8200
>
> Stack Trace:
> java.lang.AssertionError: got numDocs=8200
>         at __randomizedtesting.SeedInfo.seed([3F03D45F61981F3C:9B6E61E8F36403CD]:0)
>         at org.junit.Assert.fail(Assert.java:93)
>         at org.junit.Assert.assertTrue(Assert.java:43)
>         at org.apache.lucene.index.TestTieredMergePolicy.testUnbalancedMergeSelection(TestTieredMergePolicy.java:235)
>         at sun.reflect.NativeMethodAccessorImpl.invoke0(Native Method)
>         at sun.reflect.NativeMethodAccessorImpl.invoke(NativeMethodAccessorImpl.java:57)
>         at sun.reflect.DelegatingMethodAccessorImpl.invoke(DelegatingMethodAccessorImpl.java:43)
>         at java.lang.reflect.Method.invoke(Method.java:606)
>         at com.carrotsearch.randomizedtesting.RandomizedRunner.invoke(RandomizedRunner.java:1618)
>         at com.carrotsearch.randomizedtesting.RandomizedRunner$6.evaluate(RandomizedRunner.java:827)
>         at com.carrotsearch.randomizedtesting.RandomizedRunner$7.evaluate(RandomizedRunner.java:863)
>         at com.carrotsearch.randomizedtesting.RandomizedRunner$8.evaluate(RandomizedRunner.java:877)
>         at org.apache.lucene.util.TestRuleSetupTeardownChained$1.evaluate(TestRuleSetupTeardownChained.java:50)
>         at org.apache.lucene.util.TestRuleFieldCacheSanity$1.evaluate(TestRuleFieldCacheSanity.java:51)
>         at org.apache.lucene.util.AbstractBeforeAfterRule$1.evaluate(AbstractBeforeAfterRule.java:46)
>         at com.carrotsearch.randomizedtesting.rules.SystemPropertiesInvariantRule$1.evaluate(SystemPropertiesInvariantRule.java:55)
>         at org.apache.lucene.util.TestRuleThreadAndTestName$1.evaluate(TestRuleThreadAndTestName.java:49)
>         at org.apache.lucene.util.TestRuleIgnoreAfterMaxFailures$1.evaluate(TestRuleIgnoreAfterMaxFailures.java:65)
>         at org.apache.lucene.util.TestRuleMarkFailure$1.evaluate(TestRuleMarkFailure.java:48)
>         at com.carrotsearch.randomizedtesting.rules.StatementAdapter.evaluate(StatementAdapter.java:36)
>         at com.carrotsearch.randomizedtesting.ThreadLeakControl$StatementRunner.run(ThreadLeakControl.java:360)
>         at com.carrotsearch.randomizedtesting.ThreadLeakControl.forkTimeoutingTask(ThreadLeakControl.java:793)
>         at com.carrotsearch.randomizedtesting.ThreadLeakControl$3.evaluate(ThreadLeakControl.java:453)
>         at com.carrotsearch.randomizedtesting.RandomizedRunner.runSingleTest(RandomizedRunner.java:836)
>         at com.carrotsearch.randomizedtesting.RandomizedRunner$3.evaluate(RandomizedRunner.java:738)
>         at com.carrotsearch.randomizedtesting.RandomizedRunner$4.evaluate(RandomizedRunner.java:772)
>         at com.carrotsearch.randomizedtesting.RandomizedRunner$5.evaluate(RandomizedRunner.java:783)
>         at org.apache.lucene.util.AbstractBeforeAfterRule$1.evaluate(AbstractBeforeAfterRule.java:46)
>         at org.apache.lucene.util.TestRuleStoreClassName$1.evaluate(TestRuleStoreClassName.java:42)
>         at com.carrotsearch.randomizedtesting.rules.SystemPropertiesInvariantRule$1.evaluate(SystemPropertiesInvariantRule.java:55)
>         at com.carrotsearch.randomizedtesting.rules.NoShadowingOrOverridesOnMethodsRule$1.evaluate(NoShadowingOrOverridesOnMethodsRule.java:39)
>         at com.carrotsearch.randomizedtesting.rules.NoShadowingOrOverridesOnMethodsRule$1.evaluate(NoShadowingOrOverridesOnMethodsRule.java:39)
>         at com.carrotsearch.randomizedtesting.rules.StatementAdapter.evaluate(StatementAdapter.java:36)
>         at com.carrotsearch.randomizedtesting.rules.StatementAdapter.evaluate(StatementAdapter.java:36)
>         at com.carrotsearch.randomizedtesting.rules.StatementAdapter.evaluate(StatementAdapter.java:36)
>         at org.apache.lucene.util.TestRuleAssertionsRequired$1.evaluate(TestRuleAssertionsRequired.java:43)
>         at org.apache.lucene.util.TestRuleMarkFailure$1.evaluate(TestRuleMarkFailure.java:48)
>         at org.apache.lucene.util.TestRuleIgnoreAfterMaxFailures$1.evaluate(TestRuleIgnoreAfterMaxFailures.java:65)
>         at org.apache.lucene.util.TestRuleIgnoreTestSuites$1.evaluate(TestRuleIgnoreTestSuites.java:55)
>         at com.carrotsearch.randomizedtesting.rules.StatementAdapter.evaluate(StatementAdapter.java:36)
>         at com.carrotsearch.randomizedtesting.ThreadLeakControl$StatementRunner.run(ThreadLeakControl.java:360)
>         at java.lang.Thread.run(Thread.java:724)
>
>
>
>
> Build Log:
> [...truncated 1101 lines...]
>    [junit4] Suite: org.apache.lucene.index.TestTieredMergePolicy
>    [junit4]   2> NOTE: reproduce with: ant test  -Dtestcase=TestTieredMergePolicy
-Dtests.method=testUnbalancedMergeSelection -Dtests.seed=3F03D45F61981F3C -Dtests.slow=true
-Dtests.locale=fr_CH -Dtests.timezone=EAT -Dtests.file.encoding=UTF-8
>    [junit4] FAILURE 23.1s J1 | TestTieredMergePolicy.testUnbalancedMergeSelection <<<
>    [junit4]    > Throwable #1: java.lang.AssertionError: got numDocs=8200
>    [junit4]    >        at __randomizedtesting.SeedInfo.seed([3F03D45F61981F3C:9B6E61E8F36403CD]:0)
>    [junit4]    >        at org.apache.lucene.index.TestTieredMergePolicy.testUnbalancedMergeSelection(TestTieredMergePolicy.java:235)
>    [junit4]    >        at java.lang.Thread.run(Thread.java:724)
>    [junit4]   2> NOTE: test params are: codec=Lucene42, sim=RandomSimilarityProvider(queryNorm=true,coord=no):
{content=DFR I(ne)2}, locale=fr_CH, timezone=EAT
>    [junit4]   2> NOTE: Linux 3.2.0-26-generic amd64/Oracle Corporation 1.7.0_25 (64-bit)/cpus=8,threads=1,free=76014072,total=164626432
>    [junit4]   2> NOTE: All tests run in this JVM: [TestIndexWriterMergePolicy, TestPrefixQuery,
TestDirectory, TestSpecialOperations, TestMinShouldMatch2, TestFieldCacheTermsFilter, TestIndexWriterExceptions2,
TestLock, TestPositionIncrement, TestFilterDirectory, TestByteArrayDataInput, TestFilterIterator,
TestIndexWriterConfig, TestCodecHoldsOpenFiles, TestMathUtil, TestCloseableThreadLocal, TestLazyProxSkipping,
TestMultiFields, TestSortRescorer, TestCollectionUtil, TestMultiTermConstantScore, TestParallelCompositeReader,
TestIndexWriterCommit, TestMinimize, TestMultiMMap, TestCompoundFile, TestTieredMergePolicy]
>    [junit4] Completed on J1 in 28.33s, 6 tests, 1 failure <<< FAILURES!
>
> [...truncated 451 lines...]
> BUILD FAILED
> /var/lib/jenkins/workspace/Lucene-trunk-Linux-Java7-64-test-only/checkout/lucene/build.xml:49:
The following error occurred while executing this line:
> /var/lib/jenkins/workspace/Lucene-trunk-Linux-Java7-64-test-only/checkout/lucene/common-build.xml:1296:
The following error occurred while executing this line:
> /var/lib/jenkins/workspace/Lucene-trunk-Linux-Java7-64-test-only/checkout/lucene/common-build.xml:920:
There were test failures: 396 suites, 3090 tests, 1 failure, 123 ignored (113 assumptions)
>
> Total time: 5 minutes 32 seconds
> Build step 'Invoke Ant' marked build as failure
> Archiving artifacts
> Recording test results
> Email was triggered for: Failure
> Sending email for trigger: Failure
>
>
>
>
> ---------------------------------------------------------------------
> To unsubscribe, e-mail: dev-unsubscribe@lucene.apache.org
> For additional commands, e-mail: dev-help@lucene.apache.org

---------------------------------------------------------------------
To unsubscribe, e-mail: dev-unsubscribe@lucene.apache.org
For additional commands, e-mail: dev-help@lucene.apache.org


Mime
View raw message