lucene-dev mailing list archives

Site index · List index
Message view « Date » · « Thread »
Top « Date » · « Thread »
From Robert Muir <rcm...@gmail.com>
Subject Re: [JENKINS] Lucene-Solr-4.x-Linux (32bit/jdk1.8.0_20-ea-b15) - Build # 10267 - Still Failing!
Date Mon, 26 May 2014 16:08:09 GMT
this reproduces.

On Mon, May 26, 2014 at 1:32 AM, Policeman Jenkins Server
<jenkins@thetaphi.de> wrote:
> Build: http://jenkins.thetaphi.de/job/Lucene-Solr-4.x-Linux/10267/
> Java: 32bit/jdk1.8.0_20-ea-b15 -server -XX:+UseG1GC
>
> 2 tests failed.
> FAILED:  junit.framework.TestSuite.org.apache.lucene.analysis.uima.UIMABaseAnalyzerTest
>
> Error Message:
> 2 threads leaked from SUITE scope at org.apache.lucene.analysis.uima.UIMABaseAnalyzerTest:
    1) Thread[id=18, name=LuceneTestCase-1-thread-2, state=WAITING, group=TGRP-UIMABaseAnalyzerTest]
        at sun.misc.Unsafe.park(Native Method)         at java.util.concurrent.locks.LockSupport.park(LockSupport.java:175)
        at java.util.concurrent.locks.AbstractQueuedSynchronizer$ConditionObject.await(AbstractQueuedSynchronizer.java:2039)
        at java.util.concurrent.LinkedBlockingQueue.take(LinkedBlockingQueue.java:442)   
     at java.util.concurrent.ThreadPoolExecutor.getTask(ThreadPoolExecutor.java:1067)    
    at java.util.concurrent.ThreadPoolExecutor.runWorker(ThreadPoolExecutor.java:1127)   
     at java.util.concurrent.ThreadPoolExecutor$Worker.run(ThreadPoolExecutor.java:617)  
      at java.lang.Thread.run(Thread.java:745)    2) Thread[id=17, name=LuceneTestCase-1-thread-1,
state=WAITING, group=TGRP-UIMABaseAnalyzerTest]         at sun.misc.Unsafe.park(Native Method)
        at java.util.concurrent.locks.LockSupport.park(LockSupport.java:175)         at java.util.concurrent.locks.AbstractQueuedSynchronizer$ConditionObject.await(AbstractQueuedSynchronizer.java:2039)
        at java.util.concurrent.LinkedBlockingQueue.take(LinkedBlockingQueue.java:442)   
     at java.util.concurrent.ThreadPoolExecutor.getTask(ThreadPoolExecutor.java:1067)    
    at java.util.concurrent.ThreadPoolExecutor.runWorker(ThreadPoolExecutor.java:1127)   
     at java.util.concurrent.ThreadPoolExecutor$Worker.run(ThreadPoolExecutor.java:617)  
      at java.lang.Thread.run(Thread.java:745)
>
> Stack Trace:
> com.carrotsearch.randomizedtesting.ThreadLeakError: 2 threads leaked from SUITE scope
at org.apache.lucene.analysis.uima.UIMABaseAnalyzerTest:
>    1) Thread[id=18, name=LuceneTestCase-1-thread-2, state=WAITING, group=TGRP-UIMABaseAnalyzerTest]
>         at sun.misc.Unsafe.park(Native Method)
>         at java.util.concurrent.locks.LockSupport.park(LockSupport.java:175)
>         at java.util.concurrent.locks.AbstractQueuedSynchronizer$ConditionObject.await(AbstractQueuedSynchronizer.java:2039)
>         at java.util.concurrent.LinkedBlockingQueue.take(LinkedBlockingQueue.java:442)
>         at java.util.concurrent.ThreadPoolExecutor.getTask(ThreadPoolExecutor.java:1067)
>         at java.util.concurrent.ThreadPoolExecutor.runWorker(ThreadPoolExecutor.java:1127)
>         at java.util.concurrent.ThreadPoolExecutor$Worker.run(ThreadPoolExecutor.java:617)
>         at java.lang.Thread.run(Thread.java:745)
>    2) Thread[id=17, name=LuceneTestCase-1-thread-1, state=WAITING, group=TGRP-UIMABaseAnalyzerTest]
>         at sun.misc.Unsafe.park(Native Method)
>         at java.util.concurrent.locks.LockSupport.park(LockSupport.java:175)
>         at java.util.concurrent.locks.AbstractQueuedSynchronizer$ConditionObject.await(AbstractQueuedSynchronizer.java:2039)
>         at java.util.concurrent.LinkedBlockingQueue.take(LinkedBlockingQueue.java:442)
>         at java.util.concurrent.ThreadPoolExecutor.getTask(ThreadPoolExecutor.java:1067)
>         at java.util.concurrent.ThreadPoolExecutor.runWorker(ThreadPoolExecutor.java:1127)
>         at java.util.concurrent.ThreadPoolExecutor$Worker.run(ThreadPoolExecutor.java:617)
>         at java.lang.Thread.run(Thread.java:745)
>         at __randomizedtesting.SeedInfo.seed([FA64877FF1E6DD8A]:0)
>
>
> FAILED:  junit.framework.TestSuite.org.apache.lucene.analysis.uima.UIMABaseAnalyzerTest
>
> Error Message:
> There are still zombie threads that couldn't be terminated:    1) Thread[id=18, name=LuceneTestCase-1-thread-2,
state=WAITING, group=TGRP-UIMABaseAnalyzerTest]         at sun.misc.Unsafe.park(Native Method)
        at java.util.concurrent.locks.LockSupport.park(LockSupport.java:175)         at java.util.concurrent.locks.AbstractQueuedSynchronizer$ConditionObject.await(AbstractQueuedSynchronizer.java:2039)
        at java.util.concurrent.LinkedBlockingQueue.take(LinkedBlockingQueue.java:442)   
     at java.util.concurrent.ThreadPoolExecutor.getTask(ThreadPoolExecutor.java:1067)    
    at java.util.concurrent.ThreadPoolExecutor.runWorker(ThreadPoolExecutor.java:1127)   
     at java.util.concurrent.ThreadPoolExecutor$Worker.run(ThreadPoolExecutor.java:617)  
      at java.lang.Thread.run(Thread.java:745)    2) Thread[id=17, name=LuceneTestCase-1-thread-1,
state=WAITING, group=TGRP-UIMABaseAnalyzerTest]         at sun.misc.Unsafe.park(Native Method)
        at java.util.concurrent.locks.LockSupport.park(LockSupport.java:175)         at java.util.concurrent.locks.AbstractQueuedSynchronizer$ConditionObject.await(AbstractQueuedSynchronizer.java:2039)
        at java.util.concurrent.LinkedBlockingQueue.take(LinkedBlockingQueue.java:442)   
     at java.util.concurrent.ThreadPoolExecutor.getTask(ThreadPoolExecutor.java:1067)    
    at java.util.concurrent.ThreadPoolExecutor.runWorker(ThreadPoolExecutor.java:1127)   
     at java.util.concurrent.ThreadPoolExecutor$Worker.run(ThreadPoolExecutor.java:617)  
      at java.lang.Thread.run(Thread.java:745)
>
> Stack Trace:
> com.carrotsearch.randomizedtesting.ThreadLeakError: There are still zombie threads that
couldn't be terminated:
>    1) Thread[id=18, name=LuceneTestCase-1-thread-2, state=WAITING, group=TGRP-UIMABaseAnalyzerTest]
>         at sun.misc.Unsafe.park(Native Method)
>         at java.util.concurrent.locks.LockSupport.park(LockSupport.java:175)
>         at java.util.concurrent.locks.AbstractQueuedSynchronizer$ConditionObject.await(AbstractQueuedSynchronizer.java:2039)
>         at java.util.concurrent.LinkedBlockingQueue.take(LinkedBlockingQueue.java:442)
>         at java.util.concurrent.ThreadPoolExecutor.getTask(ThreadPoolExecutor.java:1067)
>         at java.util.concurrent.ThreadPoolExecutor.runWorker(ThreadPoolExecutor.java:1127)
>         at java.util.concurrent.ThreadPoolExecutor$Worker.run(ThreadPoolExecutor.java:617)
>         at java.lang.Thread.run(Thread.java:745)
>    2) Thread[id=17, name=LuceneTestCase-1-thread-1, state=WAITING, group=TGRP-UIMABaseAnalyzerTest]
>         at sun.misc.Unsafe.park(Native Method)
>         at java.util.concurrent.locks.LockSupport.park(LockSupport.java:175)
>         at java.util.concurrent.locks.AbstractQueuedSynchronizer$ConditionObject.await(AbstractQueuedSynchronizer.java:2039)
>         at java.util.concurrent.LinkedBlockingQueue.take(LinkedBlockingQueue.java:442)
>         at java.util.concurrent.ThreadPoolExecutor.getTask(ThreadPoolExecutor.java:1067)
>         at java.util.concurrent.ThreadPoolExecutor.runWorker(ThreadPoolExecutor.java:1127)
>         at java.util.concurrent.ThreadPoolExecutor$Worker.run(ThreadPoolExecutor.java:617)
>         at java.lang.Thread.run(Thread.java:745)
>         at __randomizedtesting.SeedInfo.seed([FA64877FF1E6DD8A]:0)
>
>
>
>
> Build Log:
> [...truncated 6974 lines...]
>    [junit4] Suite: org.apache.lucene.analysis.uima.UIMABaseAnalyzerTest
>    [junit4]   2> трав. 25, 2014 7:32:16 PM WhitespaceTokenizer initialize
>    [junit4]   2> INFO: "Whitespace tokenizer successfully initialized"
>    [junit4]   2> трав. 25, 2014 7:32:19 PM WhitespaceTokenizer typeSystemInit
>    [junit4]   2> INFO: "Whitespace tokenizer typesystem initialized"
>    [junit4]   2> трав. 25, 2014 7:32:19 PM WhitespaceTokenizer process
>    [junit4]   2> INFO: "Whitespace tokenizer starts processing"
>    [junit4]   2> трав. 25, 2014 7:32:19 PM WhitespaceTokenizer process
>    [junit4]   2> INFO: "Whitespace tokenizer finished processing"
>    [junit4]   2> трав. 25, 2014 7:32:19 PM WhitespaceTokenizer process
>    [junit4]   2> INFO: "Whitespace tokenizer starts processing"
>    [junit4]   2> трав. 25, 2014 7:32:19 PM WhitespaceTokenizer process
>    [junit4]   2> INFO: "Whitespace tokenizer finished processing"
>    [junit4]   2> трав. 25, 2014 7:32:19 PM WhitespaceTokenizer process
>    [junit4]   2> INFO: "Whitespace tokenizer starts processing"
>    [junit4]   2> трав. 25, 2014 7:32:19 PM WhitespaceTokenizer process
>    [junit4]   2> INFO: "Whitespace tokenizer finished processing"
>    [junit4]   2> трав. 25, 2014 7:32:19 PM WhitespaceTokenizer process
>    [junit4]   2> INFO: "Whitespace tokenizer starts processing"
>    [junit4]   2> трав. 25, 2014 7:32:19 PM WhitespaceTokenizer process
>    [junit4]   2> INFO: "Whitespace tokenizer finished processing"
>    [junit4]   2> трав. 25, 2014 7:32:19 PM WhitespaceTokenizer initialize
>    [junit4]   2> INFO: "Whitespace tokenizer successfully initialized"
>    [junit4]   2> трав. 25, 2014 7:32:22 PM WhitespaceTokenizer typeSystemInit
>    [junit4]   2> INFO: "Whitespace tokenizer typesystem initialized"
>    [junit4]   2> трав. 25, 2014 7:32:22 PM WhitespaceTokenizer process
>    [junit4]   2> INFO: "Whitespace tokenizer starts processing"
>    [junit4]   2> трав. 25, 2014 7:32:22 PM WhitespaceTokenizer process
>    [junit4]   2> INFO: "Whitespace tokenizer finished processing"
>    [junit4]   2> May 25, 2014 11:32:24 PM com.carrotsearch.randomizedtesting.ThreadLeakControl
checkThreadLeaks
>    [junit4]   2> WARNING: Will linger awaiting termination of 2 leaked thread(s).
>    [junit4]   2> May 25, 2014 11:32:44 PM com.carrotsearch.randomizedtesting.ThreadLeakControl
checkThreadLeaks
>    [junit4]   2> SEVERE: 2 threads leaked from SUITE scope at org.apache.lucene.analysis.uima.UIMABaseAnalyzerTest:
>    [junit4]   2>    1) Thread[id=18, name=LuceneTestCase-1-thread-2, state=WAITING,
group=TGRP-UIMABaseAnalyzerTest]
>    [junit4]   2>         at sun.misc.Unsafe.park(Native Method)
>    [junit4]   2>         at java.util.concurrent.locks.LockSupport.park(LockSupport.java:175)
>    [junit4]   2>         at java.util.concurrent.locks.AbstractQueuedSynchronizer$ConditionObject.await(AbstractQueuedSynchronizer.java:2039)
>    [junit4]   2>         at java.util.concurrent.LinkedBlockingQueue.take(LinkedBlockingQueue.java:442)
>    [junit4]   2>         at java.util.concurrent.ThreadPoolExecutor.getTask(ThreadPoolExecutor.java:1067)
>    [junit4]   2>         at java.util.concurrent.ThreadPoolExecutor.runWorker(ThreadPoolExecutor.java:1127)
>    [junit4]   2>         at java.util.concurrent.ThreadPoolExecutor$Worker.run(ThreadPoolExecutor.java:617)
>    [junit4]   2>         at java.lang.Thread.run(Thread.java:745)
>    [junit4]   2>    2) Thread[id=17, name=LuceneTestCase-1-thread-1, state=WAITING,
group=TGRP-UIMABaseAnalyzerTest]
>    [junit4]   2>         at sun.misc.Unsafe.park(Native Method)
>    [junit4]   2>         at java.util.concurrent.locks.LockSupport.park(LockSupport.java:175)
>    [junit4]   2>         at java.util.concurrent.locks.AbstractQueuedSynchronizer$ConditionObject.await(AbstractQueuedSynchronizer.java:2039)
>    [junit4]   2>         at java.util.concurrent.LinkedBlockingQueue.take(LinkedBlockingQueue.java:442)
>    [junit4]   2>         at java.util.concurrent.ThreadPoolExecutor.getTask(ThreadPoolExecutor.java:1067)
>    [junit4]   2>         at java.util.concurrent.ThreadPoolExecutor.runWorker(ThreadPoolExecutor.java:1127)
>    [junit4]   2>         at java.util.concurrent.ThreadPoolExecutor$Worker.run(ThreadPoolExecutor.java:617)
>    [junit4]   2>         at java.lang.Thread.run(Thread.java:745)
>    [junit4]   2> May 25, 2014 11:32:44 PM com.carrotsearch.randomizedtesting.ThreadLeakControl
tryToInterruptAll
>    [junit4]   2> INFO: Starting to interrupt leaked threads:
>    [junit4]   2>    1) Thread[id=18, name=LuceneTestCase-1-thread-2, state=WAITING,
group=TGRP-UIMABaseAnalyzerTest]
>    [junit4]   2>    2) Thread[id=17, name=LuceneTestCase-1-thread-1, state=WAITING,
group=TGRP-UIMABaseAnalyzerTest]
>    [junit4]   2> May 25, 2014 11:32:47 PM com.carrotsearch.randomizedtesting.ThreadLeakControl
tryToInterruptAll
>    [junit4]   2> SEVERE: There are still zombie threads that couldn't be terminated:
>    [junit4]   2>    1) Thread[id=18, name=LuceneTestCase-1-thread-2, state=WAITING,
group=TGRP-UIMABaseAnalyzerTest]
>    [junit4]   2>         at sun.misc.Unsafe.park(Native Method)
>    [junit4]   2>         at java.util.concurrent.locks.LockSupport.park(LockSupport.java:175)
>    [junit4]   2>         at java.util.concurrent.locks.AbstractQueuedSynchronizer$ConditionObject.await(AbstractQueuedSynchronizer.java:2039)
>    [junit4]   2>         at java.util.concurrent.LinkedBlockingQueue.take(LinkedBlockingQueue.java:442)
>    [junit4]   2>         at java.util.concurrent.ThreadPoolExecutor.getTask(ThreadPoolExecutor.java:1067)
>    [junit4]   2>         at java.util.concurrent.ThreadPoolExecutor.runWorker(ThreadPoolExecutor.java:1127)
>    [junit4]   2>         at java.util.concurrent.ThreadPoolExecutor$Worker.run(ThreadPoolExecutor.java:617)
>    [junit4]   2>         at java.lang.Thread.run(Thread.java:745)
>    [junit4]   2>    2) Thread[id=17, name=LuceneTestCase-1-thread-1, state=WAITING,
group=TGRP-UIMABaseAnalyzerTest]
>    [junit4]   2>         at sun.misc.Unsafe.park(Native Method)
>    [junit4]   2>         at java.util.concurrent.locks.LockSupport.park(LockSupport.java:175)
>    [junit4]   2>         at java.util.concurrent.locks.AbstractQueuedSynchronizer$ConditionObject.await(AbstractQueuedSynchronizer.java:2039)
>    [junit4]   2>         at java.util.concurrent.LinkedBlockingQueue.take(LinkedBlockingQueue.java:442)
>    [junit4]   2>         at java.util.concurrent.ThreadPoolExecutor.getTask(ThreadPoolExecutor.java:1067)
>    [junit4]   2>         at java.util.concurrent.ThreadPoolExecutor.runWorker(ThreadPoolExecutor.java:1127)
>    [junit4]   2>         at java.util.concurrent.ThreadPoolExecutor$Worker.run(ThreadPoolExecutor.java:617)
>    [junit4]   2>         at java.lang.Thread.run(Thread.java:745)
>    [junit4]   2> NOTE: test params are: codec=Lucene46: {dummy=FST41, contents=FST41,
title=FST41}, docValues:{}, sim=RandomSimilarityProvider(queryNorm=true,coord=no): {}, locale=uk_UA,
timezone=America/St_Lucia
>    [junit4]   2> NOTE: Linux 3.8.0-39-generic i386/Oracle Corporation 1.8.0_20-ea
(32-bit)/cpus=8,threads=3,free=112905040,total=224395264
>    [junit4]   2> NOTE: All tests run in this JVM: [UIMABaseAnalyzerTest]
>    [junit4]   2> NOTE: reproduce with: ant test  -Dtestcase=UIMABaseAnalyzerTest -Dtests.seed=FA64877FF1E6DD8A
-Dtests.multiplier=3 -Dtests.slow=true -Dtests.locale=uk_UA -Dtests.timezone=America/St_Lucia
-Dtests.file.encoding=UTF-8
>    [junit4] ERROR   0.00s | UIMABaseAnalyzerTest (suite) <<<
>    [junit4]    > Throwable #1: com.carrotsearch.randomizedtesting.ThreadLeakError:
2 threads leaked from SUITE scope at org.apache.lucene.analysis.uima.UIMABaseAnalyzerTest:
>    [junit4]    >    1) Thread[id=18, name=LuceneTestCase-1-thread-2, state=WAITING,
group=TGRP-UIMABaseAnalyzerTest]
>    [junit4]    >         at sun.misc.Unsafe.park(Native Method)
>    [junit4]    >         at java.util.concurrent.locks.LockSupport.park(LockSupport.java:175)
>    [junit4]    >         at java.util.concurrent.locks.AbstractQueuedSynchronizer$ConditionObject.await(AbstractQueuedSynchronizer.java:2039)
>    [junit4]    >         at java.util.concurrent.LinkedBlockingQueue.take(LinkedBlockingQueue.java:442)
>    [junit4]    >         at java.util.concurrent.ThreadPoolExecutor.getTask(ThreadPoolExecutor.java:1067)
>    [junit4]    >         at java.util.concurrent.ThreadPoolExecutor.runWorker(ThreadPoolExecutor.java:1127)
>    [junit4]    >         at java.util.concurrent.ThreadPoolExecutor$Worker.run(ThreadPoolExecutor.java:617)
>    [junit4]    >         at java.lang.Thread.run(Thread.java:745)
>    [junit4]    >    2) Thread[id=17, name=LuceneTestCase-1-thread-1, state=WAITING,
group=TGRP-UIMABaseAnalyzerTest]
>    [junit4]    >         at sun.misc.Unsafe.park(Native Method)
>    [junit4]    >         at java.util.concurrent.locks.LockSupport.park(LockSupport.java:175)
>    [junit4]    >         at java.util.concurrent.locks.AbstractQueuedSynchronizer$ConditionObject.await(AbstractQueuedSynchronizer.java:2039)
>    [junit4]    >         at java.util.concurrent.LinkedBlockingQueue.take(LinkedBlockingQueue.java:442)
>    [junit4]    >         at java.util.concurrent.ThreadPoolExecutor.getTask(ThreadPoolExecutor.java:1067)
>    [junit4]    >         at java.util.concurrent.ThreadPoolExecutor.runWorker(ThreadPoolExecutor.java:1127)
>    [junit4]    >         at java.util.concurrent.ThreadPoolExecutor$Worker.run(ThreadPoolExecutor.java:617)
>    [junit4]    >         at java.lang.Thread.run(Thread.java:745)
>    [junit4]    >        at __randomizedtesting.SeedInfo.seed([FA64877FF1E6DD8A]:0)Throwable
#2: com.carrotsearch.randomizedtesting.ThreadLeakError: There are still zombie threads that
couldn't be terminated:
>    [junit4]    >    1) Thread[id=18, name=LuceneTestCase-1-thread-2, state=WAITING,
group=TGRP-UIMABaseAnalyzerTest]
>    [junit4]    >         at sun.misc.Unsafe.park(Native Method)
>    [junit4]    >         at java.util.concurrent.locks.LockSupport.park(LockSupport.java:175)
>    [junit4]    >         at java.util.concurrent.locks.AbstractQueuedSynchronizer$ConditionObject.await(AbstractQueuedSynchronizer.java:2039)
>    [junit4]    >         at java.util.concurrent.LinkedBlockingQueue.take(LinkedBlockingQueue.java:442)
>    [junit4]    >         at java.util.concurrent.ThreadPoolExecutor.getTask(ThreadPoolExecutor.java:1067)
>    [junit4]    >         at java.util.concurrent.ThreadPoolExecutor.runWorker(ThreadPoolExecutor.java:1127)
>    [junit4]    >         at java.util.concurrent.ThreadPoolExecutor$Worker.run(ThreadPoolExecutor.java:617)
>    [junit4]    >         at java.lang.Thread.run(Thread.java:745)
>    [junit4]    >    2) Thread[id=17, name=LuceneTestCase-1-thread-1, state=WAITING,
group=TGRP-UIMABaseAnalyzerTest]
>    [junit4]    >         at sun.misc.Unsafe.park(Native Method)
>    [junit4]    >         at java.util.concurrent.locks.LockSupport.park(LockSupport.java:175)
>    [junit4]    >         at java.util.concurrent.locks.AbstractQueuedSynchronizer$ConditionObject.await(AbstractQueuedSynchronizer.java:2039)
>    [junit4]    >         at java.util.concurrent.LinkedBlockingQueue.take(LinkedBlockingQueue.java:442)
>    [junit4]    >         at java.util.concurrent.ThreadPoolExecutor.getTask(ThreadPoolExecutor.java:1067)
>    [junit4]    >         at java.util.concurrent.ThreadPoolExecutor.runWorker(ThreadPoolExecutor.java:1127)
>    [junit4]    >         at java.util.concurrent.ThreadPoolExecutor$Worker.run(ThreadPoolExecutor.java:617)
>    [junit4]    >         at java.lang.Thread.run(Thread.java:745)
>    [junit4]    >        at __randomizedtesting.SeedInfo.seed([FA64877FF1E6DD8A]:0)
>    [junit4] Completed in 31.98s, 4 tests, 2 errors <<< FAILURES!
>
> [...truncated 12 lines...]
> BUILD FAILED
> /mnt/ssd/jenkins/workspace/Lucene-Solr-4.x-Linux/build.xml:467: The following error occurred
while executing this line:
> /mnt/ssd/jenkins/workspace/Lucene-Solr-4.x-Linux/build.xml:447: The following error occurred
while executing this line:
> /mnt/ssd/jenkins/workspace/Lucene-Solr-4.x-Linux/build.xml:45: The following error occurred
while executing this line:
> /mnt/ssd/jenkins/workspace/Lucene-Solr-4.x-Linux/extra-targets.xml:37: The following
error occurred while executing this line:
> /mnt/ssd/jenkins/workspace/Lucene-Solr-4.x-Linux/lucene/build.xml:539: The following
error occurred while executing this line:
> /mnt/ssd/jenkins/workspace/Lucene-Solr-4.x-Linux/lucene/common-build.xml:2017: The following
error occurred while executing this line:
> /mnt/ssd/jenkins/workspace/Lucene-Solr-4.x-Linux/lucene/analysis/build.xml:106: The following
error occurred while executing this line:
> /mnt/ssd/jenkins/workspace/Lucene-Solr-4.x-Linux/lucene/analysis/build.xml:38: The following
error occurred while executing this line:
> /mnt/ssd/jenkins/workspace/Lucene-Solr-4.x-Linux/lucene/module-build.xml:60: The following
error occurred while executing this line:
> /mnt/ssd/jenkins/workspace/Lucene-Solr-4.x-Linux/lucene/common-build.xml:1297: The following
error occurred while executing this line:
> /mnt/ssd/jenkins/workspace/Lucene-Solr-4.x-Linux/lucene/common-build.xml:921: There were
test failures: 5 suites, 12 tests, 2 suite-level errors, 2 ignored
>
> Total time: 30 minutes 55 seconds
> Build step 'Invoke Ant' marked build as failure
> Description set: Java: 32bit/jdk1.8.0_20-ea-b15 -server -XX:+UseG1GC
> Archiving artifacts
> Recording test results
> Email was triggered for: Failure
> Sending email for trigger: Failure
>
>
>
>
> ---------------------------------------------------------------------
> To unsubscribe, e-mail: dev-unsubscribe@lucene.apache.org
> For additional commands, e-mail: dev-help@lucene.apache.org

---------------------------------------------------------------------
To unsubscribe, e-mail: dev-unsubscribe@lucene.apache.org
For additional commands, e-mail: dev-help@lucene.apache.org


Mime
View raw message