lucene-dev mailing list archives

Site index · List index
Message view « Date » · « Thread »
Top « Date » · « Thread »
From Robert Muir <rm...@apache.org>
Subject Re: [JENKINS] Lucene-trunk-Linux-java7-64-analyzers - Build # 4118 - Failure!
Date Thu, 01 May 2014 11:33:14 GMT
oops: i committed a fix

On Thu, May 1, 2014 at 7:26 AM,  <builder@flonkings.com> wrote:
> Build: builds.flonkings.com/job/Lucene-trunk-Linux-java7-64-analyzers/4118/
>
> 2 tests failed.
> REGRESSION:  org.apache.lucene.analysis.core.TestAllAnalyzersHaveFactories.test
>
> Error Message:
> A SPI class of type org.apache.lucene.analysis.util.TokenFilterFactory with name 'Cranky'
does not exist. You need to add the corresponding JAR file supporting this SPI to your classpath.
The current classpath supports the following names: [apostrophe, arabicnormalization, arabicstem,
bulgarianstem, brazilianstem, cjkbigram, cjkwidth, soraninormalization, soranistem, commongrams,
commongramsquery, dictionarycompoundword, hyphenationcompoundword, lowercase, stop, type,
uppercase, czechstem, germanlightstem, germanminimalstem, germannormalization, germanstem,
greeklowercase, greekstem, englishminimalstem, englishpossessive, kstem, porterstem, spanishlightstem,
persiannormalization, finnishlightstem, frenchlightstem, frenchminimalstem, irishlowercase,
galicianminimalstem, galicianstem, hindinormalization, hindistem, hungarianlightstem, hunspellstem,
indonesianstem, indicnormalization, italianlightstem, latvianstem, asciifolding, capitalization,
codepointcount, hyphenatedwords, keepword, keywordmarker, keywordrepeat, length, limittokencount,
limittokenposition, removeduplicates, stemmeroverride, trim, truncate, worddelimiter, scandinavianfolding,
scandinaviannormalization, edgengram, ngram, norwegianlightstem, norwegianminimalstem, patternreplace,
patterncapturegroup, delimitedpayload, numericpayload, tokenoffsetpayload, typeaspayload,
portugueselightstem, portugueseminimalstem, portuguesestem, reversestring, russianlightstem,
shingle, snowballporter, classic, standard, swedishlightstem, synonym, thaiword, turkishlowercase,
elision]
>
> Stack Trace:
> java.lang.IllegalArgumentException: A SPI class of type org.apache.lucene.analysis.util.TokenFilterFactory
with name 'Cranky' does not exist. You need to add the corresponding JAR file supporting this
SPI to your classpath. The current classpath supports the following names: [apostrophe, arabicnormalization,
arabicstem, bulgarianstem, brazilianstem, cjkbigram, cjkwidth, soraninormalization, soranistem,
commongrams, commongramsquery, dictionarycompoundword, hyphenationcompoundword, lowercase,
stop, type, uppercase, czechstem, germanlightstem, germanminimalstem, germannormalization,
germanstem, greeklowercase, greekstem, englishminimalstem, englishpossessive, kstem, porterstem,
spanishlightstem, persiannormalization, finnishlightstem, frenchlightstem, frenchminimalstem,
irishlowercase, galicianminimalstem, galicianstem, hindinormalization, hindistem, hungarianlightstem,
hunspellstem, indonesianstem, indicnormalization, italianlightstem, latvianstem, asciifolding,
capitalization, codepointcount, hyphenatedwords, keepword, keywordmarker, keywordrepeat, length,
limittokencount, limittokenposition, removeduplicates, stemmeroverride, trim, truncate, worddelimiter,
scandinavianfolding, scandinaviannormalization, edgengram, ngram, norwegianlightstem, norwegianminimalstem,
patternreplace, patterncapturegroup, delimitedpayload, numericpayload, tokenoffsetpayload,
typeaspayload, portugueselightstem, portugueseminimalstem, portuguesestem, reversestring,
russianlightstem, shingle, snowballporter, classic, standard, swedishlightstem, synonym, thaiword,
turkishlowercase, elision]
>         at __randomizedtesting.SeedInfo.seed([15B8EB55456878E0:9DECD48FEB941518]:0)
>         at org.apache.lucene.analysis.util.AnalysisSPILoader.lookupClass(AnalysisSPILoader.java:122)
>         at org.apache.lucene.analysis.util.TokenFilterFactory.lookupClass(TokenFilterFactory.java:42)
>         at org.apache.lucene.analysis.core.TestAllAnalyzersHaveFactories.test(TestAllAnalyzersHaveFactories.java:148)
>         at sun.reflect.NativeMethodAccessorImpl.invoke0(Native Method)
>         at sun.reflect.NativeMethodAccessorImpl.invoke(NativeMethodAccessorImpl.java:57)
>         at sun.reflect.DelegatingMethodAccessorImpl.invoke(DelegatingMethodAccessorImpl.java:43)
>         at java.lang.reflect.Method.invoke(Method.java:606)
>         at com.carrotsearch.randomizedtesting.RandomizedRunner.invoke(RandomizedRunner.java:1618)
>         at com.carrotsearch.randomizedtesting.RandomizedRunner$6.evaluate(RandomizedRunner.java:827)
>         at com.carrotsearch.randomizedtesting.RandomizedRunner$7.evaluate(RandomizedRunner.java:863)
>         at com.carrotsearch.randomizedtesting.RandomizedRunner$8.evaluate(RandomizedRunner.java:877)
>         at org.apache.lucene.util.TestRuleSetupTeardownChained$1.evaluate(TestRuleSetupTeardownChained.java:50)
>         at org.apache.lucene.util.TestRuleFieldCacheSanity$1.evaluate(TestRuleFieldCacheSanity.java:51)
>         at org.apache.lucene.util.AbstractBeforeAfterRule$1.evaluate(AbstractBeforeAfterRule.java:46)
>         at com.carrotsearch.randomizedtesting.rules.SystemPropertiesInvariantRule$1.evaluate(SystemPropertiesInvariantRule.java:55)
>         at org.apache.lucene.util.TestRuleThreadAndTestName$1.evaluate(TestRuleThreadAndTestName.java:49)
>         at org.apache.lucene.util.TestRuleIgnoreAfterMaxFailures$1.evaluate(TestRuleIgnoreAfterMaxFailures.java:65)
>         at org.apache.lucene.util.TestRuleMarkFailure$1.evaluate(TestRuleMarkFailure.java:48)
>         at com.carrotsearch.randomizedtesting.rules.StatementAdapter.evaluate(StatementAdapter.java:36)
>         at com.carrotsearch.randomizedtesting.ThreadLeakControl$StatementRunner.run(ThreadLeakControl.java:360)
>         at com.carrotsearch.randomizedtesting.ThreadLeakControl.forkTimeoutingTask(ThreadLeakControl.java:793)
>         at com.carrotsearch.randomizedtesting.ThreadLeakControl$3.evaluate(ThreadLeakControl.java:453)
>         at com.carrotsearch.randomizedtesting.RandomizedRunner.runSingleTest(RandomizedRunner.java:836)
>         at com.carrotsearch.randomizedtesting.RandomizedRunner$3.evaluate(RandomizedRunner.java:738)
>         at com.carrotsearch.randomizedtesting.RandomizedRunner$4.evaluate(RandomizedRunner.java:772)
>         at com.carrotsearch.randomizedtesting.RandomizedRunner$5.evaluate(RandomizedRunner.java:783)
>         at org.apache.lucene.util.AbstractBeforeAfterRule$1.evaluate(AbstractBeforeAfterRule.java:46)
>         at org.apache.lucene.util.TestRuleStoreClassName$1.evaluate(TestRuleStoreClassName.java:42)
>         at com.carrotsearch.randomizedtesting.rules.SystemPropertiesInvariantRule$1.evaluate(SystemPropertiesInvariantRule.java:55)
>         at com.carrotsearch.randomizedtesting.rules.NoShadowingOrOverridesOnMethodsRule$1.evaluate(NoShadowingOrOverridesOnMethodsRule.java:39)
>         at com.carrotsearch.randomizedtesting.rules.NoShadowingOrOverridesOnMethodsRule$1.evaluate(NoShadowingOrOverridesOnMethodsRule.java:39)
>         at com.carrotsearch.randomizedtesting.rules.StatementAdapter.evaluate(StatementAdapter.java:36)
>         at com.carrotsearch.randomizedtesting.rules.StatementAdapter.evaluate(StatementAdapter.java:36)
>         at com.carrotsearch.randomizedtesting.rules.StatementAdapter.evaluate(StatementAdapter.java:36)
>         at org.apache.lucene.util.TestRuleAssertionsRequired$1.evaluate(TestRuleAssertionsRequired.java:43)
>         at org.apache.lucene.util.TestRuleMarkFailure$1.evaluate(TestRuleMarkFailure.java:48)
>         at org.apache.lucene.util.TestRuleIgnoreAfterMaxFailures$1.evaluate(TestRuleIgnoreAfterMaxFailures.java:65)
>         at org.apache.lucene.util.TestRuleIgnoreTestSuites$1.evaluate(TestRuleIgnoreTestSuites.java:55)
>         at com.carrotsearch.randomizedtesting.rules.StatementAdapter.evaluate(StatementAdapter.java:36)
>         at com.carrotsearch.randomizedtesting.ThreadLeakControl$StatementRunner.run(ThreadLeakControl.java:360)
>         at java.lang.Thread.run(Thread.java:724)
>
>
> REGRESSION:  org.apache.lucene.analysis.core.TestRandomChains.testRandomChains
>
> Error Message:
> TokenStream implementation classes or at least their incrementToken() implementation
must be final
>
> Stack Trace:
> java.lang.AssertionError: TokenStream implementation classes or at least their incrementToken()
implementation must be final
>         at __randomizedtesting.SeedInfo.seed([15B8EB55456878E0:2859C234027A6520]:0)
>         at org.apache.lucene.analysis.TokenStream.assertFinal(TokenStream.java:120)
>         at org.apache.lucene.analysis.TokenStream.<init>(TokenStream.java:101)
>         at org.apache.lucene.analysis.TokenFilter.<init>(TokenFilter.java:33)
>         at org.apache.lucene.analysis.CrankyTokenFilter.<init>(CrankyTokenFilter.java:35)
>         at sun.reflect.NativeConstructorAccessorImpl.newInstance0(Native Method)
>         at sun.reflect.NativeConstructorAccessorImpl.newInstance(NativeConstructorAccessorImpl.java:57)
>         at sun.reflect.DelegatingConstructorAccessorImpl.newInstance(DelegatingConstructorAccessorImpl.java:45)
>         at java.lang.reflect.Constructor.newInstance(Constructor.java:526)
>         at org.apache.lucene.analysis.core.TestRandomChains$MockRandomAnalyzer.createComponent(TestRandomChains.java:681)
>         at org.apache.lucene.analysis.core.TestRandomChains$MockRandomAnalyzer.newFilterChain(TestRandomChains.java:793)
>         at org.apache.lucene.analysis.core.TestRandomChains$MockRandomAnalyzer.toString(TestRandomChains.java:670)
>         at java.lang.String.valueOf(String.java:2854)
>         at java.lang.StringBuilder.append(StringBuilder.java:128)
>         at org.apache.lucene.analysis.core.TestRandomChains.testRandomChains(TestRandomChains.java:904)
>         at sun.reflect.NativeMethodAccessorImpl.invoke0(Native Method)
>         at sun.reflect.NativeMethodAccessorImpl.invoke(NativeMethodAccessorImpl.java:57)
>         at sun.reflect.DelegatingMethodAccessorImpl.invoke(DelegatingMethodAccessorImpl.java:43)
>         at java.lang.reflect.Method.invoke(Method.java:606)
>         at com.carrotsearch.randomizedtesting.RandomizedRunner.invoke(RandomizedRunner.java:1618)
>         at com.carrotsearch.randomizedtesting.RandomizedRunner$6.evaluate(RandomizedRunner.java:827)
>         at com.carrotsearch.randomizedtesting.RandomizedRunner$7.evaluate(RandomizedRunner.java:863)
>         at com.carrotsearch.randomizedtesting.RandomizedRunner$8.evaluate(RandomizedRunner.java:877)
>         at org.apache.lucene.util.TestRuleSetupTeardownChained$1.evaluate(TestRuleSetupTeardownChained.java:50)
>         at org.apache.lucene.util.TestRuleFieldCacheSanity$1.evaluate(TestRuleFieldCacheSanity.java:51)
>         at org.apache.lucene.util.AbstractBeforeAfterRule$1.evaluate(AbstractBeforeAfterRule.java:46)
>         at com.carrotsearch.randomizedtesting.rules.SystemPropertiesInvariantRule$1.evaluate(SystemPropertiesInvariantRule.java:55)
>         at org.apache.lucene.util.TestRuleThreadAndTestName$1.evaluate(TestRuleThreadAndTestName.java:49)
>         at org.apache.lucene.util.TestRuleIgnoreAfterMaxFailures$1.evaluate(TestRuleIgnoreAfterMaxFailures.java:65)
>         at org.apache.lucene.util.TestRuleMarkFailure$1.evaluate(TestRuleMarkFailure.java:48)
>         at com.carrotsearch.randomizedtesting.rules.StatementAdapter.evaluate(StatementAdapter.java:36)
>         at com.carrotsearch.randomizedtesting.ThreadLeakControl$StatementRunner.run(ThreadLeakControl.java:360)
>         at com.carrotsearch.randomizedtesting.ThreadLeakControl.forkTimeoutingTask(ThreadLeakControl.java:793)
>         at com.carrotsearch.randomizedtesting.ThreadLeakControl$3.evaluate(ThreadLeakControl.java:453)
>         at com.carrotsearch.randomizedtesting.RandomizedRunner.runSingleTest(RandomizedRunner.java:836)
>         at com.carrotsearch.randomizedtesting.RandomizedRunner$3.evaluate(RandomizedRunner.java:738)
>         at com.carrotsearch.randomizedtesting.RandomizedRunner$4.evaluate(RandomizedRunner.java:772)
>         at com.carrotsearch.randomizedtesting.RandomizedRunner$5.evaluate(RandomizedRunner.java:783)
>         at org.apache.lucene.util.AbstractBeforeAfterRule$1.evaluate(AbstractBeforeAfterRule.java:46)
>         at org.apache.lucene.util.TestRuleStoreClassName$1.evaluate(TestRuleStoreClassName.java:42)
>         at com.carrotsearch.randomizedtesting.rules.SystemPropertiesInvariantRule$1.evaluate(SystemPropertiesInvariantRule.java:55)
>         at com.carrotsearch.randomizedtesting.rules.NoShadowingOrOverridesOnMethodsRule$1.evaluate(NoShadowingOrOverridesOnMethodsRule.java:39)
>         at com.carrotsearch.randomizedtesting.rules.NoShadowingOrOverridesOnMethodsRule$1.evaluate(NoShadowingOrOverridesOnMethodsRule.java:39)
>         at com.carrotsearch.randomizedtesting.rules.StatementAdapter.evaluate(StatementAdapter.java:36)
>         at com.carrotsearch.randomizedtesting.rules.StatementAdapter.evaluate(StatementAdapter.java:36)
>         at com.carrotsearch.randomizedtesting.rules.StatementAdapter.evaluate(StatementAdapter.java:36)
>         at org.apache.lucene.util.TestRuleAssertionsRequired$1.evaluate(TestRuleAssertionsRequired.java:43)
>         at org.apache.lucene.util.TestRuleMarkFailure$1.evaluate(TestRuleMarkFailure.java:48)
>         at org.apache.lucene.util.TestRuleIgnoreAfterMaxFailures$1.evaluate(TestRuleIgnoreAfterMaxFailures.java:65)
>         at org.apache.lucene.util.TestRuleIgnoreTestSuites$1.evaluate(TestRuleIgnoreTestSuites.java:55)
>         at com.carrotsearch.randomizedtesting.rules.StatementAdapter.evaluate(StatementAdapter.java:36)
>         at com.carrotsearch.randomizedtesting.ThreadLeakControl$StatementRunner.run(ThreadLeakControl.java:360)
>         at java.lang.Thread.run(Thread.java:724)
>
>
>
>
> Build Log:
> [...truncated 645 lines...]
>    [junit4] Suite: org.apache.lucene.analysis.core.TestRandomChains
>    [junit4]   2> NOTE: reproduce with: ant test  -Dtestcase=TestRandomChains -Dtests.method=testRandomChains
-Dtests.seed=15B8EB55456878E0 -Dtests.slow=true -Dtests.locale=en_IE -Dtests.timezone=Etc/GMT-7
-Dtests.file.encoding=UTF-8
>    [junit4] FAILURE 5.64s J2 | TestRandomChains.testRandomChains <<<
>    [junit4]    > Throwable #1: java.lang.AssertionError: TokenStream implementation
classes or at least their incrementToken() implementation must be final
>    [junit4]    >        at __randomizedtesting.SeedInfo.seed([15B8EB55456878E0:2859C234027A6520]:0)
>    [junit4]    >        at org.apache.lucene.analysis.TokenStream.assertFinal(TokenStream.java:120)
>    [junit4]    >        at org.apache.lucene.analysis.TokenStream.<init>(TokenStream.java:101)
>    [junit4]    >        at org.apache.lucene.analysis.TokenFilter.<init>(TokenFilter.java:33)
>    [junit4]    >        at org.apache.lucene.analysis.CrankyTokenFilter.<init>(CrankyTokenFilter.java:35)
>    [junit4]    >        at java.lang.reflect.Constructor.newInstance(Constructor.java:526)
>    [junit4]    >        at org.apache.lucene.analysis.core.TestRandomChains$MockRandomAnalyzer.createComponent(TestRandomChains.java:681)
>    [junit4]    >        at org.apache.lucene.analysis.core.TestRandomChains$MockRandomAnalyzer.newFilterChain(TestRandomChains.java:793)
>    [junit4]    >        at org.apache.lucene.analysis.core.TestRandomChains$MockRandomAnalyzer.toString(TestRandomChains.java:670)
>    [junit4]    >        at java.lang.String.valueOf(String.java:2854)
>    [junit4]    >        at java.lang.StringBuilder.append(StringBuilder.java:128)
>    [junit4]    >        at org.apache.lucene.analysis.core.TestRandomChains.testRandomChains(TestRandomChains.java:904)
>    [junit4]    >        at java.lang.Thread.run(Thread.java:724)
>    [junit4]   2> NOTE: test params are: codec=Lucene46: {dummy=PostingsFormat(name=MockRandom)},
docValues:{}, sim=RandomSimilarityProvider(queryNorm=true,coord=yes): {}, locale=en_IE, timezone=Etc/GMT-7
>    [junit4]   2> NOTE: Linux 3.2.0-26-generic amd64/Oracle Corporation 1.7.0_25 (64-bit)/cpus=8,threads=1,free=67262704,total=219348992
>    [junit4]   2> NOTE: All tests run in this JVM: [TestPathHierarchyTokenizer, EdgeNGramTokenFilterTest,
TestCJKBigramFilter, TestPrefixAwareTokenFilter, TestRandomChains]
>    [junit4] Completed on J2 in 32.61s, 2 tests, 1 failure <<< FAILURES!
>
> [...truncated 35 lines...]
>    [junit4] Suite: org.apache.lucene.analysis.core.TestAllAnalyzersHaveFactories
>    [junit4]   2> NOTE: reproduce with: ant test  -Dtestcase=TestAllAnalyzersHaveFactories
-Dtests.method=test -Dtests.seed=15B8EB55456878E0 -Dtests.slow=true -Dtests.locale=sr__#Latn
-Dtests.timezone=Asia/Manila -Dtests.file.encoding=UTF-8
>    [junit4] ERROR   3.58s J1 | TestAllAnalyzersHaveFactories.test <<<
>    [junit4]    > Throwable #1: java.lang.IllegalArgumentException: A SPI class of
type org.apache.lucene.analysis.util.TokenFilterFactory with name 'Cranky' does not exist.
You need to add the corresponding JAR file supporting this SPI to your classpath. The current
classpath supports the following names: [apostrophe, arabicnormalization, arabicstem, bulgarianstem,
brazilianstem, cjkbigram, cjkwidth, soraninormalization, soranistem, commongrams, commongramsquery,
dictionarycompoundword, hyphenationcompoundword, lowercase, stop, type, uppercase, czechstem,
germanlightstem, germanminimalstem, germannormalization, germanstem, greeklowercase, greekstem,
englishminimalstem, englishpossessive, kstem, porterstem, spanishlightstem, persiannormalization,
finnishlightstem, frenchlightstem, frenchminimalstem, irishlowercase, galicianminimalstem,
galicianstem, hindinormalization, hindistem, hungarianlightstem, hunspellstem, indonesianstem,
indicnormalization, italianlightstem, latvianstem, asciifolding, capitalization, codepointcount,
hyphenatedwords, keepword, keywordmarker, keywordrepeat, length, limittokencount, limittokenposition,
removeduplicates, stemmeroverride, trim, truncate, worddelimiter, scandinavianfolding, scandinaviannormalization,
edgengram, ngram, norwegianlightstem, norwegianminimalstem, patternreplace, patterncapturegroup,
delimitedpayload, numericpayload, tokenoffsetpayload, typeaspayload, portugueselightstem,
portugueseminimalstem, portuguesestem, reversestring, russianlightstem, shingle, snowballporter,
classic, standard, swedishlightstem, synonym, thaiword, turkishlowercase, elision]
>    [junit4]    >        at __randomizedtesting.SeedInfo.seed([15B8EB55456878E0:9DECD48FEB941518]:0)
>    [junit4]    >        at org.apache.lucene.analysis.util.AnalysisSPILoader.lookupClass(AnalysisSPILoader.java:122)
>    [junit4]    >        at org.apache.lucene.analysis.util.TokenFilterFactory.lookupClass(TokenFilterFactory.java:42)
>    [junit4]    >        at org.apache.lucene.analysis.core.TestAllAnalyzersHaveFactories.test(TestAllAnalyzersHaveFactories.java:148)
>    [junit4]    >        at java.lang.Thread.run(Thread.java:724)
>    [junit4]   2> NOTE: test params are: codec=Lucene41, sim=DefaultSimilarity, locale=sr__#Latn,
timezone=Asia/Manila
>    [junit4]   2> NOTE: Linux 3.2.0-26-generic amd64/Oracle Corporation 1.7.0_25 (64-bit)/cpus=8,threads=1,free=184998368,total=259260416
>    [junit4]   2> NOTE: All tests run in this JVM: [TestStopFilterFactory, TestGalicianMinimalStemFilterFactory,
TestPrefixAndSuffixAwareTokenFilter, TestMappingCharFilterFactory, TestPatternTokenizerFactory,
TestBulgarianAnalyzer, TestTypeTokenFilter, TestKeepFilterFactory, TestCharArrayMap, TestRollingCharBuffer,
TestCompoundWordTokenFilter, TestHunspellStemFilterFactory, TestCaseInsensitive, TestApostropheFilterFactory,
TestEnglishMinimalStemFilter, TestSingleTokenTokenFilter, TestReverseStringFilter, TestSnowball,
TestDuelingAnalyzers, TestClassicAnalyzer, TestAllAnalyzersHaveFactories]
>    [junit4] Completed on J1 in 3.68s, 1 test, 1 error <<< FAILURES!
>
> [...truncated 398 lines...]
> BUILD FAILED
> /var/lib/jenkins/workspace/Lucene-trunk-Linux-java7-64-analyzers/checkout/lucene/module-build.xml:60:
The following error occurred while executing this line:
> /var/lib/jenkins/workspace/Lucene-trunk-Linux-java7-64-analyzers/checkout/lucene/common-build.xml:1296:
The following error occurred while executing this line:
> /var/lib/jenkins/workspace/Lucene-trunk-Linux-java7-64-analyzers/checkout/lucene/common-build.xml:920:
There were test failures: 252 suites, 1342 tests, 1 error, 1 failure, 1 ignored
>
> Total time: 2 minutes 36 seconds
> Build step 'Invoke Ant' marked build as failure
> Recording test results
> Email was triggered for: Failure
> Sending email for trigger: Failure
>

---------------------------------------------------------------------
To unsubscribe, e-mail: dev-unsubscribe@lucene.apache.org
For additional commands, e-mail: dev-help@lucene.apache.org


Mime
View raw message