lucene-dev mailing list archives

Site index · List index
Message view « Date » · « Thread »
Top « Date » · « Thread »
From Robert Muir <rcm...@gmail.com>
Subject Re: [JENKINS] Lucene-Solr-trunk-Linux (32bit/jdk1.7.0_55) - Build # 10320 - Failure!
Date Sat, 17 May 2014 12:36:36 GMT
Test bug: i committed a fix.

On Sat, May 17, 2014 at 8:12 AM, Policeman Jenkins Server
<jenkins@thetaphi.de> wrote:
> Build: http://jenkins.thetaphi.de/job/Lucene-Solr-trunk-Linux/10320/
> Java: 32bit/jdk1.7.0_55 -client -XX:+UseG1GC
>
> 1 tests failed.
> REGRESSION:  org.apache.lucene.uninverting.TestFieldCacheVsDocValues.testHugeBinaryValues
>
> Error Message:
>
>
> Stack Trace:
> java.lang.AssertionError
>         at __randomizedtesting.SeedInfo.seed([B2F2E797848F720B:51C934959CBDA284]:0)
>         at org.junit.Assert.fail(Assert.java:92)
>         at org.junit.Assert.assertTrue(Assert.java:43)
>         at org.junit.Assert.assertFalse(Assert.java:68)
>         at org.junit.Assert.assertFalse(Assert.java:79)
>         at org.apache.lucene.uninverting.TestFieldCacheVsDocValues.testHugeBinaryValues(TestFieldCacheVsDocValues.java:188)
>         at sun.reflect.NativeMethodAccessorImpl.invoke0(Native Method)
>         at sun.reflect.NativeMethodAccessorImpl.invoke(NativeMethodAccessorImpl.java:57)
>         at sun.reflect.DelegatingMethodAccessorImpl.invoke(DelegatingMethodAccessorImpl.java:43)
>         at java.lang.reflect.Method.invoke(Method.java:606)
>         at com.carrotsearch.randomizedtesting.RandomizedRunner.invoke(RandomizedRunner.java:1618)
>         at com.carrotsearch.randomizedtesting.RandomizedRunner$6.evaluate(RandomizedRunner.java:827)
>         at com.carrotsearch.randomizedtesting.RandomizedRunner$7.evaluate(RandomizedRunner.java:863)
>         at com.carrotsearch.randomizedtesting.RandomizedRunner$8.evaluate(RandomizedRunner.java:877)
>         at org.apache.lucene.util.TestRuleSetupTeardownChained$1.evaluate(TestRuleSetupTeardownChained.java:50)
>         at org.apache.lucene.util.AbstractBeforeAfterRule$1.evaluate(AbstractBeforeAfterRule.java:46)
>         at com.carrotsearch.randomizedtesting.rules.SystemPropertiesInvariantRule$1.evaluate(SystemPropertiesInvariantRule.java:55)
>         at org.apache.lucene.util.TestRuleThreadAndTestName$1.evaluate(TestRuleThreadAndTestName.java:49)
>         at org.apache.lucene.util.TestRuleIgnoreAfterMaxFailures$1.evaluate(TestRuleIgnoreAfterMaxFailures.java:65)
>         at org.apache.lucene.util.TestRuleMarkFailure$1.evaluate(TestRuleMarkFailure.java:48)
>         at com.carrotsearch.randomizedtesting.rules.StatementAdapter.evaluate(StatementAdapter.java:36)
>         at com.carrotsearch.randomizedtesting.ThreadLeakControl$StatementRunner.run(ThreadLeakControl.java:360)
>         at com.carrotsearch.randomizedtesting.ThreadLeakControl.forkTimeoutingTask(ThreadLeakControl.java:793)
>         at com.carrotsearch.randomizedtesting.ThreadLeakControl$3.evaluate(ThreadLeakControl.java:453)
>         at com.carrotsearch.randomizedtesting.RandomizedRunner.runSingleTest(RandomizedRunner.java:836)
>         at com.carrotsearch.randomizedtesting.RandomizedRunner$3.evaluate(RandomizedRunner.java:738)
>         at com.carrotsearch.randomizedtesting.RandomizedRunner$4.evaluate(RandomizedRunner.java:772)
>         at com.carrotsearch.randomizedtesting.RandomizedRunner$5.evaluate(RandomizedRunner.java:783)
>         at org.apache.lucene.util.AbstractBeforeAfterRule$1.evaluate(AbstractBeforeAfterRule.java:46)
>         at org.apache.lucene.util.TestRuleStoreClassName$1.evaluate(TestRuleStoreClassName.java:42)
>         at com.carrotsearch.randomizedtesting.rules.SystemPropertiesInvariantRule$1.evaluate(SystemPropertiesInvariantRule.java:55)
>         at com.carrotsearch.randomizedtesting.rules.NoShadowingOrOverridesOnMethodsRule$1.evaluate(NoShadowingOrOverridesOnMethodsRule.java:39)
>         at com.carrotsearch.randomizedtesting.rules.NoShadowingOrOverridesOnMethodsRule$1.evaluate(NoShadowingOrOverridesOnMethodsRule.java:39)
>         at com.carrotsearch.randomizedtesting.rules.StatementAdapter.evaluate(StatementAdapter.java:36)
>         at com.carrotsearch.randomizedtesting.rules.StatementAdapter.evaluate(StatementAdapter.java:36)
>         at com.carrotsearch.randomizedtesting.rules.StatementAdapter.evaluate(StatementAdapter.java:36)
>         at org.apache.lucene.util.TestRuleAssertionsRequired$1.evaluate(TestRuleAssertionsRequired.java:43)
>         at org.apache.lucene.util.TestRuleMarkFailure$1.evaluate(TestRuleMarkFailure.java:48)
>         at org.apache.lucene.util.TestRuleIgnoreAfterMaxFailures$1.evaluate(TestRuleIgnoreAfterMaxFailures.java:65)
>         at org.apache.lucene.util.TestRuleIgnoreTestSuites$1.evaluate(TestRuleIgnoreTestSuites.java:55)
>         at com.carrotsearch.randomizedtesting.rules.StatementAdapter.evaluate(StatementAdapter.java:36)
>         at com.carrotsearch.randomizedtesting.ThreadLeakControl$StatementRunner.run(ThreadLeakControl.java:360)
>         at java.lang.Thread.run(Thread.java:745)
>
>
>
>
> Build Log:
> [...truncated 8634 lines...]
>    [junit4] Suite: org.apache.lucene.uninverting.TestFieldCacheVsDocValues
>    [junit4]   2> NOTE: reproduce with: ant test  -Dtestcase=TestFieldCacheVsDocValues
-Dtests.method=testHugeBinaryValues -Dtests.seed=B2F2E797848F720B -Dtests.multiplier=3 -Dtests.slow=true
-Dtests.locale=sr_RS -Dtests.timezone=America/Cambridge_Bay -Dtests.file.encoding=UTF-8
>    [junit4] FAILURE 0.02s J1 | TestFieldCacheVsDocValues.testHugeBinaryValues <<<
>    [junit4]    > Throwable #1: java.lang.AssertionError
>    [junit4]    >        at __randomizedtesting.SeedInfo.seed([B2F2E797848F720B:51C934959CBDA284]:0)
>    [junit4]    >        at org.apache.lucene.uninverting.TestFieldCacheVsDocValues.testHugeBinaryValues(TestFieldCacheVsDocValues.java:188)
>    [junit4]    >        at java.lang.Thread.run(Thread.java:745)
>    [junit4] IGNOR/A 0.01s J1 | TestFieldCacheVsDocValues.testHugeBinaryValueLimit
>    [junit4]    > Assumption #1: test requires codec with limits on max binary field
length
>    [junit4]   2> NOTE: leaving temporary files on disk at: /mnt/ssd/jenkins/workspace/Lucene-Solr-trunk-Linux/lucene/build/misc/test/J1/./lucene.uninverting.TestFieldCacheVsDocValues-B2F2E797848F720B-001
>    [junit4]   2> NOTE: test params are: codec=Lucene46: {id=PostingsFormat(name=MockRandom),
indexed=PostingsFormat(name=Direct)}, docValues:{field=DocValuesFormat(name=Memory), dv=DocValuesFormat(name=Memory)},
sim=RandomSimilarityProvider(queryNorm=false,coord=yes): {}, locale=sr_RS, timezone=America/Cambridge_Bay
>    [junit4]   2> NOTE: Linux 3.8.0-39-generic i386/Oracle Corporation 1.7.0_55 (32-bit)/cpus=8,threads=1,free=16432776,total=52428800
>    [junit4]   2> NOTE: All tests run in this JVM: [TestUninvertingReader, TestIndexSplitter,
SweetSpotSimilarityTest, IndexSortingTest, TestFieldCacheSort, TestBlockJoinSorter, TestPKIndexSplitter,
TestMultiPassIndexSplitter, SortingAtomicReaderTest, TestSortingMergePolicy, TestFieldCache,
TestFieldCacheReopen, TestFieldCacheVsDocValues]
>    [junit4] Completed on J1 in 32.48s, 10 tests, 1 failure, 1 skipped <<< FAILURES!
>
> [...truncated 28 lines...]
> BUILD FAILED
> /mnt/ssd/jenkins/workspace/Lucene-Solr-trunk-Linux/build.xml:467: The following error
occurred while executing this line:
> /mnt/ssd/jenkins/workspace/Lucene-Solr-trunk-Linux/build.xml:447: The following error
occurred while executing this line:
> /mnt/ssd/jenkins/workspace/Lucene-Solr-trunk-Linux/build.xml:45: The following error
occurred while executing this line:
> /mnt/ssd/jenkins/workspace/Lucene-Solr-trunk-Linux/extra-targets.xml:37: The following
error occurred while executing this line:
> /mnt/ssd/jenkins/workspace/Lucene-Solr-trunk-Linux/lucene/build.xml:539: The following
error occurred while executing this line:
> /mnt/ssd/jenkins/workspace/Lucene-Solr-trunk-Linux/lucene/common-build.xml:2017: The
following error occurred while executing this line:
> /mnt/ssd/jenkins/workspace/Lucene-Solr-trunk-Linux/lucene/module-build.xml:60: The following
error occurred while executing this line:
> /mnt/ssd/jenkins/workspace/Lucene-Solr-trunk-Linux/lucene/common-build.xml:1296: The
following error occurred while executing this line:
> /mnt/ssd/jenkins/workspace/Lucene-Solr-trunk-Linux/lucene/common-build.xml:920: There
were test failures: 22 suites, 126 tests, 1 failure, 2 ignored (2 assumptions)
>
> Total time: 33 minutes 27 seconds
> Build step 'Invoke Ant' marked build as failure
> Description set: Java: 32bit/jdk1.7.0_55 -client -XX:+UseG1GC
> Archiving artifacts
> Recording test results
> Email was triggered for: Failure
> Sending email for trigger: Failure
>
>
>
>
> ---------------------------------------------------------------------
> To unsubscribe, e-mail: dev-unsubscribe@lucene.apache.org
> For additional commands, e-mail: dev-help@lucene.apache.org

---------------------------------------------------------------------
To unsubscribe, e-mail: dev-unsubscribe@lucene.apache.org
For additional commands, e-mail: dev-help@lucene.apache.org


Mime
View raw message