lucene-dev mailing list archives

Site index · List index
Message view « Date » · « Thread »
Top « Date » · « Thread »
From Robert Muir <rm...@apache.org>
Subject Re: [JENKINS] Lucene-trunk-Linux-java7-64-analyzers - Build # 4120 - Failure!
Date Thu, 01 May 2014 12:05:20 GMT
Ooops: I committed a fix

On Thu, May 1, 2014 at 7:59 AM,  <builder@flonkings.com> wrote:
> Build: builds.flonkings.com/job/Lucene-trunk-Linux-java7-64-analyzers/4120/
>
> 1 tests failed.
> REGRESSION:  org.apache.lucene.analysis.core.TestRandomChains.testRandomChainsWithLargeStrings
>
> Error Message:
> TokenStream implementation classes or at least their incrementToken() implementation
must be final
>
> Stack Trace:
> java.lang.AssertionError: TokenStream implementation classes or at least their incrementToken()
implementation must be final
>         at __randomizedtesting.SeedInfo.seed([CA0D432C2AA2AE3:66FB6B239BE40A10]:0)
>         at org.apache.lucene.analysis.TokenStream.assertFinal(TokenStream.java:120)
>         at org.apache.lucene.analysis.TokenStream.<init>(TokenStream.java:101)
>         at org.apache.lucene.analysis.TokenFilter.<init>(TokenFilter.java:33)
>         at org.apache.lucene.analysis.CrankyTokenFilter.<init>(CrankyTokenFilter.java:35)
>         at sun.reflect.NativeConstructorAccessorImpl.newInstance0(Native Method)
>         at sun.reflect.NativeConstructorAccessorImpl.newInstance(NativeConstructorAccessorImpl.java:57)
>         at sun.reflect.DelegatingConstructorAccessorImpl.newInstance(DelegatingConstructorAccessorImpl.java:45)
>         at java.lang.reflect.Constructor.newInstance(Constructor.java:526)
>         at org.apache.lucene.analysis.core.TestRandomChains$MockRandomAnalyzer.createComponent(TestRandomChains.java:681)
>         at org.apache.lucene.analysis.core.TestRandomChains$MockRandomAnalyzer.newFilterChain(TestRandomChains.java:793)
>         at org.apache.lucene.analysis.core.TestRandomChains$MockRandomAnalyzer.toString(TestRandomChains.java:670)
>         at java.lang.String.valueOf(String.java:2854)
>         at java.lang.StringBuilder.append(StringBuilder.java:128)
>         at org.apache.lucene.analysis.core.TestRandomChains.testRandomChainsWithLargeStrings(TestRandomChains.java:923)
>         at sun.reflect.NativeMethodAccessorImpl.invoke0(Native Method)
>         at sun.reflect.NativeMethodAccessorImpl.invoke(NativeMethodAccessorImpl.java:57)
>         at sun.reflect.DelegatingMethodAccessorImpl.invoke(DelegatingMethodAccessorImpl.java:43)
>         at java.lang.reflect.Method.invoke(Method.java:606)
>         at com.carrotsearch.randomizedtesting.RandomizedRunner.invoke(RandomizedRunner.java:1618)
>         at com.carrotsearch.randomizedtesting.RandomizedRunner$6.evaluate(RandomizedRunner.java:827)
>         at com.carrotsearch.randomizedtesting.RandomizedRunner$7.evaluate(RandomizedRunner.java:863)
>         at com.carrotsearch.randomizedtesting.RandomizedRunner$8.evaluate(RandomizedRunner.java:877)
>         at org.apache.lucene.util.TestRuleSetupTeardownChained$1.evaluate(TestRuleSetupTeardownChained.java:50)
>         at org.apache.lucene.util.TestRuleFieldCacheSanity$1.evaluate(TestRuleFieldCacheSanity.java:51)
>         at org.apache.lucene.util.AbstractBeforeAfterRule$1.evaluate(AbstractBeforeAfterRule.java:46)
>         at com.carrotsearch.randomizedtesting.rules.SystemPropertiesInvariantRule$1.evaluate(SystemPropertiesInvariantRule.java:55)
>         at org.apache.lucene.util.TestRuleThreadAndTestName$1.evaluate(TestRuleThreadAndTestName.java:49)
>         at org.apache.lucene.util.TestRuleIgnoreAfterMaxFailures$1.evaluate(TestRuleIgnoreAfterMaxFailures.java:65)
>         at org.apache.lucene.util.TestRuleMarkFailure$1.evaluate(TestRuleMarkFailure.java:48)
>         at com.carrotsearch.randomizedtesting.rules.StatementAdapter.evaluate(StatementAdapter.java:36)
>         at com.carrotsearch.randomizedtesting.ThreadLeakControl$StatementRunner.run(ThreadLeakControl.java:360)
>         at com.carrotsearch.randomizedtesting.ThreadLeakControl.forkTimeoutingTask(ThreadLeakControl.java:793)
>         at com.carrotsearch.randomizedtesting.ThreadLeakControl$3.evaluate(ThreadLeakControl.java:453)
>         at com.carrotsearch.randomizedtesting.RandomizedRunner.runSingleTest(RandomizedRunner.java:836)
>         at com.carrotsearch.randomizedtesting.RandomizedRunner$3.evaluate(RandomizedRunner.java:738)
>         at com.carrotsearch.randomizedtesting.RandomizedRunner$4.evaluate(RandomizedRunner.java:772)
>         at com.carrotsearch.randomizedtesting.RandomizedRunner$5.evaluate(RandomizedRunner.java:783)
>         at org.apache.lucene.util.AbstractBeforeAfterRule$1.evaluate(AbstractBeforeAfterRule.java:46)
>         at org.apache.lucene.util.TestRuleStoreClassName$1.evaluate(TestRuleStoreClassName.java:42)
>         at com.carrotsearch.randomizedtesting.rules.SystemPropertiesInvariantRule$1.evaluate(SystemPropertiesInvariantRule.java:55)
>         at com.carrotsearch.randomizedtesting.rules.NoShadowingOrOverridesOnMethodsRule$1.evaluate(NoShadowingOrOverridesOnMethodsRule.java:39)
>         at com.carrotsearch.randomizedtesting.rules.NoShadowingOrOverridesOnMethodsRule$1.evaluate(NoShadowingOrOverridesOnMethodsRule.java:39)
>         at com.carrotsearch.randomizedtesting.rules.StatementAdapter.evaluate(StatementAdapter.java:36)
>         at com.carrotsearch.randomizedtesting.rules.StatementAdapter.evaluate(StatementAdapter.java:36)
>         at com.carrotsearch.randomizedtesting.rules.StatementAdapter.evaluate(StatementAdapter.java:36)
>         at org.apache.lucene.util.TestRuleAssertionsRequired$1.evaluate(TestRuleAssertionsRequired.java:43)
>         at org.apache.lucene.util.TestRuleMarkFailure$1.evaluate(TestRuleMarkFailure.java:48)
>         at org.apache.lucene.util.TestRuleIgnoreAfterMaxFailures$1.evaluate(TestRuleIgnoreAfterMaxFailures.java:65)
>         at org.apache.lucene.util.TestRuleIgnoreTestSuites$1.evaluate(TestRuleIgnoreTestSuites.java:55)
>         at com.carrotsearch.randomizedtesting.rules.StatementAdapter.evaluate(StatementAdapter.java:36)
>         at com.carrotsearch.randomizedtesting.ThreadLeakControl$StatementRunner.run(ThreadLeakControl.java:360)
>         at java.lang.Thread.run(Thread.java:724)
>
>
>
>
> Build Log:
> [...truncated 686 lines...]
>    [junit4] Suite: org.apache.lucene.analysis.core.TestRandomChains
>    [junit4]   2> NOTE: reproduce with: ant test  -Dtestcase=TestRandomChains -Dtests.method=testRandomChainsWithLargeStrings
-Dtests.seed=CA0D432C2AA2AE3 -Dtests.slow=true -Dtests.locale=sq_AL -Dtests.timezone=Australia/NSW
-Dtests.file.encoding=ISO-8859-1
>    [junit4] FAILURE 7.69s J2 | TestRandomChains.testRandomChainsWithLargeStrings <<<
>    [junit4]    > Throwable #1: java.lang.AssertionError: TokenStream implementation
classes or at least their incrementToken() implementation must be final
>    [junit4]    >        at __randomizedtesting.SeedInfo.seed([CA0D432C2AA2AE3:66FB6B239BE40A10]:0)
>    [junit4]    >        at org.apache.lucene.analysis.TokenStream.assertFinal(TokenStream.java:120)
>    [junit4]    >        at org.apache.lucene.analysis.TokenStream.<init>(TokenStream.java:101)
>    [junit4]    >        at org.apache.lucene.analysis.TokenFilter.<init>(TokenFilter.java:33)
>    [junit4]    >        at org.apache.lucene.analysis.CrankyTokenFilter.<init>(CrankyTokenFilter.java:35)
>    [junit4]    >        at java.lang.reflect.Constructor.newInstance(Constructor.java:526)
>    [junit4]    >        at org.apache.lucene.analysis.core.TestRandomChains$MockRandomAnalyzer.createComponent(TestRandomChains.java:681)
>    [junit4]    >        at org.apache.lucene.analysis.core.TestRandomChains$MockRandomAnalyzer.newFilterChain(TestRandomChains.java:793)
>    [junit4]    >        at org.apache.lucene.analysis.core.TestRandomChains$MockRandomAnalyzer.toString(TestRandomChains.java:670)
>    [junit4]    >        at java.lang.String.valueOf(String.java:2854)
>    [junit4]    >        at java.lang.StringBuilder.append(StringBuilder.java:128)
>    [junit4]    >        at org.apache.lucene.analysis.core.TestRandomChains.testRandomChainsWithLargeStrings(TestRandomChains.java:923)
>    [junit4]    >        at java.lang.Thread.run(Thread.java:724)
>    [junit4]   2> NOTE: test params are: codec=Lucene41, sim=RandomSimilarityProvider(queryNorm=false,coord=crazy):
{}, locale=sq_AL, timezone=Australia/NSW
>    [junit4]   2> NOTE: Linux 3.2.0-26-generic amd64/Oracle Corporation 1.7.0_25 (64-bit)/cpus=8,threads=1,free=202210712,total=260046848
>    [junit4]   2> NOTE: All tests run in this JVM: [TestPrefixAwareTokenFilter, TestPatternReplaceCharFilterFactory,
TestStopFilter, TestTurkishAnalyzer, TestAllAnalyzersHaveFactories, TestCzechAnalyzer, TestPersianAnalyzer,
TestBasqueAnalyzer, TestCJKWidthFilter, TestMultiWordSynonyms, TestSoraniStemFilterFactory,
TestLengthFilterFactory, TestNGramFilters, TestIndonesianStemFilterFactory, TestThaiTokenizerFactory,
TestCharArraySet, TestScandinavianNormalizationFilterFactory, TestWordnetSynonymParser, TestRandomChains]
>    [junit4] Completed on J2 in 38.50s, 2 tests, 1 failure <<< FAILURES!
>
> [...truncated 391 lines...]
> BUILD FAILED
> /var/lib/jenkins/workspace/Lucene-trunk-Linux-java7-64-analyzers/checkout/lucene/module-build.xml:60:
The following error occurred while executing this line:
> /var/lib/jenkins/workspace/Lucene-trunk-Linux-java7-64-analyzers/checkout/lucene/common-build.xml:1296:
The following error occurred while executing this line:
> /var/lib/jenkins/workspace/Lucene-trunk-Linux-java7-64-analyzers/checkout/lucene/common-build.xml:920:
There were test failures: 252 suites, 1342 tests, 1 failure, 1 ignored
>
> Total time: 2 minutes 16 seconds
> Build step 'Invoke Ant' marked build as failure
> Recording test results
> Email was triggered for: Failure
> Sending email for trigger: Failure
>

---------------------------------------------------------------------
To unsubscribe, e-mail: dev-unsubscribe@lucene.apache.org
For additional commands, e-mail: dev-help@lucene.apache.org


Mime
View raw message