lucene-dev mailing list archives

Site index · List index
Message view « Date » · « Thread »
Top « Date » · « Thread »
From Apache Jenkins Server <jenk...@builds.apache.org>
Subject [JENKINS] Lucene-Solr-SmokeRelease-trunk - Build # 176 - Still Failing
Date Thu, 05 Jun 2014 13:01:08 GMT
Build: https://builds.apache.org/job/Lucene-Solr-SmokeRelease-trunk/176/

No tests ran.

Build Log:
[...truncated 53040 lines...]
prepare-release-no-sign:
    [mkdir] Created dir: /usr/home/hudson/hudson-slave/workspace/Lucene-Solr-SmokeRelease-trunk/lucene/build/fakeRelease
     [copy] Copying 431 files to /usr/home/hudson/hudson-slave/workspace/Lucene-Solr-SmokeRelease-trunk/lucene/build/fakeRelease/lucene
     [copy] Copying 230 files to /usr/home/hudson/hudson-slave/workspace/Lucene-Solr-SmokeRelease-trunk/lucene/build/fakeRelease/solr
     [exec] JAVA7_HOME is /home/hudson/tools/java/latest1.7
     [exec] NOTE: output encoding is US-ASCII
     [exec] 
     [exec] Load release URL "file:/usr/home/hudson/hudson-slave/workspace/Lucene-Solr-SmokeRelease-trunk/lucene/build/fakeRelease/"...
     [exec] 
     [exec] Test Lucene...
     [exec]   test basics...
     [exec]   get KEYS
     [exec]     0.1 MB in 0.01 sec (14.5 MB/sec)
     [exec]   check changes HTML...
     [exec]   download lucene-5.0.0-src.tgz...
     [exec]     27.2 MB in 0.04 sec (659.2 MB/sec)
     [exec]     verify md5/sha1 digests
     [exec]   download lucene-5.0.0.tgz...
     [exec]     60.8 MB in 0.14 sec (420.3 MB/sec)
     [exec]     verify md5/sha1 digests
     [exec]   download lucene-5.0.0.zip...
     [exec]     70.1 MB in 0.12 sec (603.5 MB/sec)
     [exec]     verify md5/sha1 digests
     [exec]   unpack lucene-5.0.0.tgz...
     [exec]     verify JAR metadata/identity/no javax.* or java.* classes...
     [exec]     test demo with 1.7...
     [exec]       got 5527 hits for query "lucene"
     [exec]     check Lucene's javadoc JAR
     [exec]   unpack lucene-5.0.0.zip...
     [exec]     verify JAR metadata/identity/no javax.* or java.* classes...
     [exec]     test demo with 1.7...
     [exec]       got 5527 hits for query "lucene"
     [exec]     check Lucene's javadoc JAR
     [exec]   unpack lucene-5.0.0-src.tgz...
     [exec]     make sure no JARs/WARs in src dist...
     [exec]     run "ant validate"
     [exec]     run tests w/ Java 7 and testArgs='-Dtests.jettyConnector=Socket  -Dtests.disableHdfs=true'...
     [exec]     test demo with 1.7...
     [exec]       got 238 hits for query "lucene"
     [exec]     generate javadocs w/ Java 7...
     [exec] 
     [exec] Crawl/parse...
     [exec] 
     [exec] Verify...
     [exec] 
     [exec] Test Solr...
     [exec]   test basics...
     [exec]   get KEYS
     [exec]     0.1 MB in 0.01 sec (14.2 MB/sec)
     [exec]   check changes HTML...
     [exec]   download solr-5.0.0-src.tgz...
     [exec]     33.0 MB in 0.13 sec (262.8 MB/sec)
     [exec]     verify md5/sha1 digests
     [exec]   download solr-5.0.0.tgz...
     [exec]     117.9 MB in 1.01 sec (117.0 MB/sec)
     [exec]     verify md5/sha1 digests
     [exec]   download solr-5.0.0.zip...
     [exec]     123.7 MB in 0.78 sec (159.3 MB/sec)
     [exec]     verify md5/sha1 digests
     [exec]   unpack solr-5.0.0.tgz...
     [exec]     verify JAR metadata/identity/no javax.* or java.* classes...
     [exec]     unpack lucene-5.0.0.tgz...
     [exec]       **WARNING**: skipping check of /usr/home/hudson/hudson-slave/workspace/Lucene-Solr-SmokeRelease-trunk/lucene/build/fakeReleaseTmp/unpack/solr-5.0.0/contrib/dataimporthandler/lib/mail-1.4.3.jar: it has javax.* classes
     [exec]       **WARNING**: skipping check of /usr/home/hudson/hudson-slave/workspace/Lucene-Solr-SmokeRelease-trunk/lucene/build/fakeReleaseTmp/unpack/solr-5.0.0/contrib/dataimporthandler/lib/activation-1.1.1.jar: it has javax.* classes
     [exec]     verify WAR metadata/contained JAR identity/no javax.* or java.* classes...
     [exec]     unpack lucene-5.0.0.tgz...
     [exec]     copying unpacked distribution for Java 7 ...
     [exec]     test solr example w/ Java 7...
     [exec]       start Solr instance (log=/usr/home/hudson/hudson-slave/workspace/Lucene-Solr-SmokeRelease-trunk/lucene/build/fakeReleaseTmp/unpack/solr-5.0.0-java7/solr-example.log)...
     [exec]       startup done
     [exec]       test utf8...
     [exec]       index example docs...
     [exec]       run query...
     [exec]       stop server (SIGINT)...
     [exec]   unpack solr-5.0.0.zip...
     [exec]     verify JAR metadata/identity/no javax.* or java.* classes...
     [exec]     unpack lucene-5.0.0.tgz...
     [exec]       **WARNING**: skipping check of /usr/home/hudson/hudson-slave/workspace/Lucene-Solr-SmokeRelease-trunk/lucene/build/fakeReleaseTmp/unpack/solr-5.0.0/contrib/dataimporthandler/lib/mail-1.4.3.jar: it has javax.* classes
     [exec]       **WARNING**: skipping check of /usr/home/hudson/hudson-slave/workspace/Lucene-Solr-SmokeRelease-trunk/lucene/build/fakeReleaseTmp/unpack/solr-5.0.0/contrib/dataimporthandler/lib/activation-1.1.1.jar: it has javax.* classes
     [exec]     verify WAR metadata/contained JAR identity/no javax.* or java.* classes...
     [exec]     unpack lucene-5.0.0.tgz...
     [exec]     copying unpacked distribution for Java 7 ...
     [exec]     test solr example w/ Java 7...
     [exec]       start Solr instance (log=/usr/home/hudson/hudson-slave/workspace/Lucene-Solr-SmokeRelease-trunk/lucene/build/fakeReleaseTmp/unpack/solr-5.0.0-java7/solr-example.log)...
     [exec]       startup done
     [exec]       test utf8...
     [exec]       index example docs...
     [exec]       run query...
     [exec]       stop server (SIGINT)...
     [exec]   unpack solr-5.0.0-src.tgz...
     [exec]     make sure no JARs/WARs in src dist...
     [exec]     run "ant validate"
     [exec]     run tests w/ Java 7 and testArgs='-Dtests.jettyConnector=Socket  -Dtests.disableHdfs=true'...
     [exec] 
     [exec] command "export JAVA_HOME="/home/hudson/tools/java/latest1.7" PATH="/home/hudson/tools/java/latest1.7/bin:$PATH" JAVACMD="/home/hudson/tools/java/latest1.7/bin/java"; ant clean test -Dtests.slow=false -Dtests.jettyConnector=Socket  -Dtests.disableHdfs=true" failed:
     [exec] Buildfile: /usr/home/hudson/hudson-slave/workspace/Lucene-Solr-SmokeRelease-trunk/lucene/build/fakeReleaseTmp/unpack/solr-5.0.0/solr/build.xml
     [exec]      [echo] Building solr...
     [exec] 
     [exec] clean:
     [exec]    [delete] Deleting directory /usr/home/hudson/hudson-slave/workspace/Lucene-Solr-SmokeRelease-trunk/lucene/build/fakeReleaseTmp/unpack/solr-5.0.0/solr/build
     [exec] 
     [exec] ivy-availability-check:
     [exec]      [echo] Building solr...
     [exec] 
     [exec] ivy-fail:
     [exec] 
     [exec] ivy-configure:
     [exec] [ivy:configure] :: Apache Ivy 2.3.0 - 20130110142753 :: http://ant.apache.org/ivy/ ::
     [exec] [ivy:configure] :: loading settings :: file = /usr/home/hudson/hudson-slave/workspace/Lucene-Solr-SmokeRelease-trunk/lucene/build/fakeReleaseTmp/unpack/solr-5.0.0/lucene/ivy-settings.xml
     [exec] 
     [exec] resolve-groovy:
     [exec] [ivy:cachepath] :: resolving dependencies :: org.codehaus.groovy#groovy-all-caller;working
     [exec] [ivy:cachepath] 	confs: [default]
     [exec] [ivy:cachepath] 	found org.codehaus.groovy#groovy-all;2.3.1 in public
     [exec] [ivy:cachepath] :: resolution report :: resolve 151ms :: artifacts dl 3ms
     [exec] 	---------------------------------------------------------------------
     [exec] 	|                  |            modules            ||   artifacts   |
     [exec] 	|       conf       | number| search|dwnlded|evicted|| number|dwnlded|
     [exec] 	---------------------------------------------------------------------
     [exec] 	|      default     |   1   |   0   |   0   |   0   ||   1   |   0   |
     [exec] 	---------------------------------------------------------------------
     [exec] 
     [exec] -init-totals:
     [exec]     [mkdir] Created dir: /usr/home/hudson/hudson-slave/workspace/Lucene-Solr-SmokeRelease-trunk/lucene/build/fakeReleaseTmp/unpack/solr-5.0.0/solr/build/solr
     [exec] 
     [exec] -clover.load:
     [exec] 
     [exec] test-solr-core:
     [exec]      [echo] Building solr-core...
     [exec] 
     [exec] test:
     [exec]      [echo] Building solr-core...
     [exec] 
     [exec] -clover.disable:
     [exec] 
     [exec] ivy-availability-check:
     [exec]      [echo] Building solr-core...
     [exec] 
     [exec] ivy-fail:
     [exec] 
     [exec] ivy-configure:
     [exec] [ivy:configure] :: loading settings :: file = /usr/home/hudson/hudson-slave/workspace/Lucene-Solr-SmokeRelease-trunk/lucene/build/fakeReleaseTmp/unpack/solr-5.0.0/lucene/ivy-settings.xml
     [exec] 
     [exec] -clover.load:
     [exec] 
     [exec] -clover.classpath:
     [exec] 
     [exec] -clover.setup:
     [exec] 
     [exec] clover:
     [exec] 
     [exec] check-analyzers-icu-uptodate:
     [exec] 
     [exec] jar-analyzers-icu:
     [exec] 
     [exec] -compile-analysis-extras:
     [exec]      [echo] Building solr-analysis-extras...
     [exec] 
     [exec] check-analyzers-icu-uptodate:
     [exec] 
     [exec] jar-analyzers-icu:
     [exec] 
     [exec] compile-solr-core:
     [exec]      [echo] Building solr-core...
     [exec] 
     [exec] compile-solrj:
     [exec]      [echo] Building solr-solrj...
     [exec] 
     [exec] check-lucene-core-uptodate:
     [exec] 
     [exec] jar-lucene-core:
     [exec] 
     [exec] check-analyzers-phonetic-uptodate:
     [exec] 
     [exec] jar-analyzers-phonetic:
     [exec] 
     [exec] check-analyzers-kuromoji-uptodate:
     [exec] 
     [exec] jar-analyzers-kuromoji:
     [exec] 
     [exec] check-codecs-uptodate:
     [exec] 
     [exec] jar-codecs:
     [exec] 
     [exec] check-expressions-uptodate:
     [exec] 
     [exec] jar-expressions:
     [exec] 
     [exec] check-suggest-uptodate:
     [exec] 
     [exec] jar-suggest:
     [exec] 
     [exec] check-highlighter-uptodate:
     [exec] 
     [exec] jar-highlighter:
     [exec] 
     [exec] check-memory-uptodate:
     [exec] 
     [exec] jar-memory:
     [exec] 
     [exec] check-misc-uptodate:
     [exec] 
     [exec] jar-misc:
     [exec] 
     [exec] check-spatial-uptodate:
     [exec] 
     [exec] jar-spatial:
     [exec] 
     [exec] check-grouping-uptodate:
     [exec] 
     [exec] jar-grouping:
     [exec] 
     [exec] check-queries-uptodate:
     [exec] 
     [exec] jar-queries:
     [exec] 
     [exec] check-queryparser-uptodate:
     [exec] 
     [exec] jar-queryparser:
     [exec] 
     [exec] check-join-uptodate:
     [exec] 
     [exec] jar-join:
     [exec] 
     [exec] prep-lucene-jars:
     [exec] 
     [exec] resolve-example:
     [exec]      [echo] Building solr-example...
     [exec] 
     [exec] ivy-availability-check:
     [exec]      [echo] Building solr-example...
     [exec] 
     [exec] ivy-fail:
     [exec] 
     [exec] ivy-fail:
     [exec] 
     [exec] ivy-configure:
     [exec] [ivy:configure] :: loading settings :: file = /usr/home/hudson/hudson-slave/workspace/Lucene-Solr-SmokeRelease-trunk/lucene/build/fakeReleaseTmp/unpack/solr-5.0.0/lucene/ivy-settings.xml
     [exec] 
     [exec] sync-hack:
     [exec] 
     [exec] resolve:
     [exec]      [echo] Building solr-example-DIH...
     [exec] 
     [exec] ivy-availability-check:
     [exec]      [echo] Building solr-example-DIH...
     [exec] 
     [exec] ivy-fail:
     [exec] 
     [exec] ivy-configure:
     [exec] [ivy:configure] :: loading settings :: file = /usr/home/hudson/hudson-slave/workspace/Lucene-Solr-SmokeRelease-trunk/lucene/build/fakeReleaseTmp/unpack/solr-5.0.0/lucene/ivy-settings.xml
     [exec] 
     [exec] resolve:
     [exec] 
     [exec] ivy-availability-check:
     [exec]      [echo] Building solr-solrj...
     [exec] 
     [exec] ivy-fail:
     [exec] 
     [exec] ivy-fail:
     [exec] 
     [exec] ivy-configure:
     [exec] [ivy:configure] :: loading settings :: file = /usr/home/hudson/hudson-slave/workspace/Lucene-Solr-SmokeRelease-trunk/lucene/build/fakeReleaseTmp/unpack/solr-5.0.0/lucene/ivy-settings.xml
     [exec] 
     [exec] resolve:
     [exec] 
     [exec] common.init:
     [exec] 
     [exec] compile-lucene-core:
     [exec] 
     [exec] ivy-availability-check:
     [exec] 
     [exec] ivy-fail:
     [exec] 
     [exec] ivy-configure:
     [exec] [ivy:configure] :: loading settings :: file = /usr/home/hudson/hudson-slave/workspace/Lucene-Solr-SmokeRelease-trunk/lucene/build/fakeReleaseTmp/unpack/solr-5.0.0/lucene/ivy-settings.xml
     [exec] 
     [exec] resolve:
     [exec] 
     [exec] init:
     [exec] 
     [exec] -clover.disable:
     [exec] 
     [exec] -clover.load:
     [exec] 
     [exec] -clover.classpath:
     [exec] 
     [exec] -clover.setup:
     [exec] 
     [exec] clover:
     [exec] 
     [exec] compile-core:
     [exec] 
     [exec] init:
     [exec] 
     [exec] -clover.disable:
     [exec] 
     [exec] -clover.load:
     [exec] 
     [exec] -clover.classpath:
     [exec] 
     [exec] -clover.setup:
     [exec] 
     [exec] clover:
     [exec] 
     [exec] common.compile-core:
     [exec]     [mkdir] Created dir: /usr/home/hudson/hudson-slave/workspace/Lucene-Solr-SmokeRelease-trunk/lucene/build/fakeReleaseTmp/unpack/solr-5.0.0/solr/build/solr-solrj/classes/java
     [exec]     [javac] Compiling 135 source files to /usr/home/hudson/hudson-slave/workspace/Lucene-Solr-SmokeRelease-trunk/lucene/build/fakeReleaseTmp/unpack/solr-5.0.0/solr/build/solr-solrj/classes/java
     [exec]     [javac] Note: Some input files use or override a deprecated API.
     [exec]     [javac] Note: Recompile with -Xlint:deprecation for details.
     [exec]     [javac] Note: Some input files use unchecked or unsafe operations.
     [exec]     [javac] Note: Recompile with -Xlint:unchecked for details.
     [exec] 
     [exec] compile-core:
     [exec] 
     [exec] check-lucene-core-uptodate:
     [exec] 
     [exec] jar-lucene-core:
     [exec] 
     [exec] check-analyzers-phonetic-uptodate:
     [exec] 
     [exec] jar-analyzers-phonetic:
     [exec] 
     [exec] check-analyzers-kuromoji-uptodate:
     [exec] 
     [exec] jar-analyzers-kuromoji:
     [exec] 
     [exec] check-codecs-uptodate:
     [exec] 
     [exec] jar-codecs:
     [exec] 
     [exec] check-expressions-uptodate:
     [exec] 
     [exec] jar-expressions:
     [exec] 
     [exec] check-suggest-uptodate:
     [exec] 
     [exec] jar-suggest:
     [exec] 
     [exec] check-highlighter-uptodate:
     [exec] 
     [exec] jar-highlighter:
     [exec] 
     [exec] check-memory-uptodate:
     [exec] 
     [exec] jar-memory:
     [exec] 
     [exec] check-misc-uptodate:
     [exec] 
     [exec] jar-misc:
     [exec] 
     [exec] check-spatial-uptodate:
     [exec] 
     [exec] jar-spatial:
     [exec] 
     [exec] check-grouping-uptodate:
     [exec] 
     [exec] jar-grouping:
     [exec] 
     [exec] check-queries-uptodate:
     [exec] 
     [exec] jar-queries:
     [exec] 
     [exec] check-queryparser-uptodate:
     [exec] 
     [exec] jar-queryparser:
     [exec] 
     [exec] check-join-uptodate:
     [exec] 
     [exec] jar-join:
     [exec] 
     [exec] prep-lucene-jars:
     [exec] 
     [exec] resolve-example:
     [exec]      [echo] Building solr-example...
     [exec] 
     [exec] ivy-availability-check:
     [exec]      [echo] Building solr-example...
     [exec] 
     [exec] ivy-fail:
     [exec] 
     [exec] ivy-fail:
     [exec] 
     [exec] ivy-configure:
     [exec] [ivy:configure] :: loading settings :: file = /usr/home/hudson/hudson-slave/workspace/Lucene-Solr-SmokeRelease-trunk/lucene/build/fakeReleaseTmp/unpack/solr-5.0.0/lucene/ivy-settings.xml
     [exec] 
     [exec] sync-hack:
     [exec] 
     [exec] resolve:
     [exec]      [echo] Building solr-example-DIH...
     [exec] 
     [exec] ivy-availability-check:
     [exec]      [echo] Building solr-example-DIH...
     [exec] 
     [exec] ivy-fail:
     [exec] 
     [exec] ivy-configure:
     [exec] [ivy:configure] :: loading settings :: file = /usr/home/hudson/hudson-slave/workspace/Lucene-Solr-SmokeRelease-trunk/lucene/build/fakeReleaseTmp/unpack/solr-5.0.0/lucene/ivy-settings.xml
     [exec] 
     [exec] resolve:
     [exec] 
     [exec] ivy-availability-check:
     [exec]      [echo] Building solr-core...
     [exec] 
     [exec] ivy-fail:
     [exec] 
     [exec] ivy-fail:
     [exec] 
     [exec] ivy-configure:
     [exec] [ivy:configure] :: loading settings :: file = /usr/home/hudson/hudson-slave/workspace/Lucene-Solr-SmokeRelease-trunk/lucene/build/fakeReleaseTmp/unpack/solr-5.0.0/lucene/ivy-settings.xml
     [exec] 
     [exec] resolve:
     [exec] 
     [exec] common.init:
     [exec] 
     [exec] compile-lucene-core:
     [exec] 
     [exec] ivy-availability-check:
     [exec] 
     [exec] ivy-fail:
     [exec] 
     [exec] ivy-configure:
     [exec] [ivy:configure] :: loading settings :: file = /usr/home/hudson/hudson-slave/workspace/Lucene-Solr-SmokeRelease-trunk/lucene/build/fakeReleaseTmp/unpack/solr-5.0.0/lucene/ivy-settings.xml
     [exec] 
     [exec] resolve:
     [exec] 
     [exec] init:
     [exec] 
     [exec] -clover.disable:
     [exec] 
     [exec] -clover.load:
     [exec] 
     [exec] -clover.classpath:
     [exec] 
     [exec] -clover.setup:
     [exec] 
     [exec] clover:
     [exec] 
     [exec] compile-core:
     [exec] 
     [exec] init:
     [exec] 
     [exec] -clover.disable:
     [exec] 
     [exec] -clover.load:
     [exec] 
     [exec] -clover.classpath:
     [exec] 
     [exec] -clover.setup:
     [exec] 
     [exec] clover:
     [exec] 
     [exec] common.compile-core:
     [exec]     [mkdir] Created dir: /usr/home/hudson/hudson-slave/workspace/Lucene-Solr-SmokeRelease-trunk/lucene/build/fakeReleaseTmp/unpack/solr-5.0.0/solr/build/solr-core/classes/java
     [exec]     [javac] Compiling 713 source files to /usr/home/hudson/hudson-slave/workspace/Lucene-Solr-SmokeRelease-trunk/lucene/build/fakeReleaseTmp/unpack/solr-5.0.0/solr/build/solr-core/classes/java
     [exec]     [javac] Note: Some input files use or override a deprecated API.
     [exec]     [javac] Note: Recompile with -Xlint:deprecation for details.
     [exec]     [javac] Note: Some input files use unchecked or unsafe operations.
     [exec]     [javac] Note: Recompile with -Xlint:unchecked for details.
     [exec] 
     [exec] common-solr.compile-core:
     [exec] 
     [exec] compile-core:
     [exec] 
     [exec] compile-solrj:
     [exec]      [echo] Building solr-solrj...
     [exec] 
     [exec] check-lucene-core-uptodate:
     [exec] 
     [exec] jar-lucene-core:
     [exec] 
     [exec] check-analyzers-phonetic-uptodate:
     [exec] 
     [exec] jar-analyzers-phonetic:
     [exec] 
     [exec] check-analyzers-kuromoji-uptodate:
     [exec] 
     [exec] jar-analyzers-kuromoji:
     [exec] 
     [exec] check-codecs-uptodate:
     [exec] 
     [exec] jar-codecs:
     [exec] 
     [exec] check-expressions-uptodate:
     [exec] 
     [exec] jar-expressions:
     [exec] 
     [exec] check-suggest-uptodate:
     [exec] 
     [exec] jar-suggest:
     [exec] 
     [exec] check-highlighter-uptodate:
     [exec] 
     [exec] jar-highlighter:
     [exec] 
     [exec] check-memory-uptodate:
     [exec] 
     [exec] jar-memory:
     [exec] 
     [exec] check-misc-uptodate:
     [exec] 
     [exec] jar-misc:
     [exec] 
     [exec] check-spatial-uptodate:
     [exec] 
     [exec] jar-spatial:
     [exec] 
     [exec] check-grouping-uptodate:
     [exec] 
     [exec] jar-grouping:
     [exec] 
     [exec] check-queries-uptodate:
     [exec] 
     [exec] jar-queries:
     [exec] 
     [exec] check-queryparser-uptodate:
     [exec] 
     [exec] jar-queryparser:
     [exec] 
     [exec] check-join-uptodate:
     [exec] 
     [exec] jar-join:
     [exec] 
     [exec] prep-lucene-jars:
     [exec] 
     [exec] resolve-example:
     [exec]      [echo] Building solr-example...
     [exec] 
     [exec] ivy-availability-check:
     [exec]      [echo] Building solr-example...
     [exec] 
     [exec] ivy-fail:
     [exec] 
     [exec] ivy-fail:
     [exec] 
     [exec] ivy-configure:
     [exec] [ivy:configure] :: loading settings :: file = /usr/home/hudson/hudson-slave/workspace/Lucene-Solr-SmokeRelease-trunk/lucene/build/fakeReleaseTmp/unpack/solr-5.0.0/lucene/ivy-settings.xml
     [exec] 
     [exec] sync-hack:
     [exec] 
     [exec] resolve:
     [exec]      [echo] Building solr-example-DIH...
     [exec] 
     [exec] ivy-availability-check:
     [exec]      [echo] Building solr-example-DIH...
     [exec] 
     [exec] ivy-fail:
     [exec] 
     [exec] ivy-configure:
     [exec] [ivy:configure] :: loading settings :: file = /usr/home/hudson/hudson-slave/workspace/Lucene-Solr-SmokeRelease-trunk/lucene/build/fakeReleaseTmp/unpack/solr-5.0.0/lucene/ivy-settings.xml
     [exec] 
     [exec] resolve:
     [exec] 
     [exec] ivy-availability-check:
     [exec]      [echo] Building solr-solrj...
     [exec] 
     [exec] ivy-fail:
     [exec] 
     [exec] ivy-fail:
     [exec] 
     [exec] ivy-configure:
     [exec] [ivy:configure] :: loading settings :: file = /usr/home/hudson/hudson-slave/workspace/Lucene-Solr-SmokeRelease-trunk/lucene/build/fakeReleaseTmp/unpack/solr-5.0.0/lucene/ivy-settings.xml
     [exec] 
     [exec] resolve:
     [exec] 
     [exec] common.init:
     [exec] 
     [exec] compile-lucene-core:
     [exec] 
     [exec] ivy-availability-check:
     [exec] 
     [exec] ivy-fail:
     [exec] 
     [exec] ivy-configure:
     [exec] [ivy:configure] :: loading settings :: file = /usr/home/hudson/hudson-slave/workspace/Lucene-Solr-SmokeRelease-trunk/lucene/build/fakeReleaseTmp/unpack/solr-5.0.0/lucene/ivy-settings.xml
     [exec] 
     [exec] resolve:
     [exec] 
     [exec] init:
     [exec] 
     [exec] -clover.disable:
     [exec] 
     [exec] -clover.load:
     [exec] 
     [exec] -clover.classpath:
     [exec] 
     [exec] -clover.setup:
     [exec] 
     [exec] clover:
     [exec] 
     [exec] compile-core:
     [exec] 
     [exec] init:
     [exec] 
     [exec] -clover.disable:
     [exec] 
     [exec] -clover.load:
     [exec] 
     [exec] -clover.classpath:
     [exec] 
     [exec] -clover.setup:
     [exec] 
     [exec] clover:
     [exec] 
     [exec] common.compile-core:
     [exec] 
     [exec] compile-core:
     [exec] 
     [exec] check-lucene-core-uptodate:
     [exec] 
     [exec] jar-lucene-core:
     [exec] 
     [exec] check-analyzers-phonetic-uptodate:
     [exec] 
     [exec] jar-analyzers-phonetic:
     [exec] 
     [exec] check-analyzers-kuromoji-uptodate:
     [exec] 
     [exec] jar-analyzers-kuromoji:
     [exec] 
     [exec] check-codecs-uptodate:
     [exec] 
     [exec] jar-codecs:
     [exec] 
     [exec] check-expressions-uptodate:
     [exec] 
     [exec] jar-expressions:
     [exec] 
     [exec] check-suggest-uptodate:
     [exec] 
     [exec] jar-suggest:
     [exec] 
     [exec] check-highlighter-uptodate:
     [exec] 
     [exec] jar-highlighter:
     [exec] 
     [exec] check-memory-uptodate:
     [exec] 
     [exec] jar-memory:
     [exec] 
     [exec] check-misc-uptodate:
     [exec] 
     [exec] jar-misc:
     [exec] 
     [exec] check-spatial-uptodate:
     [exec] 
     [exec] jar-spatial:
     [exec] 
     [exec] check-grouping-uptodate:
     [exec] 
     [exec] jar-grouping:
     [exec] 
     [exec] check-queries-uptodate:
     [exec] 
     [exec] jar-queries:
     [exec] 
     [exec] check-queryparser-uptodate:
     [exec] 
     [exec] jar-queryparser:
     [exec] 
     [exec] check-join-uptodate:
     [exec] 
     [exec] jar-join:
     [exec] 
     [exec] prep-lucene-jars:
     [exec] 
     [exec] resolve-example:
     [exec]      [echo] Building solr-example...
     [exec] 
     [exec] ivy-availability-check:
     [exec]      [echo] Building solr-example...
     [exec] 
     [exec] ivy-fail:
     [exec] 
     [exec] ivy-fail:
     [exec] 
     [exec] ivy-configure:
     [exec] [ivy:configure] :: loading settings :: file = /usr/home/hudson/hudson-slave/workspace/Lucene-Solr-SmokeRelease-trunk/lucene/build/fakeReleaseTmp/unpack/solr-5.0.0/lucene/ivy-settings.xml
     [exec] 
     [exec] sync-hack:
     [exec] 
     [exec] resolve:
     [exec]      [echo] Building solr-example-DIH...
     [exec] 
     [exec] ivy-availability-check:
     [exec]      [echo] Building solr-example-DIH...
     [exec] 
     [exec] ivy-fail:
     [exec] 
     [exec] ivy-configure:
     [exec] [ivy:configure] :: loading settings :: file = /usr/home/hudson/hudson-slave/workspace/Lucene-Solr-SmokeRelease-trunk/lucene/build/fakeReleaseTmp/unpack/solr-5.0.0/lucene/ivy-settings.xml
     [exec] 
     [exec] resolve:
     [exec] 
     [exec] ivy-availability-check:
     [exec]      [echo] Building solr-analysis-extras...
     [exec] 
     [exec] ivy-fail:
     [exec] 
     [exec] ivy-fail:
     [exec] 
     [exec] ivy-configure:
     [exec] [ivy:configure] :: loading settings :: file = /usr/home/hudson/hudson-slave/workspace/Lucene-Solr-SmokeRelease-trunk/lucene/build/fakeReleaseTmp/unpack/solr-5.0.0/lucene/ivy-settings.xml
     [exec] 
     [exec] resolve:
     [exec] 
     [exec] common.init:
     [exec] 
     [exec] compile-lucene-core:
     [exec] 
     [exec] ivy-availability-check:
     [exec] 
     [exec] ivy-fail:
     [exec] 
     [exec] ivy-configure:
     [exec] [ivy:configure] :: loading settings :: file = /usr/home/hudson/hudson-slave/workspace/Lucene-Solr-SmokeRelease-trunk/lucene/build/fakeReleaseTmp/unpack/solr-5.0.0/lucene/ivy-settings.xml
     [exec] 
     [exec] resolve:
     [exec] 
     [exec] init:
     [exec] 
     [exec] -clover.disable:
     [exec] 
     [exec] -clover.load:
     [exec] 
     [exec] -clover.classpath:
     [exec] 
     [exec] -clover.setup:
     [exec] 
     [exec] clover:
     [exec] 
     [exec] compile-core:
     [exec] 
     [exec] init:
     [exec] 
     [exec] -clover.disable:
     [exec] 
     [exec] -clover.load:
     [exec] 
     [exec] -clover.classpath:
     [exec] 
     [exec] -clover.setup:
     [exec] 
     [exec] clover:
     [exec] 
     [exec] common.compile-core:
     [exec]     [mkdir] Created dir: /usr/home/hudson/hudson-slave/workspace/Lucene-Solr-SmokeRelease-trunk/lucene/build/fakeReleaseTmp/unpack/solr-5.0.0/solr/build/contrib/solr-analysis-extras/classes/java
     [exec]     [javac] Compiling 1 source file to /usr/home/hudson/hudson-slave/workspace/Lucene-Solr-SmokeRelease-trunk/lucene/build/fakeReleaseTmp/unpack/solr-5.0.0/solr/build/contrib/solr-analysis-extras/classes/java
     [exec]     [javac] Note: /usr/home/hudson/hudson-slave/workspace/Lucene-Solr-SmokeRelease-trunk/lucene/build/fakeReleaseTmp/unpack/solr-5.0.0/solr/contrib/analysis-extras/src/java/org/apache/solr/schema/ICUCollationField.java uses or overrides a deprecated API.
     [exec]     [javac] Note: Recompile with -Xlint:deprecation for details.
     [exec] 
     [exec] common-solr.compile-core:
     [exec] 
     [exec] solr-contrib-build.compile-core:
     [exec] 
     [exec] compile-core:
     [exec] 
     [exec] compile:
     [exec] 
     [exec] compile-solr-test-framework:
     [exec]      [echo] Building solr-test-framework...
     [exec] 
     [exec] ivy-availability-check:
     [exec]      [echo] Building solr-test-framework...
     [exec] 
     [exec] ivy-fail:
     [exec] 
     [exec] ivy-configure:
     [exec] [ivy:configure] :: loading settings :: file = /usr/home/hudson/hudson-slave/workspace/Lucene-Solr-SmokeRelease-trunk/lucene/build/fakeReleaseTmp/unpack/solr-5.0.0/lucene/ivy-settings.xml
     [exec] 
     [exec] resolve:
     [exec] 
     [exec] compile-solr-core:
     [exec]      [echo] Building solr-core...
     [exec] 
     [exec] compile-solrj:
     [exec]      [echo] Building solr-solrj...
     [exec] 
     [exec] check-lucene-core-uptodate:
     [exec] 
     [exec] jar-lucene-core:
     [exec] 
     [exec] check-analyzers-phonetic-uptodate:
     [exec] 
     [exec] jar-analyzers-phonetic:
     [exec] 
     [exec] check-analyzers-kuromoji-uptodate:
     [exec] 
     [exec] jar-analyzers-kuromoji:
     [exec] 
     [exec] check-codecs-uptodate:
     [exec] 
     [exec] jar-codecs:
     [exec] 
     [exec] check-expressions-uptodate:
     [exec] 
     [exec] jar-expressions:
     [exec] 
     [exec] check-suggest-uptodate:
     [exec] 
     [exec] jar-suggest:
     [exec] 
     [exec] check-highlighter-uptodate:
     [exec] 
     [exec] jar-highlighter:
     [exec] 
     [exec] check-memory-uptodate:
     [exec] 
     [exec] jar-memory:
     [exec] 
     [exec] check-misc-uptodate:
     [exec] 
     [exec] jar-misc:
     [exec] 
     [exec] check-spatial-uptodate:
     [exec] 
     [exec] jar-spatial:
     [exec] 
     [exec] check-grouping-uptodate:
     [exec] 
     [exec] jar-grouping:
     [exec] 
     [exec] check-queries-uptodate:
     [exec] 
     [exec] jar-queries:
     [exec] 
     [exec] check-queryparser-uptodate:
     [exec] 
     [exec] jar-queryparser:
     [exec] 
     [exec] check-join-uptodate:
     [exec] 
     [exec] jar-join:
     [exec] 
     [exec] prep-lucene-jars:
     [exec] 
     [exec] resolve-example:
     [exec]      [echo] Building solr-example...
     [exec] 
     [exec] ivy-availability-check:
     [exec]      [echo] Building solr-example...
     [exec] 
     [exec] ivy-fail:
     [exec] 
     [exec] ivy-fail:
     [exec] 
     [exec] ivy-configure:
     [exec] [ivy:configure] :: loading settings :: file = /usr/home/hudson/hudson-slave/workspace/Lucene-Solr-SmokeRelease-trunk/lucene/build/fakeReleaseTmp/unpack/solr-5.0.0/lucene/ivy-settings.xml
     [exec] 
     [exec] sync-hack:
     [exec] 
     [exec] resolve:
     [exec]      [echo] Building solr-example-DIH...
     [exec] 
     [exec] ivy-availability-check:
     [exec]      [echo] Building solr-example-DIH...
     [exec] 
     [exec] ivy-fail:
     [exec] 
     [exec] ivy-configure:
     [exec] [ivy:configure] :: loading settings :: file = /usr/home/hudson/hudson-slave/workspace/Lucene-Solr-SmokeRelease-trunk/lucene/build/fakeReleaseTmp/unpack/solr-5.0.0/lucene/ivy-settings.xml
     [exec] 
     [exec] resolve:
     [exec] 
     [exec] ivy-availability-check:
     [exec]      [echo] Building solr-solrj...
     [exec] 
     [exec] ivy-fail:
     [exec] 
     [exec] ivy-fail:
     [exec] 
     [exec] ivy-configure:
     [exec] [ivy:configure] :: loading settings :: file = /usr/home/hudson/hudson-slave/workspace/Lucene-Solr-SmokeRelease-trunk/lucene/build/fakeReleaseTmp/unpack/solr-5.0.0/lucene/ivy-settings.xml
     [exec] 
     [exec] resolve:
     [exec] 
     [exec] common.init:
     [exec] 
     [exec] compile-lucene-core:
     [exec] 
     [exec] ivy-availability-check:
     [exec] 
     [exec] ivy-fail:
     [exec] 
     [exec] ivy-configure:
     [exec] [ivy:configure] :: loading settings :: file = /usr/home/hudson/hudson-slave/workspace/Lucene-Solr-SmokeRelease-trunk/lucene/build/fakeReleaseTmp/unpack/solr-5.0.0/lucene/ivy-settings.xml
     [exec] 
     [exec] resolve:
     [exec] 
     [exec] init:
     [exec] 
     [exec] -clover.disable:
     [exec] 
     [exec] -clover.load:
     [exec] 
     [exec] -clover.classpath:
     [exec] 
     [exec] -clover.setup:
     [exec] 
     [exec] clover:
     [exec] 
     [exec] compile-core:
     [exec] 
     [exec] init:
     [exec] 
     [exec] -clover.disable:
     [exec] 
     [exec] -clover.load:
     [exec] 
     [exec] -clover.classpath:
     [exec] 
     [exec] -clover.setup:
     [exec] 
     [exec] clover:
     [exec] 
     [exec] common.compile-core:
     [exec] 
     [exec] compile-core:
     [exec] 
     [exec] check-lucene-core-uptodate:
     [exec] 
     [exec] jar-lucene-core:
     [exec] 
     [exec] check-analyzers-phonetic-uptodate:
     [exec] 
     [exec] jar-analyzers-phonetic:
     [exec] 
     [exec] check-analyzers-kuromoji-uptodate:
     [exec] 
     [exec] jar-analyzers-kuromoji:
     [exec] 
     [exec] check-codecs-uptodate:
     [exec] 
     [exec] jar-codecs:
     [exec] 
     [exec] check-expressions-uptodate:
     [exec] 
     [exec] jar-expressions:
     [exec] 
     [exec] check-suggest-uptodate:
     [exec] 
     [exec] jar-suggest:
     [exec] 
     [exec] check-highlighter-uptodate:
     [exec] 
     [exec] jar-highlighter:
     [exec] 
     [exec] check-memory-uptodate:
     [exec] 
     [exec] jar-memory:
     [exec] 
     [exec] check-misc-uptodate:
     [exec] 
     [exec] jar-misc:
     [exec] 
     [exec] check-spatial-uptodate:
     [exec] 
     [exec] jar-spatial:
     [exec] 
     [exec] check-grouping-uptodate:
     [exec] 
     [exec] jar-grouping:
     [exec] 
     [exec] check-queries-uptodate:
     [exec] 
     [exec] jar-queries:
     [exec] 
     [exec] check-queryparser-uptodate:
     [exec] 
     [exec] jar-queryparser:
     [exec] 
     [exec] check-join-uptodate:
     [exec] 
     [exec] jar-join:
     [exec] 
     [exec] prep-lucene-jars:
     [exec] 
     [exec] resolve-example:
     [exec]      [echo] Building solr-example...
     [exec] 
     [exec] ivy-availability-check:
     [exec]      [echo] Building solr-example...
     [exec] 
     [exec] ivy-fail:
     [exec] 
     [exec] ivy-fail:
     [exec] 
     [exec] ivy-configure:
     [exec] [ivy:configure] :: loading settings :: file = /usr/home/hudson/hudson-slave/workspace/Lucene-Solr-SmokeRelease-trunk/lucene/build/fakeReleaseTmp/unpack/solr-5.0.0/lucene/ivy-settings.xml
     [exec] 
     [exec] sync-hack:
     [exec] 
     [exec] resolve:
     [exec]      [echo] Building solr-example-DIH...
     [exec] 
     [exec] ivy-availability-check:
     [exec]      [echo] Building solr-example-DIH...
     [exec] 
     [exec] ivy-fail:
     [exec] 
     [exec] ivy-configure:
     [exec] [ivy:configure] :: loading settings :: file = /usr/home/hudson/hudson-slave/workspace/Lucene-Solr-SmokeRelease-trunk/lucene/build/fakeReleaseTmp/unpack/solr-5.0.0/lucene/ivy-settings.xml
     [exec] 
     [exec] resolve:
     [exec] 
     [exec] ivy-availability-check:
     [exec]      [echo] Building solr-core...
     [exec] 
     [exec] ivy-fail:
     [exec] 
     [exec] ivy-fail:
     [exec] 
     [exec] ivy-configure:
     [exec] [ivy:configure] :: loading settings :: file = /usr/home/hudson/hudson-slave/workspace/Lucene-Solr-SmokeRelease-trunk/lucene/build/fakeReleaseTmp/unpack/solr-5.0.0/lucene/ivy-settings.xml
     [exec] 
     [exec] resolve:
     [exec] 
     [exec] common.init:
     [exec] 
     [exec] compile-lucene-core:
     [exec] 
     [exec] ivy-availability-check:
     [exec] 
     [exec] ivy-fail:
     [exec] 
     [exec] ivy-configure:
     [exec] [ivy:configure] :: loading settings :: file = /usr/home/hudson/hudson-slave/workspace/Lucene-Solr-SmokeRelease-trunk/lucene/build/fakeReleaseTmp/unpack/solr-5.0.0/lucene/ivy-settings.xml
     [exec] 
     [exec] resolve:
     [exec] 
     [exec] init:
     [exec] 
     [exec] -clover.disable:
     [exec] 
     [exec] -clover.load:
     [exec] 
     [exec] -clover.classpath:
     [exec] 
     [exec] -clover.setup:
     [exec] 
     [exec] clover:
     [exec] 
     [exec] compile-core:
     [exec] 
     [exec] init:
     [exec] 
     [exec] -clover.disable:
     [exec] 
     [exec] -clover.load:
     [exec] 
     [exec] -clover.classpath:
     [exec] 
     [exec] -clover.setup:
     [exec] 
     [exec] clover:
     [exec] 
     [exec] common.compile-core:
     [exec] 
     [exec] common-solr.compile-core:
     [exec] 
     [exec] compile-core:
     [exec] 
     [exec] compile-test-framework:
     [exec] 
     [exec] compile-test-framework:
     [exec] 
     [exec] ivy-availability-check:
     [exec] 
     [exec] ivy-fail:
     [exec] 
     [exec] ivy-configure:
     [exec] [ivy:configure] :: loading settings :: file = /usr/home/hudson/hudson-slave/workspace/Lucene-Solr-SmokeRelease-trunk/lucene/build/fakeReleaseTmp/unpack/solr-5.0.0/lucene/ivy-settings.xml
     [exec] 
     [exec] resolve:
     [exec] 
     [exec] init:
     [exec] 
     [exec] compile-lucene-core:
     [exec] 
     [exec] ivy-availability-check:
     [exec] 
     [exec] ivy-fail:
     [exec] 
     [exec] ivy-configure:
     [exec] [ivy:configure] :: loading settings :: file = /usr/home/hudson/hudson-slave/workspace/Lucene-Solr-SmokeRelease-trunk/lucene/build/fakeReleaseTmp/unpack/solr-5.0.0/lucene/ivy-settings.xml
     [exec] 
     [exec] resolve:
     [exec] 
     [exec] init:
     [exec] 
     [exec] -clover.disable:
     [exec] 
     [exec] -clover.load:
     [exec] 
     [exec] -clover.classpath:
     [exec] 
     [exec] -clover.setup:
     [exec] 
     [exec] clover:
     [exec] 
     [exec] compile-core:
     [exec] 
     [exec] compile-codecs:
     [exec]      [echo] Building codecs...
     [exec] 
     [exec] ivy-availability-check:
     [exec]      [echo] Building codecs...
     [exec] 
     [exec] ivy-fail:
     [exec] 
     [exec] ivy-configure:
     [exec] [ivy:configure] :: loading settings :: file = /usr/home/hudson/hudson-slave/workspace/Lucene-Solr-SmokeRelease-trunk/lucene/build/fakeReleaseTmp/unpack/solr-5.0.0/lucene/ivy-settings.xml
     [exec] 
     [exec] resolve:
     [exec] 
     [exec] common.init:
     [exec] 
     [exec] compile-lucene-core:
     [exec] 
     [exec] init:
     [exec] 
     [exec] -clover.disable:
     [exec] 
     [exec] -clover.load:
     [exec] 
     [exec] -clover.classpath:
     [exec] 
     [exec] -clover.setup:
     [exec] 
     [exec] clover:
     [exec] 
     [exec] compile-core:
     [exec] 
     [exec] -clover.disable:
     [exec] 
     [exec] -clover.load:
     [exec] 
     [exec] -clover.classpath:
     [exec] 
     [exec] -clover.setup:
     [exec] 
     [exec] clover:
     [exec] 
     [exec] common.compile-core:
     [exec] 
     [exec] compile-core:
     [exec] 
     [exec] compile-core:
     [exec]     [mkdir] Created dir: /usr/home/hudson/hudson-slave/workspace/Lucene-Solr-SmokeRelease-trunk/lucene/build/fakeReleaseTmp/unpack/solr-5.0.0/solr/build/solr-test-framework/classes/java
     [exec]     [javac] Compiling 33 source files to /usr/home/hudson/hudson-slave/workspace/Lucene-Solr-SmokeRelease-trunk/lucene/build/fakeReleaseTmp/unpack/solr-5.0.0/solr/build/solr-test-framework/classes/java
     [exec]     [javac] Note: Some input files use or override a deprecated API.
     [exec]     [javac] Note: Recompile with -Xlint:deprecation for details.
     [exec]     [javac] Note: Some input files use unchecked or unsafe operations.
     [exec]     [javac] Note: Recompile with -Xlint:unchecked for details.
     [exec] 
     [exec] compile-solrj:
     [exec]      [echo] Building solr-solrj...
     [exec] 
     [exec] check-lucene-core-uptodate:
     [exec] 
     [exec] jar-lucene-core:
     [exec] 
     [exec] check-analyzers-phonetic-uptodate:
     [exec] 
     [exec] jar-analyzers-phonetic:
     [exec] 
     [exec] check-analyzers-kuromoji-uptodate:
     [exec] 
     [exec] jar-analyzers-kuromoji:
     [exec] 
     [exec] check-codecs-uptodate:
     [exec] 
     [exec] jar-codecs:
     [exec] 
     [exec] check-expressions-uptodate:
     [exec] 
     [exec] jar-expressions:
     [exec] 
     [exec] check-suggest-uptodate:
     [exec] 
     [exec] jar-suggest:
     [exec] 
     [exec] check-highlighter-uptodate:
     [exec] 
     [exec] jar-highlighter:
     [exec] 
     [exec] check-memory-uptodate:
     [exec] 
     [exec] jar-memory:
     [exec] 
     [exec] check-misc-uptodate:
     [exec] 
     [exec] jar-misc:
     [exec] 
     [exec] check-spatial-uptodate:
     [exec] 
     [exec] jar-spatial:
     [exec] 
     [exec] check-grouping-uptodate:
     [exec] 
     [exec] jar-grouping:
     [exec] 
     [exec] check-queries-uptodate:
     [exec] 
     [exec] jar-queries:
     [exec] 
     [exec] check-queryparser-uptodate:
     [exec] 
     [exec] jar-queryparser:
     [exec] 
     [exec] check-join-uptodate:
     [exec] 
     [exec] jar-join:
     [exec] 
     [exec] prep-lucene-jars:
     [exec] 
     [exec] resolve-example:
     [exec]      [echo] Building solr-example...
     [exec] 
     [exec] ivy-availability-check:
     [exec]      [echo] Building solr-example...
     [exec] 
     [exec] ivy-fail:
     [exec] 
     [exec] ivy-fail:
     [exec] 
     [exec] ivy-configure:
     [exec] [ivy:configure] :: loading settings :: file = /usr/home/hudson/hudson-slave/workspace/Lucene-Solr-SmokeRelease-trunk/lucene/build/fakeReleaseTmp/unpack/solr-5.0.0/lucene/ivy-settings.xml
     [exec] 
     [exec] sync-hack:
     [exec] 
     [exec] resolve:
     [exec]      [echo] Building solr-example-DIH...
     [exec] 
     [exec] ivy-availability-check:
     [exec]      [echo] Building solr-example-DIH...
     [exec] 
     [exec] ivy-fail:
     [exec] 
     [exec] ivy-configure:
     [exec] [ivy:configure] :: loading settings :: file = /usr/home/hudson/hudson-slave/workspace/Lucene-Solr-SmokeRelease-trunk/lucene/build/fakeReleaseTmp/unpack/solr-5.0.0/lucene/ivy-settings.xml
     [exec] 
     [exec] resolve:
     [exec] 
     [exec] ivy-availability-check:
     [exec]      [echo] Building solr-solrj...
     [exec] 
     [exec] ivy-fail:
     [exec] 
     [exec] ivy-fail:
     [exec] 
     [exec] ivy-configure:
     [exec] [ivy:configure] :: loading settings :: file = /usr/home/hudson/hudson-slave/workspace/Lucene-Solr-SmokeRelease-trunk/lucene/build/fakeReleaseTmp/unpack/solr-5.0.0/lucene/ivy-settings.xml
     [exec] 
     [exec] resolve:
     [exec] 
     [exec] common.init:
     [exec] 
     [exec] compile-lucene-core:
     [exec] 
     [exec] ivy-availability-check:
     [exec] 
     [exec] ivy-fail:
     [exec] 
     [exec] ivy-configure:
     [exec] [ivy:configure] :: loading settings :: file = /usr/home/hudson/hudson-slave/workspace/Lucene-Solr-SmokeRelease-trunk/lucene/build/fakeReleaseTmp/unpack/solr-5.0.0/lucene/ivy-settings.xml
     [exec] 
     [exec] resolve:
     [exec] 
     [exec] init:
     [exec] 
     [exec] -clover.disable:
     [exec] 
     [exec] -clover.load:
     [exec] 
     [exec] -clover.classpath:
     [exec] 
     [exec] -clover.setup:
     [exec] 
     [exec] clover:
     [exec] 
     [exec] compile-core:
     [exec] 
     [exec] init:
     [exec] 
     [exec] -clover.disable:
     [exec] 
     [exec] -clover.load:
     [exec] 
     [exec] -clover.classpath:
     [exec] 
     [exec] -clover.setup:
     [exec] 
     [exec] clover:
     [exec] 
     [exec] common.compile-core:
     [exec] 
     [exec] compile-core:
     [exec] 
     [exec] check-lucene-core-uptodate:
     [exec] 
     [exec] jar-lucene-core:
     [exec] 
     [exec] check-analyzers-phonetic-uptodate:
     [exec] 
     [exec] jar-analyzers-phonetic:
     [exec] 
     [exec] check-analyzers-kuromoji-uptodate:
     [exec] 
     [exec] jar-analyzers-kuromoji:
     [exec] 
     [exec] check-codecs-uptodate:
     [exec] 
     [exec] jar-codecs:
     [exec] 
     [exec] check-expressions-uptodate:
     [exec] 
     [exec] jar-expressions:
     [exec] 
     [exec] check-suggest-uptodate:
     [exec] 
     [exec] jar-suggest:
     [exec] 
     [exec] check-highlighter-uptodate:
     [exec] 
     [exec] jar-highlighter:
     [exec] 
     [exec] check-memory-uptodate:
     [exec] 
     [exec] jar-memory:
     [exec] 
     [exec] check-misc-uptodate:
     [exec] 
     [exec] jar-misc:
     [exec] 
     [exec] check-spatial-uptodate:
     [exec] 
     [exec] jar-spatial:
     [exec] 
     [exec] check-grouping-uptodate:
     [exec] 
     [exec] jar-grouping:
     [exec] 
     [exec] check-queries-uptodate:
     [exec] 
     [exec] jar-queries:
     [exec] 
     [exec] check-queryparser-uptodate:
     [exec] 
     [exec] jar-queryparser:
     [exec] 
     [exec] check-join-uptodate:
     [exec] 
     [exec] jar-join:
     [exec] 
     [exec] prep-lucene-jars:
     [exec] 
     [exec] resolve-example:
     [exec]      [echo] Building solr-example...
     [exec] 
     [exec] ivy-availability-check:
     [exec]      [echo] Building solr-example...
     [exec] 
     [exec] ivy-fail:
     [exec] 
     [exec] ivy-fail:
     [exec] 
     [exec] ivy-configure:
     [exec] [ivy:configure] :: loading settings :: file = /usr/home/hudson/hudson-slave/workspace/Lucene-Solr-SmokeRelease-trunk/lucene/build/fakeReleaseTmp/unpack/solr-5.0.0/lucene/ivy-settings.xml
     [exec] 
     [exec] sync-hack:
     [exec] 
     [exec] resolve:
     [exec]      [echo] Building solr-example-DIH...
     [exec] 
     [exec] ivy-availability-check:
     [exec]      [echo] Building solr-example-DIH...
     [exec] 
     [exec] ivy-fail:
     [exec] 
     [exec] ivy-configure:
     [exec] [ivy:configure] :: loading settings :: file = /usr/home/hudson/hudson-slave/workspace/Lucene-Solr-SmokeRelease-trunk/lucene/build/fakeReleaseTmp/unpack/solr-5.0.0/lucene/ivy-settings.xml
     [exec] 
     [exec] resolve:
     [exec] 
     [exec] ivy-fail:
     [exec] 
     [exec] resolve:
     [exec] 
     [exec] common.init:
     [exec] 
     [exec] compile-lucene-core:
     [exec] 
     [exec] ivy-availability-check:
     [exec] 
     [exec] ivy-fail:
     [exec] 
     [exec] ivy-configure:
     [exec] [ivy:configure] :: loading settings :: file = /usr/home/hudson/hudson-slave/workspace/Lucene-Solr-SmokeRelease-trunk/lucene/build/fakeReleaseTmp/unpack/solr-5.0.0/lucene/ivy-settings.xml
     [exec] 
     [exec] resolve:
     [exec] 
     [exec] init:
     [exec] 
     [exec] -clover.disable:
     [exec] 
     [exec] -clover.load:
     [exec] 
     [exec] -clover.classpath:
     [exec] 
     [exec] -clover.setup:
     [exec] 
     [exec] clover:
     [exec] 
     [exec] compile-core:
     [exec] 
     [exec] init:
     [exec] 
     [exec] common.compile-core:
     [exec] 
     [exec] common-solr.compile-core:
     [exec] 
     [exec] compile-core:
     [exec] 
     [exec] compile-test-framework:
     [exec] 
     [exec] ivy-availability-check:
     [exec] 
     [exec] ivy-fail:
     [exec] 
     [exec] ivy-configure:
     [exec] [ivy:configure] :: loading settings :: file = /usr/home/hudson/hudson-slave/workspace/Lucene-Solr-SmokeRelease-trunk/lucene/build/fakeReleaseTmp/unpack/solr-5.0.0/lucene/ivy-settings.xml
     [exec] 
     [exec] resolve:
     [exec] 
     [exec] init:
     [exec] 
     [exec] compile-lucene-core:
     [exec] 
     [exec] compile-codecs:
     [exec]      [echo] Building codecs...
     [exec] 
     [exec] ivy-availability-check:
     [exec]      [echo] Building codecs...
     [exec] 
     [exec] ivy-fail:
     [exec] 
     [exec] ivy-configure:
     [exec] [ivy:configure] :: loading settings :: file = /usr/home/hudson/hudson-slave/workspace/Lucene-Solr-SmokeRelease-trunk/lucene/build/fakeReleaseTmp/unpack/solr-5.0.0/lucene/ivy-settings.xml
     [exec] 
     [exec] resolve:
     [exec] 
     [exec] common.init:
     [exec] 
     [exec] compile-lucene-core:
     [exec] 
     [exec] init:
     [exec] 
     [exec] -clover.disable:
     [exec] 
     [exec] -clover.load:
     [exec] 
     [exec] -clover.classpath:
     [exec] 
     [exec] -clover.setup:
     [exec] 
     [exec] clover:
     [exec] 
     [exec] compile-core:
     [exec] 
     [exec] -clover.disable:
     [exec] 
     [exec] -clover.load:
     [exec] 
     [exec] -clover.classpath:
     [exec] 
     [exec] -clover.setup:
     [exec] 
     [exec] clover:
     [exec] 
     [exec] common.compile-core:
     [exec] 
     [exec] compile-core:
     [exec] 
     [exec] common.compile-test:
     [exec]     [mkdir] Created dir: /usr/home/hudson/hudson-slave/workspace/Lucene-Solr-SmokeRelease-trunk/lucene/build/fakeReleaseTmp/unpack/solr-5.0.0/solr/build/solr-core/classes/test
     [exec]     [javac] Compiling 444 source files to /usr/home/hudson/hudson-slave/workspace/Lucene-Solr-SmokeRelease-trunk/lucene/build/fakeReleaseTmp/unpack/solr-5.0.0/solr/build/solr-core/classes/test
     [exec]     [javac] Note: Some input files use or override a deprecated API.
     [exec]     [javac] Note: Recompile with -Xlint:deprecation for details.
     [exec]     [javac] Note: Some input files use unchecked or unsafe operations.
     [exec]     [javac] Note: Recompile with -Xlint:unchecked for details.
     [exec]      [copy] Copying 1 file to /usr/home/hudson/hudson-slave/workspace/Lucene-Solr-SmokeRelease-trunk/lucene/build/fakeReleaseTmp/unpack/solr-5.0.0/solr/build/solr-core/classes/test
     [exec] 
     [exec] common-solr.compile-test:
     [exec] 
     [exec] compile-test:
     [exec] 
     [exec] install-junit4-taskdef:
     [exec] 
     [exec] compile-tools:
     [exec] 
     [exec] ivy-availability-check:
     [exec] 
     [exec] ivy-fail:
     [exec] 
     [exec] ivy-configure:
     [exec] [ivy:configure] :: loading settings :: file = /usr/home/hudson/hudson-slave/workspace/Lucene-Solr-SmokeRelease-trunk/lucene/build/fakeReleaseTmp/unpack/solr-5.0.0/lucene/ivy-settings.xml
     [exec] 
     [exec] resolve:
     [exec] 
     [exec] init:
     [exec] 
     [exec] compile-core:
     [exec] 
     [exec] validate:
     [exec] 
     [exec] resolve-groovy:
     [exec] 
     [exec] -init-totals:
     [exec] 
     [exec] -test:
     [exec]     [mkdir] Created dir: /usr/home/hudson/hudson-slave/workspace/Lucene-Solr-SmokeRelease-trunk/lucene/build/fakeReleaseTmp/unpack/solr-5.0.0/solr/build/solr-core/test
     [exec]     [mkdir] Created dir: /usr/home/hudson/hudson-slave/workspace/Lucene-Solr-SmokeRelease-trunk/lucene/build/fakeReleaseTmp/unpack/solr-5.0.0/solr/build/solr-core/test/temp
     [exec]     [mkdir] Created dir: /usr/home/hudson/hudson-slave/workspace/Lucene-Solr-SmokeRelease-trunk/lucene/build/fakeReleaseTmp/unpack/solr-5.0.0/.caches/test-stats/solr-core
     [exec]    [junit4] <JUnit4> says ?????! Master seed: B3CFB8BFAA391D9F
     [exec]    [junit4] Your default console's encoding may not display certain unicode glyphs: US-ASCII
     [exec]    [junit4] Executing 408 suites with 4 JVMs.
     [exec]    [junit4] 
     [exec]    [junit4] Started J2 PID(9773@lucene.zones.apache.org).
     [exec]    [junit4] Started J0 PID(9775@lucene.zones.apache.org).
     [exec]    [junit4] Started J3 PID(9774@lucene.zones.apache.org).
     [exec]    [junit4] Started J1 PID(9776@lucene.zones.apache.org).
     [exec]    [junit4] Suite: org.apache.solr.cloud.DeleteInactiveReplicaTest
     [exec]    [junit4] IGNOR/A 0.17s J3 | DeleteInactiveReplicaTest.testDistribSearch
     [exec]    [junit4]    > Assumption #1: 'slow' test group is disabled (@Slow())
     [exec]    [junit4] Completed on J3 in 2.56s, 1 test, 1 skipped
     [exec]    [junit4] 
     [exec]    [junit4] Suite: org.apache.solr.cloud.BasicZkTest
     [exec]    [junit4] IGNOR/A 0.15s J1 | BasicZkTest.testBasic
     [exec]    [junit4]    > Assumption #1: 'slow' test group is disabled (@Slow())
     [exec]    [junit4] Completed on J1 in 2.35s, 1 test, 1 skipped
     [exec]    [junit4] 
     [exec]    [junit4] Suite: org.apache.solr.schema.ExternalFileFieldSortTest
     [exec]    [junit4] Completed on J3 in 32.58s, 1 test
     [exec]    [junit4] 
     [exec]    [junit4] Suite: org.apache.solr.schema.TestBinaryField
     [exec]    [junit4] Completed on J1 in 40.06s, 1 test
     [exec]    [junit4] 
     [exec]    [junit4] Suite: org.apache.solr.cloud.ZkControllerTest
     [exec]    [junit4] IGNOR/A 0.00s J1 | ZkControllerTest.testReadConfigName
     [exec]    [junit4]    > Assumption #1: 'slow' test group is disabled (@Slow())
     [exec]    [junit4] IGNOR/A 0.00s J1 | ZkControllerTest.testUploadToCloud
     [exec]    [junit4]    > Assumption #1: 'slow' test group is disabled (@Slow())
     [exec]    [junit4] IGNOR/A 0.00s J1 | ZkControllerTest.testGetHostName
     [exec]    [junit4]    > Assumption #1: 'slow' test group is disabled (@Slow())
     [exec]    [junit4] IGNOR/A 0.00s J1 | ZkControllerTest.testNodeNameUrlConversion
     [exec]    [junit4]    > Assumption #1: 'slow' test group is disabled (@Slow())
     [exec]    [junit4] Completed on J1 in 0.03s, 4 tests, 4 skipped
     [exec]    [junit4] 
     [exec]    [junit4] Suite: org.apache.solr.internal.csv.ExtendedBufferedReaderTest
     [exec]    [junit4] Completed on J1 in 0.09s, 8 tests
     [exec]    [junit4] 
     [exec]    [junit4] Suite: org.apache.solr.core.SOLR749Test
     [exec]    [junit4] Completed on J3 in 10.79s, 2 tests
     [exec]    [junit4] 
     [exec]    [junit4] Suite: org.apache.solr.search.TestStressLucene
     [exec]    [junit4] Completed on J1 in 3.14s, 1 test
     [exec]    [junit4] 
     [exec]    [junit4] Suite: org.apache.solr.handler.component.DistributedSuggestComponentTest
     [exec]    [junit4] IGNOR/A 0.01s J3 | DistributedSuggestComponentTest.testDistribSearch
     [exec]    [junit4]    > Assumption #1: 'slow' test group is disabled (@Slow())
     [exec]    [junit4] Completed on J3 in 0.01s, 1 test, 1 skipped
     [exec]    [junit4] 
     [exec]    [junit4] Suite: org.apache.solr.search.TestRecoveryHdfs
     [exec]    [junit4] Completed on J3 in 0.10s, 10 tests, 10 skipped
     [exec]    [junit4] 
     [exec]    [junit4] Suite: org.apache.solr.analytics.util.valuesource.FunctionTest
     [exec]    [junit4] Completed on J0 in 47.26s, 13 tests
     [exec]    [junit4] 
     [exec]    [junit4] Suite: org.apache.solr.schema.DateRangeFieldTest
     [exec]    [junit4] Completed on J2 in 48.73s, 1 test
     [exec]    [junit4] 
     [exec]    [junit4] Suite: org.apache.solr.cloud.hdfs.HdfsRecoveryZkTest
     [exec]    [junit4] IGNOR/A 0.17s J2 | HdfsRecoveryZkTest.testDistribSearch
     [exec]    [junit4]    > Assumption #1: 'slow' test group is disabled (@Slow())
     [exec]    [junit4] Completed on J2 in 0.33s, 1 test, 1 skipped
     [exec]    [junit4] 
     [exec]    [junit4] Suite: org.apache.solr.spelling.suggest.TestFileDictionaryLookup
     [exec]    [junit4] Completed on J1 in 4.83s, 1 test
     [exec]    [junit4] 
     [exec]    [junit4] Suite: org.apache.solr.spelling.suggest.TestAnalyzedSuggestions
     [exec]    [junit4] Completed on J3 in 5.05s, 2 tests
     [exec]    [junit4] 
     [exec]    [junit4] Suite: org.apache.solr.store.blockcache.BlockCacheTest
     [exec]    [junit4] Completed on J1 in 1.21s, 2 tests
     [exec]    [junit4] 
     [exec]    [junit4] Suite: org.apache.solr.search.TestStandardQParsers
     [exec]    [junit4] Completed on J1 in 0.03s, 1 test
     [exec]    [junit4] 
     [exec]    [junit4] Suite: org.apache.solr.internal.csv.writer.CSVConfigGuesserTest
     [exec]    [junit4] Completed on J1 in 0.04s, 3 tests
     [exec]    [junit4] 
     [exec]    [junit4] Suite: org.apache.solr.cloud.AsyncMigrateRouteKeyTest
     [exec]    [junit4] IGNOR/A 0.01s J1 | AsyncMigrateRouteKeyTest.testDistribSearch
     [exec]    [junit4]    > Assumption #1: 'slow' test group is disabled (@Slow())
     [exec]    [junit4] Completed on J1 in 0.01s, 1 test, 1 skipped
     [exec]    [junit4] 
     [exec]    [junit4] Suite: org.apache.solr.cloud.SolrXmlInZkTest
     [exec]    [junit4] Completed on J0 in 9.37s, 7 tests
     [exec]    [junit4] 
     [exec]    [junit4] Suite: org.apache.solr.schema.BadIndexSchemaTest
     [exec]    [junit4] Completed on J1 in 8.46s, 17 tests
     [exec]    [junit4] 
     [exec]    [junit4] Suite: org.apache.solr.update.DirectUpdateHandlerTest
     [exec]    [junit4] Completed on J3 in 14.07s, 6 tests
     [exec]    [junit4] 
     [exec]    [junit4] Suite: org.apache.solr.handler.admin.InfoHandlerTest
     [exec]    [junit4] Completed on J0 in 10.45s, 2 tests
     [exec]    [junit4] 
     [exec]    [junit4] Suite: org.apache.solr.search.TestSolrJ
     [exec]    [junit4] Completed on J0 in 0.05s, 1 test
     [exec]    [junit4] 
     [exec]    [junit4] Suite: org.apache.solr.update.processor.StatelessScriptUpdateProcessorFactoryTest
     [exec]    [junit4] Completed on J1 in 9.29s, 7 tests
     [exec]    [junit4] 
     [exec]    [junit4] Suite: org.apache.solr.cloud.FullSolrCloudDistribCmdsTest
     [exec]    [junit4] IGNOR/A 0.01s J1 | FullSolrCloudDistribCmdsTest.testDistribSearch
     [exec]    [junit4]    > Assumption #1: 'slow' test group is disabled (@Slow())
     [exec]    [junit4] Completed on J1 in 0.01s, 1 test, 1 skipped
     [exec]    [junit4] 
     [exec]    [junit4] Suite: org.apache.solr.core.TestShardHandlerFactory
     [exec]    [junit4] Completed on J1 in 1.96s, 2 tests
     [exec]    [junit4] 
     [exec]    [junit4] Suite: org.apache.solr.spelling.suggest.TestHighFrequencyDictionaryFactory
     [exec]    [junit4] Completed on J0 in 7.86s, 1 test
     [exec]    [junit4] 
     [exec]    [junit4] Suite: org.apache.solr.search.TestElisionMultitermQuery
     [exec]    [junit4] Completed on J1 in 4.69s, 1 test
     [exec]    [junit4] 
     [exec]    [junit4] Suite: org.apache.solr.handler.component.DistributedTermsComponentTest
     [exec]    [junit4] Completed on J2 in 28.92s, 1 test
     [exec]    [junit4] 
     [exec]    [junit4] Suite: org.apache.solr.search.TestLRUCache
     [exec]    [junit4] Completed on J2 in 1.87s, 3 tests
     [exec]    [junit4] 
     [exec]    [junit4] Suite: org.apache.solr.update.TestExceedMaxTermLength
     [exec]    [junit4] Completed on J0 in 9.21s, 2 tests
     [exec]    [junit4] 
     [exec]    [junit4] Suite: org.apache.solr.search.TestRealTimeGet
     [exec]    [junit4] Completed on J3 in 21.55s, 4 tests
     [exec]    [junit4] 
     [exec]    [junit4] Suite: org.apache.solr.search.TestSimpleQParserPlugin
     [exec]    [junit4] Completed on J0 in 3.39s, 16 tests
     [exec]    [junit4] 
     [exec]    [junit4] Suite: org.apache.solr.spelling.DirectSolrSpellCheckerTest
     [exec]    [junit4] Completed on J2 in 8.75s, 2 tests
     [exec]    [junit4] 
     [exec]    [junit4] Suite: org.apache.solr.search.TestSurroundQueryParser
     [exec]    [junit4] Completed on J1 in 14.85s, 1 test
     [exec]    [junit4] 
     [exec]    [junit4] Suite: org.apache.solr.spelling.suggest.SuggesterTest
     [exec]    [junit4] Completed on J2 in 5.56s, 4 tests
     [exec]    [junit4] 
     [exec]    [junit4] Suite: org.apache.solr.handler.component.SuggestComponentTest
     [exec]    [junit4] Completed on J3 in 7.66s, 6 tests
     [exec]    [junit4] 
     [exec]    [junit4] Suite: org.apache.solr.cloud.ConnectionManagerTest
     [exec]    [junit4] IGNOR/A 0.00s J3 | ConnectionManagerTest.testLikelyExpired
     [exec]    [junit4]    > Assumption #1: 'slow' test group is disabled (@Slow())
     [exec]    [junit4] Completed on J3 in 0.01s, 2 tests, 2 skipped
     [exec]    [junit4] 
     [exec]    [junit4] Suite: org.apache.solr.request.TestWriterPerf
     [exec]    [junit4] Completed on J1 in 3.85s, 1 test
     [exec]    [junit4] 
     [exec]    [junit4] Suite: org.apache.solr.search.TestLFUCache
     [exec]    [junit4] Completed on J2 in 2.39s, 5 tests
     [exec]    [junit4] 
     [exec]    [junit4] Suite: org.apache.solr.handler.admin.ShowFileRequestHandlerTest
     [exec]    [junit4] Completed on J0 in 17.33s, 4 tests
     [exec]    [junit4] 
     [exec]    [junit4] Suite: org.apache.solr.rest.schema.analysis.TestManagedSynonymFilterFactory
     [exec]    [junit4] Completed on J1 in 9.69s, 1 test
     [exec]    [junit4] 
     [exec]    [junit4] Suite: org.apache.solr.rest.TestRestManager
     [exec]    [junit4] Completed on J1 in 2.12s, 2 tests
     [exec]    [junit4] 
     [exec]    [junit4] Suite: org.apache.solr.rest.schema.TestFieldTypeCollectionResource
     [exec]    [junit4] Completed on J3 in 13.82s, 2 tests
     [exec]    [junit4] 
     [exec]    [junit4] Suite: org.apache.solr.spelling.suggest.TestFuzzyAnalyzedSuggestions
     [exec]    [junit4] Completed on J1 in 1.22s, 4 tests
     [exec]    [junit4] 
     [exec]    [junit4] Suite: org.apache.solr.analytics.facet.RangeFacetTest
     [exec]    [junit4] Completed on J0 in 4.18s, 3 tests
     [exec]    [junit4] 
     [exec]    [junit4] Suite: org.apache.solr.internal.csv.CSVUtilsTest
     [exec]    [junit4] Completed on J0 in 0.11s, 14 tests
     [exec]    [junit4] 
     [exec]    [junit4] Suite: org.apache.solr.update.processor.URLClassifyProcessorTest
     [exec]    [junit4] Completed on J0 in 0.41s, 7 tests
     [exec]    [junit4] 
     [exec]    [junit4] Suite: org.apache.solr.update.processor.UpdateRequestProcessorFactoryTest
     [exec]    [junit4] Completed on J3 in 3.14s, 2 tests
     [exec]    [junit4] 
     [exec]    [junit4] Suite: org.apache.solr.cloud.ShardRoutingTest
     [exec]    [junit4] IGNOR/A 0.00s J3 | ShardRoutingTest.testDistribSearch
     [exec]    [junit4]    > Assumption #1: 'slow' test group is disabled (@Slow())
     [exec]    [junit4] Completed on J3 in 0.01s, 1 test, 1 skipped
     [exec]    [junit4] 
     [exec]    [junit4] Suite: org.apache.solr.search.TestComponentsName
     [exec]    [junit4] Completed on J1 in 3.28s, 1 test
     [exec]    [junit4] 
     [exec]    [junit4] Suite: org.apache.solr.core.TestSolrXmlPersistor
     [exec]    [junit4] Completed on J3 in 0.49s, 7 tests
     [exec]    [junit4] 
     [exec]    [junit4] Suite: org.apache.solr.handler.component.QueryElevationComponentTest
     [exec]    [junit4] Completed on J2 in 17.29s, 8 tests
     [exec]    [junit4] 
     [exec]    [junit4] Suite: org.apache.solr.cloud.BasicDistributedZk2Test
     [exec]    [junit4] IGNOR/A 0.00s J2 | BasicDistributedZk2Test.testDistribSearch
     [exec]    [junit4]    > Assumption #1: 'slow' test group is disabled (@Slow())
     [exec]    [junit4] Completed on J2 in 0.01s, 1 test, 1 skipped
     [exec]    [junit4] 
     [exec]    [junit4] Suite: org.apache.solr.internal.csv.CharBufferTest
     [exec]    [junit4] Completed on J2 in 0.06s, 13 tests
     [exec]    [junit4] 
     [exec]    [junit4] Suite: org.apache.solr.search.RankQueryTest
     [exec]    [junit4] Completed on J3 in 2.54s, 1 test
     [exec]    [junit4] 
     [exec]    [junit4] Suite: org.apache.solr.cloud.OverseerCollectionProcessorTest
     [exec]    [junit4] Completed on J0 in 6.05s, 14 tests
     [exec]    [junit4] 
     [exec]    [junit4] Suite: org.apache.solr.search.TestSearchPerf
     [exec]    [junit4] Completed on J3 in 1.42s, 1 test
     [exec]    [junit4] 
     [exec]    [junit4] Suite: org.apache.solr.request.TestBinaryResponseWriter
     [exec]    [junit4] Completed on J3 in 2.51s, 2 tests
     [exec]    [junit4] 
     [exec]    [junit4] Suite: org.apache.solr.core.TestConfig
     [exec]    [junit4] Completed on J0 in 3.34s, 6 tests
     [exec]    [junit4] 
     [exec]    [junit4] Suite: org.apache.solr.update.SolrIndexSplitterTest
     [exec]    [junit4] Completed on J2 in 5.21s, 5 tests
     [exec]    [junit4] 
     [exec]    [junit4] Suite: org.apache.solr.search.TestAddFieldRealTimeGet
     [exec]    [junit4] Completed on J0 in 1.40s, 1 test
     [exec]    [junit4] 
     [exec]    [junit4] Suite: org.apache.solr.rest.schema.TestDynamicFieldResource
     [exec]    [junit4] Completed on J3 in 1.86s, 3 tests
     [exec]    [junit4] 
     [exec]    [junit4] Suite: org.apache.solr.cloud.SliceStateTest
     [exec]    [junit4] Completed on J2 in 2.80s, 1 test
     [exec]    [junit4] 
     [exec]    [junit4] Suite: org.apache.solr.request.TestRemoteStreaming
     [exec]    [junit4] Completed on J3 in 3.00s, 4 tests
     [exec]    [junit4] 
     [exec]    [junit4] Suite: org.apache.solr.update.AutoCommitTest
     [exec]    [junit4] IGNOR/A 0.00s J3 | AutoCommitTest.testCommitWithin
     [exec]    [junit4]    > Assumption #1: 'slow' test group is disabled (@Slow())
     [exec]    [junit4] IGNOR/A 0.00s J3 | AutoCommitTest.testMaxTime
     [exec]    [junit4]    > Assumption #1: 'slow' test group is disabled (@Slow())
     [exec]    [junit4] IGNOR/A 0.00s J3 | AutoCommitTest.testMaxDocs
     [exec]    [junit4]    > Assumption #1: 'slow' test group is disabled (@Slow())
     [exec]    [junit4] Completed on J3 in 0.01s, 3 tests, 3 skipped
     [exec]    [junit4] 
     [exec]    [junit4] Suite: org.apache.solr.core.TestNonNRTOpen
     [exec]    [junit4] Completed on J2 in 4.19s, 2 tests
     [exec]    [junit4] 
     [exec]    [junit4] Suite: org.apache.solr.search.TestCollapseQParserPlugin
     [exec]    [junit4] Completed on J2 in 5.76s, 2 tests
     [exec]    [junit4] 
     [exec]    [junit4] Suite: org.apache.solr.search.TestPseudoReturnFields
     [exec]    [junit4] Completed on J2 in 5.45s, 14 tests
     [exec]    [junit4] 
     [exec]    [junit4] Suite: org.apache.solr.search.MergeStrategyTest
     [exec]    [junit4] Completed on J3 in 14.80s, 1 test
     [exec]    [junit4] 
     [exec]    [junit4] Suite: org.apache.solr.schema.TestCloudManagedSchema
     [exec]    [junit4] IGNOR/A 0.00s J3 | TestCloudManagedSchema.testDistribSearch
     [exec]    [junit4]    > Assumption #1: 'slow' test group is disabled (@Slow())
     [exec]    [junit4] Completed on J3 in 0.01s, 1 test, 1 skipped
     [exec]    [junit4] 
     [exec]    [junit4] Suite: org.apache.solr.core.TestSolrDeletionPolicy2
     [exec]    [junit4] Completed on J3 in 3.46s, 1 test
     [exec]    [junit4] 
     [exec]    [junit4] Suite: org.apache.solr.highlight.FastVectorHighlighterTest
     [exec]    [junit4] Completed on J2 in 4.99s, 2 tests
     [exec]    [junit4] 
     [exec]    [junit4] Suite: org.apache.solr.schema.TestManagedSchema
     [exec]    [junit4] Completed on J1 in 30.86s, 14 tests
     [exec]    [junit4] 
     [exec]    [junit4] Suite: org.apache.solr.internal.csv.CSVPrinterTest
     [exec]    [junit4] Completed on J2 in 0.86s, 6 tests
     [exec]    [junit4] 
     [exec]    [junit4] Suite: org.apache.solr.core.TestConfigSets
     [exec]    [junit4] Completed on J1 in 2.23s, 3 tests
     [exec]    [junit4] 
     [exec]    [junit4] Suite: org.apache.solr.update.HardAutoCommitTest
     [exec]    [junit4] IGNOR/A 0.00s J1 | HardAutoCommitTest.testCommitWithin
     [exec]    [junit4]    > Assumption #1: 'slow' test group is disabled (@Slow())
     [exec]    [junit4] Completed on J1 in 0.01s, 1 test, 1 skipped
     [exec]    [junit4] 
     [exec]    [junit4] Suite: org.apache.solr.update.DocumentBuilderTest
     [exec]    [junit4] Completed on J3 in 4.15s, 16 tests
     [exec]    [junit4] 
     [exec]    [junit4] Suite: org.apache.solr.spelling.WordBreakSolrSpellCheckerTest
     [exec]    [junit4] Completed on J3 in 7.00s, 3 tests
     [exec]    [junit4] 
     [exec]    [junit4] Suite: org.apache.solr.servlet.SolrRequestParserTest
     [exec]    [junit4] Completed on J1 in 8.25s, 10 tests
     [exec]    [junit4] 
     [exec]    [junit4] Suite: org.apache.solr.highlight.HighlighterTest
     [exec]    [junit4] Completed on J2 in 10.30s, 31 tests
     [exec]    [junit4] 
     [exec]    [junit4] Suite: org.apache.solr.search.TestStressReorder
     [exec]    [junit4] Completed on J0 in 34.81s, 1 test
     [exec]    [junit4] 
     [exec]    [junit4] Suite: org.apache.solr.search.TestInitQParser
     [exec]    [junit4] Completed on J1 in 2.87s, 1 test
     [exec]    [junit4] 
     [exec]    [junit4] Suite: org.apache.solr.search.TestIndexSearcher
     [exec]    [junit4] Completed on J3 in 4.62s, 2 tests
     [exec]    [junit4] 
     [exec]    [junit4] Suite: org.apache.solr.spelling.suggest.SuggesterFSTTest
     [exec]    [junit4] Completed on J2 in 4.70s, 4 tests
     [exec]    [junit4] 
     [exec]    [junit4] Suite: org.apache.solr.schema.IndexSchemaRuntimeFieldTest
     [exec]    [junit4] Completed on J1 in 2.45s, 1 test
     [exec]    [junit4] 
     [exec]    [junit4] Suite: org.apache.solr.analysis.LegacyHTMLStripCharFilterTest
     [exec]    [junit4] Completed on J1 in 0.15s, 13 tests, 1 skipped
     [exec]    [junit4] 
     [exec]    [junit4] Suite: org.apache.solr.cloud.ChaosMonkeySafeLeaderTest
     [exec]    [junit4] IGNOR/A 0.00s J1 | ChaosMonkeySafeLeaderTest.testDistribSearch
     [exec]    [junit4]    > Assumption #1: 'slow' test group is disabled (@Slow())
     [exec]    [junit4] Completed on J1 in 0.01s, 1 test, 1 skipped
     [exec]    [junit4] 
     [exec]    [junit4] Suite: org.apache.solr.rest.schema.TestSolrQueryParserResource
     [exec]    [junit4] Completed on J3 in 1.51s, 1 test
     [exec]    [junit4] 
     [exec]    [junit4] Suite: org.apache.solr.TestDocumentBuilder
     [exec]    [junit4] Completed on J3 in 0.02s, 1 test
     [exec]    [junit4] 
     [exec]    [junit4] Suite: org.apache.solr.cloud.DeleteShardTest
     [exec]    [junit4] IGNOR/A 0.00s J3 | DeleteShardTest.testDistribSearch
     [exec]    [junit4]    > Assumption #1: 'slow' test group is disabled (@Slow())
     [exec]    [junit4] Completed on J3 in 0.01s, 1 test, 1 skipped
     [exec]    [junit4] 
     [exec]    [junit4] Suite: org.apache.solr.search.ReturnFieldsTest
     [exec]    [junit4] Completed on J2 in 2.55s, 12 tests
     [exec]    [junit4] 
     [exec]    [junit4] Suite: org.apache.solr.schema.ModifyConfFileTest
     [exec]    [junit4] Completed on J2 in 2.51s, 1 test
     [exec]    [junit4] 
     [exec]    [junit4] Suite: org.apache.solr.search.function.distance.DistanceFunctionTest
     [exec]    [junit4] Completed on J1 in 4.55s, 3 tests
     [exec]    [junit4] 
     [exec]    [junit4] Suite: org.apache.solr.handler.component.DistributedQueryComponentCustomSortTest
     [exec]    [junit4] Completed on J0 in 8.89s, 1 test
     [exec]    [junit4] 
     [exec]    [junit4] Suite: org.apache.solr.search.function.TestFunctionQuery
     [exec]    [junit4] Completed on J3 in 6.56s, 15 tests
     [exec]    [junit4] 
     [exec]    [junit4] Suite: org.apache.solr.cloud.CollectionsAPIDistributedZkTest
     [exec]    [junit4] IGNOR/A 0.00s J3 | CollectionsAPIDistributedZkTest.testDistribSearch
     [exec]    [junit4]    > Assumption #1: 'slow' test group is disabled (@Slow())
     [exec]    [junit4] Completed on J3 in 0.01s, 1 test, 1 skipped
     [exec]    [junit4] 
     [exec]    [junit4] Suite: org.apache.solr.core.TestJmxIntegration
     [exec]    [junit4] Completed on J2 in 3.07s, 3 tests, 1 skipped
     [exec]    [junit4] 
     [exec]    [junit4] Suite: org.apache.solr.handler.component.SearchHandlerTest
     [exec]    [junit4] Completed on J0 in 2.92s, 1 test
     [exec]    [junit4] 
     [exec]    [junit4] Suite: org.apache.solr.spelling.suggest.TestPhraseSuggestions
     [exec]    [junit4] Completed on J2 in 2.07s, 1 test
     [exec]    [junit4] 
     [exec]    [junit4] Suite: org.apache.solr.search.function.SortByFunctionTest
     [exec]    [junit4] Completed on J2 in 2.47s, 2 tests
     [exec]    [junit4] 
     [exec]    [junit4] Suite: org.apache.solr.handler.component.DistributedQueryComponentOptimizationTest
     [exec]    [junit4] Completed on J0 in 4.34s, 1 test
     [exec]    [junit4] 
     [exec]    [junit4] Suite: org.apache.solr.search.TestDocSet
     [exec]    [junit4] Completed on J2 in 0.96s, 2 tests
     [exec]    [junit4] 
     [exec]    [junit4] Suite: org.apache.solr.rest.TestManagedResourceStorage
     [exec]    [junit4] IGNOR/A 0.00s J2 | TestManagedResourceStorage.testZkBasedJsonStorage
     [exec]    [junit4]    > Assumption #1: 'slow' test group is disabled (@Slow())
     [exec]    [junit4] IGNOR/A 0.00s J2 | TestManagedResourceStorage.testFileBasedJsonStorage
     [exec]    [junit4]    > Assumption #1: 'slow' test group is disabled (@Slow())
     [exec]    [junit4] Completed on J2 in 0.02s, 2 tests, 2 skipped
     [exec]    [junit4] 
     [exec]    [junit4] Suite: org.apache.solr.SampleTest
     [exec]    [junit4] Completed on J2 in 1.65s, 2 tests
     [exec]    [junit4] 
     [exec]    [junit4] Suite: org.apache.solr.analytics.facet.QueryFacetTest
     [exec]    [junit4] Completed on J1 in 10.09s, 1 test
     [exec]    [junit4] 
     [exec]    [junit4] Suite: org.apache.solr.cloud.TestShortCircuitedRequests
     [exec]    [junit4] IGNOR/A 0.00s J1 | TestShortCircuitedRequests.testDistribSearch
     [exec]    [junit4]    > Assumption #1: 'slow' test group is disabled (@Slow())
     [exec]    [junit4] Completed on J1 in 0.01s, 1 test, 1 skipped
     [exec]    [junit4] 
     [exec]    [junit4] Suite: org.apache.solr.cloud.ClusterStateTest
     [exec]    [junit4] Completed on J2 in 0.03s, 1 test
     [exec]    [junit4] 
     [exec]    [junit4] Suite: org.apache.solr.util.DateMathParserTest
     [exec]    [junit4] Completed on J1 in 0.09s, 8 tests
     [exec]    [junit4] 
     [exec]    [junit4] Suite: org.apache.solr.search.function.TestOrdValues
     [exec]    [junit4] Completed on J1 in 0.93s, 5 tests
     [exec]    [junit4] 
     [exec]    [junit4] Suite: org.apache.solr.schema.CopyFieldTest
     [exec]    [junit4] Completed on J1 in 2.97s, 9 tests
     [exec]    [junit4] 
     [exec]    [junit4] Suite: org.apache.solr.update.TestDocBasedVersionConstraints
     [exec]    [junit4] Completed on J0 in 10.71s, 6 tests
     [exec]    [junit4] 
     [exec]    [junit4] Suite: org.apache.solr.schema.SynonymTokenizerTest
     [exec]    [junit4] Completed on J0 in 0.82s, 1 test
     [exec]    [junit4] 
     [exec]    [junit4] Suite: org.apache.solr.cloud.ZkCLITest
     [exec]    [junit4] Completed on J3 in 17.25s, 12 tests
     [exec]    [junit4] 
     [exec]    [junit4] Suite: org.apache.solr.util.SimplePostToolTest
     [exec]    [junit4] Completed on J3 in 0.13s, 11 tests
     [exec]    [junit4] 
     [exec]    [junit4] Suite: org.apache.solr.schema.NumericFieldsTest
     [exec]    [junit4] Completed on J0 in 1.49s, 1 test
     [exec]    [junit4] 
     [exec]    [junit4] Suite: org.apache.solr.core.TestArbitraryIndexDir
     [exec]    [junit4] Completed on J0 in 3.10s, 1 test
     [exec]    [junit4] 
     [exec]    [junit4] Suite: org.apache.solr.request.SimpleFacetsTest
     [exec]    [junit4] Completed on J1 in 9.96s, 22 tests
     [exec]    [junit4] 
     [exec]    [junit4] Suite: org.apache.solr.update.TestIndexingPerformance
     [exec]    [junit4] Completed on J0 in 2.98s, 1 test
     [exec]    [junit4] 
     [exec]    [junit4] Suite: org.apache.solr.handler.TestCSVLoader
     [exec]    [junit4] Completed on J1 in 3.88s, 6 tests
     [exec]    [junit4] 
     [exec]    [junit4] Suite: org.apache.solr.servlet.DirectSolrConnectionTest
     [exec]    [junit4] Completed on J0 in 1.31s, 2 tests
     [exec]    [junit4] 
     [exec]    [junit4] Suite: org.apache.solr.search.TestNoOpRegenerator
     [exec]    [junit4] Completed on J0 in 0.96s, 1 test
     [exec]    [junit4] 
     [exec]    [junit4] Suite: org.apache.solr.search.TestStressRecovery
     [exec]    [junit4] Completed on J3 in 15.43s, 1 test
     [exec]    [junit4] 
     [exec]    [junit4] Suite: org.apache.solr.rest.schema.TestDefaultSearchFieldResource
     [exec]    [junit4] Completed on J0 in 6.40s, 1 test
     [exec]    [junit4] 
     [exec]    [junit4] Suite: org.apache.solr.handler.admin.LukeRequestHandlerTest
     [exec]    [junit4] Completed on J1 in 7.85s, 6 tests
     [exec]    [junit4] 
     [exec]    [junit4] Suite: org.apache.solr.cloud.CollectionsAPIAsyncDistributedZkTest
     [exec]    [junit4] IGNOR/A 0.00s J1 | CollectionsAPIAsyncDistributedZkTest.testDistribSearch
     [exec]    [junit4]    > Assumption #1: 'slow' test group is disabled (@Slow())
     [exec]    [junit4] Completed on J1 in 0.01s, 1 test, 1 skipped
     [exec]    [junit4] 
     [exec]    [junit4] Suite: org.apache.solr.rest.schema.TestSchemaResource
     [exec]    [junit4] Completed on J3 in 2.20s, 3 tests
     [exec]    [junit4] 
     [exec]    [junit4] Suite: org.apache.solr.highlight.TestPostingsSolrHighlighter
     [exec]    [junit4] Completed on J3 in 1.90s, 13 tests
     [exec]    [junit4] 
     [exec]    [junit4] Suite: org.apache.solr.update.SolrIndexConfigTest
     [exec]    [junit4] Completed on J1 in 3.83s, 4 tests
     [exec]    [junit4] 
     [exec]    [junit4] Suite: org.apache.solr.handler.DocumentAnalysisRequestHandlerTest
     [exec]    [junit4] Completed on J3 in 2.61s, 4 tests
     [exec]    [junit4] 
     [exec]    [junit4] Suite: org.apache.solr.handler.component.TermVectorComponentTest
     [exec]    [junit4] Completed on J1 in 2.46s, 3 tests
     [exec]    [junit4] 
     [exec]    [junit4] Suite: org.apache.solr.TestGroupingSearch
     [exec]    [junit4] Completed on J0 in 8.10s, 13 tests
     [exec]    [junit4] 
     [exec]    [junit4] Suite: org.apache.solr.cloud.BasicDistributedZkTest
     [exec]    [junit4] IGNOR/A 0.09s J0 | BasicDistributedZkTest.testDistribSearch
     [exec]    [junit4]    > Assumption #1: 'slow' test group is disabled (@Slow())
     [exec]    [junit4] Completed on J0 in 0.19s, 1 test, 1 skipped
     [exec]    [junit4] 
     [exec]    [junit4] Suite: org.apache.solr.update.processor.UniqFieldsUpdateProcessorFactoryTest
     [exec]    [junit4] Completed on J1 in 2.02s, 1 test
     [exec]    [junit4] 
     [exec]    [junit4] Suite: org.apache.solr.update.SoftAutoCommitTest
     [exec]    [junit4] IGNOR/A 0.00s J1 | SoftAutoCommitTest.testSoftAndHardCommitMaxTimeDelete
     [exec]    [junit4]    > Assumption #1: 'slow' test group is disabled (@Slow())
     [exec]    [junit4] IGNOR/A 0.00s J1 | SoftAutoCommitTest.testSoftAndHardCommitMaxTimeRapidAdds
     [exec]    [junit4]    > Assumption #1: 'slow' test group is disabled (@Slow())
     [exec]    [junit4] IGNOR/A 0.00s J1 | SoftAutoCommitTest.testSoftAndHardCommitMaxTimeMixedAdds
     [exec]    [junit4]    > Assumption #1: 'slow' test group is disabled (@Slow())
     [exec]    [junit4] Completed on J1 in 0.01s, 3 tests, 3 skipped
     [exec]    [junit4] 
     [exec]    [junit4] Suite: org.apache.solr.handler.MoreLikeThisHandlerTest
     [exec]    [junit4] Completed on J3 in 2.68s, 1 test
     [exec]    [junit4] 
     [exec]    [junit4] Suite: org.apache.solr.cloud.HttpPartitionTest
     [exec]    [junit4] IGNOR/A 0.00s J3 | HttpPartitionTest.testDistribSearch
     [exec]    [junit4]    > Assumption #1: 'slow' test group is disabled (@Slow())
     [exec]    [junit4] Completed on J3 in 0.01s, 1 test, 1 skipped
     [exec]    [junit4] 
     [exec]    [junit4] Suite: org.apache.solr.schema.ChangedSchemaMergeTest
     [exec]    [junit4] Completed on J1 in 0.64s, 1 test
     [exec]    [junit4] 
     [exec]    [junit4] Suite: org.apache.solr.search.join.BJQParserTest
     [exec]    [junit4] Completed on J0 in 3.30s, 9 tests
     [exec]    [junit4] 
     [exec]    [junit4] Suite: org.apache.solr.handler.component.TermsComponentTest
     [exec]    [junit4] Completed on J1 in 2.86s, 13 tests
     [exec]    [junit4] 
     [exec]    [junit4] Suite: org.apache.solr.handler.component.SpellCheckComponentTest
     [exec]    [junit4] IGNOR/A 0.00s J1 | SpellCheckComponentTest.testRelativeIndexDirLocation
     [exec]    [junit4]    > Assumption #1: 'slow' test group is disabled (@Slow())
     [exec]    [junit4] IGNOR/A 0.00s J1 | SpellCheckComponentTest.testExtendedResultsCount
     [exec]    [junit4]    > Assumption #1: 'slow' test group is disabled (@Slow())
     [exec]    [junit4] IGNOR/A 0.00s J1 | SpellCheckComponentTest.testRebuildOnCommit
     [exec]    [junit4]    > Assumption #1: 'slow' test group is disabled (@Slow())
     [exec]    [junit4] IGNOR/A 0.00s J1 | SpellCheckComponentTest.testCorrectSpelling
     [exec]    [junit4]    > Assumption #1: 'slow' test group is disabled (@Slow())
     [exec]    [junit4] IGNOR/A 0.00s J1 | SpellCheckComponentTest.testCollate
     [exec]    [junit4]    > Assumption #1: 'slow' test group is disabled (@Slow())
     [exec]    [junit4] IGNOR/A 0.00s J1 | SpellCheckComponentTest.test
     [exec]    [junit4]    > Assumption #1: 'slow' test group is disabled (@Slow())
     [exec]    [junit4] IGNOR/A 0.00s J1 | SpellCheckComponentTest.testReloadOnStart
     [exec]    [junit4]    > Assumption #1: 'slow' test group is disabled (@Slow())
     [exec]    [junit4] IGNOR/A 0.00s J1 | SpellCheckComponentTest.testThresholdTokenFrequency
     [exec]    [junit4]    > Assumption #1: 'slow' test group is disabled (@Slow())
     [exec]    [junit4] IGNOR/A 0.00s J1 | SpellCheckComponentTest.testPerDictionary
     [exec]    [junit4]    > Assumption #1: 'slow' test group is disabled (@Slow())
     [exec]    [junit4] Completed on J1 in 0.03s, 9 tests, 9 skipped
     [exec]    [junit4] 
     [exec]    [junit4] Suite: org.apache.solr.cloud.hdfs.HdfsChaosMonkeySafeLeaderTest
     [exec]    [junit4] IGNOR/A 0.00s J1 | HdfsChaosMonkeySafeLeaderTest.testDistribSearch
     [exec]    [junit4]    > Assumption #1: 'slow' test group is disabled (@Slow())
     [exec]    [junit4] Completed on J1 in 0.01s, 1 test, 1 skipped
     [exec]    [junit4] 
     [exec]    [junit4] Suite: org.apache.solr.update.TestUpdate
     [exec]    [junit4] Completed on J3 in 3.29s, 1 test
     [exec]    [junit4] 
     [exec]    [junit4] Suite: org.apache.solr.servlet.ResponseHeaderTest
     [exec]    [junit4] Completed on J1 in 1.79s, 5 tests
     [exec]    [junit4] 
     [exec]    [junit4] Suite: org.apache.solr.analysis.TestWordDelimiterFilterFactory
     [exec]    [junit4] Completed on J0 in 3.07s, 7 tests
     [exec]    [junit4] 
     [exec]    [junit4] Suite: org.apache.solr.cloud.ShardRoutingCustomTest
     [exec]    [junit4] IGNOR/A 0.00s J0 | ShardRoutingCustomTest.testDistribSearch
     [exec]    [junit4]    > Assumption #1: 'slow' test group is disabled (@Slow())
     [exec]    [junit4] Completed on J0 in 0.01s, 1 test, 1 skipped
     [exec]    [junit4] 
     [exec]    [junit4] Suite: org.apache.solr.util.TestUtils
     [exec]    [junit4] Completed on J0 in 0.03s, 3 tests
     [exec]    [junit4] 
     [exec]    [junit4] Suite: org.apache.solr.schema.TestCollationField
     [exec]    [junit4] Completed on J1 in 1.24s, 8 tests
     [exec]    [junit4] 
     [exec]    [junit4] Suite: org.apache.solr.core.CoreContainerCoreInitFailuresTest
     [exec]    [junit4] Completed on J1 in 1.83s, 2 tests
     [exec]    [junit4] 
     [exec]    [junit4] Suite: org.apache.solr.search.TestExtendedDismaxParser
     [exec]    [junit4] Completed on J1 in 4.46s, 18 tests
     [exec]    [junit4] 
     [exec]    [junit4] Suite: org.apache.solr.cloud.UnloadDistributedZkTest
     [exec]    [junit4] IGNOR/A 0.00s J1 | UnloadDistributedZkTest.testDistribSearch
     [exec]    [junit4]    > Assumption #1: 'slow' test group is disabled (@Slow())
     [exec]    [junit4] Completed on J1 in 0.01s, 1 test, 1 skipped
     [exec]    [junit4] 
     [exec]    [junit4] Suite: org.apache.solr.cloud.SyncSliceTest
     [exec]    [junit4] IGNOR/A 0.00s J1 | SyncSliceTest.testDistribSearch
     [exec]    [junit4]    > Assumption #1: 'slow' test group is disabled (@Slow())
     [exec]    [junit4] Completed on J1 in 0.01s, 1 test, 1 skipped
     [exec]    [junit4] 
     [exec]    [junit4] Suite: org.apache.solr.core.OpenCloseCoreStressTest
     [exec]    [junit4] IGNOR/A 0.01s J1 | OpenCloseCoreStressTest.test1HourOld
     [exec]    [junit4]    > Assumption #1: 'weekly' test group is disabled (@Weekly())
     [exec]    [junit4] IGNOR/A 0.01s J1 | OpenCloseCoreStressTest.test15SecondsNew
     [exec]    [junit4]    > Assumption #1: 'slow' test group is disabled (@Slow())
     [exec]    [junit4] IGNOR/A 0.00s J1 | OpenCloseCoreStressTest.test10MinutesNew
     [exec]    [junit4]    > Assumption #1: 'nightly' test group is disabled (@Nightly())
     [exec]    [junit4] IGNOR/A 0.00s J1 | OpenCloseCoreStressTest.test1HourNew
     [exec]    [junit4]    > Assumption #1: 'weekly' test group is disabled (@Weekly())
     [exec]    [junit4] IGNOR/A 0.00s J1 | OpenCloseCoreStressTest.test15SecondsOld
     [exec]    [junit4]    > Assumption #1: 'slow' test group is disabled (@Slow())
     [exec]    [junit4] IGNOR/A 0.00s J1 | OpenCloseCoreStressTest.test10MinutesOld
     [exec]    [junit4]    > Assumption #1: 'nightly' test group is disabled (@Nightly())
     [exec]    [junit4] Completed on J1 in 0.03s, 6 tests, 6 skipped
     [exec]    [junit4] 
     [exec]    [junit4] Suite: org.apache.solr.cloud.OverseerTest
     [exec]    [junit4] IGNOR/A 0.00s J1 | OverseerTest.testShardAssignmentBigger
     [exec]    [junit4]    > Assumption #1: 'slow' test group is disabled (@Slow())
     [exec]    [junit4] IGNOR/A 0.00s J1 | OverseerTest.testPlaceholders
     [exec]    [junit4]    > Assumption #1: 'slow' test group is disabled (@Slow())
     [exec]    [junit4] IGNOR/A 0.00s J1 | OverseerTest.testShardAssignment
     [exec]    [junit4]    > Assumption #1: 'slow' test group is disabled (@Slow())
     [exec]    [junit4] IGNOR/A 0.00s J1 | OverseerTest.testOverseerFailure
     [exec]    [junit4]    > Assumption #1: 'slow' test group is disabled (@Slow())
     [exec]    [junit4] IGNOR/A 0.00s J1 | OverseerTest.testDoubleAssignment
     [exec]    [junit4]    > Assumption #1: 'slow' test group is disabled (@Slow())
     [exec]    [junit4] IGNOR/A 0.00s J1 | OverseerTest.testBadQueueItem
     [exec]    [junit4]    > Assumption #1: 'slow' test group is disabled (@Slow())
     [exec]    [junit4] IGNOR/A 0.00s J1 | OverseerTest.testShardLeaderChange
     [exec]    [junit4]    > Assumption #1: 'slow' test group is disabled (@Slow())
     [exec]    [junit4] IGNOR/A 0.00s J1 | OverseerTest.testStateChange
     [exec]    [junit4]    > Assumption #1: 'slow' test group is disabled (@Slow())
     [exec]    [junit4] IGNOR/A 0.00s J1 | OverseerTest.testReplay
     [exec]    [junit4]    > Assumption #1: 'slow' test group is disabled (@Slow())
     [exec]    [junit4] Completed on J1 in 0.04s, 9 tests, 9 skipped
     [exec]    [junit4] 
     [exec]    [junit4] Suite: org.apache.solr.cloud.LeaderElectionIntegrationTest
     [exec]    [junit4] IGNOR/A 0.00s J1 | LeaderElectionIntegrationTest.testSimpleSliceLeaderElection
     [exec]    [junit4]    > Assumption #1: 'slow' test group is disabled (@Slow())
     [exec]    [junit4] IGNOR/A 0.00s J1 | LeaderElectionIntegrationTest.testLeaderElectionAfterClientTimeout
     [exec]    [junit4]    > Assumption #1: 'slow' test group is disabled (@Slow())
     [exec]    [junit4] Completed on J1 in 0.01s, 2 tests, 2 skipped
     [exec]    [junit4] 
     [exec]    [junit4] Suite: org.apache.solr.cloud.RecoveryZkTest
     [exec]    [junit4] IGNOR/A 0.00s J1 | RecoveryZkTest.testDistribSearch
     [exec]    [junit4]    > Assumption #1: 'slow' test group is disabled (@Slow())
     [exec]    [junit4] Completed on J1 in 0.01s, 1 test, 1 skipped
     [exec]    [junit4] 
     [exec]    [junit4] Suite: org.apache.solr.handler.TestReplicationHandler
     [exec]    [junit4] IGNOR/A 0.00s J1 | TestReplicationHandler.doTestRepeater
     [exec]    [junit4]    > Assumption #1: 'slow' test group is disabled (@Slow())
     [exec]    [junit4] IGNOR/A 0.00s J1 | TestReplicationHandler.doTestReplicateAfterStartup
     [exec]    [junit4]    > Assumption #1: 'slow' test group is disabled (@Slow())
     [exec]    [junit4] IGNOR/A 0.00s J1 | TestReplicationHandler.testNoWriter
     [exec]    [junit4]    > Assumption #1: 'slow' test group is disabled (@Slow())
     [exec]    [junit4] IGNOR/A 0.00s J1 | TestReplicationHandler.doTestReplicateAfterWrite2Slave
     [exec]    [junit4]    > Assumption #1: 'slow' test group is disabled (@Slow())
     [exec]    [junit4] IGNOR/A 0.00s J1 | TestReplicationHandler.doTestReplicateAfterStartupWithNoActivity
     [exec]    [junit4]    > Assumption #1: 'slow' test group is disabled (@Slow())
     [exec]    [junit4] IGNOR/A 0.00s J1 | TestReplicationHandler.testEmptyCommits
     [exec]    [junit4]    > Assumption #1: 'slow' test group is disabled (@Slow())
     [exec]    [junit4] IGNOR/A 0.00s J1 | TestReplicationHandler.doTestIndexAndConfigAliasReplication
     [exec]    [junit4]    > Assumption #1: 'slow' test group is disabled (@Slow())
     [exec]    [junit4] IGNOR/A 0.00s J1 | TestReplicationHandler.doTestReplicateAfterCoreReload
     [exec]    [junit4]    > Assumption #1: 'slow' test group is disabled (@Slow())
     [exec]    [junit4] IGNOR/A 0.00s J1 | TestReplicationHandler.doTestStressReplication
     [exec]    [junit4]    > Assumption #1: 'slow' test group is disabled (@Slow())
     [exec]    [junit4] IGNOR/A 0.00s J1 | TestReplicationHandler.doTestIndexAndConfigReplication
     [exec]    [junit4]    > Assumption #1: 'slow' test group is disabled (@Slow())
     [exec]    [junit4] IGNOR/A 0.00s J1 | TestReplicationHandler.doTestStopPoll
     [exec]    [junit4]    > Assumption #1: 'slow' test group is disabled (@Slow())
     [exec]    [junit4] IGNOR/A 0.00s J1 | TestReplicationHandler.doTestDetails
     [exec]    [junit4]    > Assumption #1: 'slow' test group is disabled (@Slow())
     [exec]    [junit4] IGNOR/A 0.00s J1 | TestReplicationHandler.doTestSnapPullWithMasterUrl
     [exec]    [junit4]    > Assumption #1: 'slow' test group is disabled (@Slow())
     [exec]    [junit4] Completed on J1 in 0.05s, 13 tests, 13 skipped
     [exec]    [junit4] 
     [exec]    [junit4] Suite: org.apache.solr.cloud.ClusterStateUpdateTest
     [exec]    [junit4] IGNOR/A 0.00s J1 | ClusterStateUpdateTest.testCoreRegistration
     [exec]    [junit4]    > Assumption #1: 'slow' test group is disabled (@Slow())
     [exec]    [junit4] Completed on J1 in 0.01s, 1 test, 1 skipped
     [exec]    [junit4] 
     [exec]    [junit4] Suite: org.apache.solr.TestRandomFaceting
     [exec]    [junit4] IGNOR/A 0.00s J1 | TestRandomFaceting.testRandomFaceting
     [exec]    [junit4]    > Assumption #1: 'slow' test group is disabled (@Slow())
     [exec]    [junit4] Completed on J1 in 0.01s, 1 test, 1 skipped
     [exec]    [junit4] 
     [exec]    [junit4] Suite: org.apache.solr.cloud.LeaderElectionTest
     [exec]    [junit4] IGNOR/A 0.00s J1 | LeaderElectionTest.testElection
     [exec]    [junit4]    > Assumption #1: 'slow' test group is disabled (@Slow())
     [exec]    [junit4] IGNOR/A 0.00s J1 | LeaderElectionTest.testStressElection
     [exec]    [junit4]    > Assumption #1: 'slow' test group is disabled (@Slow())
     [exec]    [junit4] IGNOR/A 0.00s J1 | LeaderElectionTest.testBasic
     [exec]    [junit4]    > Assumption #1: 'slow' test group is disabled (@Slow())
     [exec]    [junit4] IGNOR/A 0.00s J1 | LeaderElectionTest.testCancelElection
     [exec]    [junit4]    > Assumption #1: 'slow' test group is disabled (@Slow())
     [exec]    [junit4] Completed on J1 in 0.02s, 4 tests, 4 skipped
     [exec]    [junit4] 
     [exec]    [junit4] Suite: org.apache.solr.search.TestStressVersions
     [exec]    [junit4] Completed on J0 in 15.02s, 1 test
     [exec]    [junit4] 
     [exec]    [junit4] Suite: org.apache.solr.request.JSONWriterTest
     [exec]    [junit4] Completed on J0 in 2.48s, 3 tests
     [exec]    [junit4] 
     [exec]    [junit4] Sui

[...truncated too long message...]

    [junit4] Completed on J3 in 0.01s, 1 test, 1 skipped
     [exec]    [junit4] 
     [exec]    [junit4] Suite: org.apache.solr.rest.schema.analysis.TestManagedStopFilterFactory
     [exec]    [junit4] Completed on J3 in 0.01s, 1 test, 1 skipped
     [exec]    [junit4] 
     [exec]    [junit4] Suite: org.apache.solr.schema.BadCopyFieldTest
     [exec]    [junit4] Completed on J3 in 0.01s, 5 tests, 5 skipped
     [exec]    [junit4] 
     [exec]    [junit4] Suite: org.apache.solr.schema.DocValuesMissingTest
     [exec]    [junit4] Completed on J3 in 0.03s, 58 tests, 58 skipped
     [exec]    [junit4] 
     [exec]    [junit4] Suite: org.apache.solr.schema.TestCloudManagedSchemaAddField
     [exec]    [junit4] IGNOR/A 0.00s J3 | TestCloudManagedSchemaAddField.testDistribSearch
     [exec]    [junit4]    > Assumption #1: 'slow' test group is disabled (@Slow())
     [exec]    [junit4] Completed on J3 in 0.00s, 1 test, 1 skipped
     [exec]    [junit4] 
     [exec]    [junit4] Suite: org.apache.solr.schema.TestCollationFieldDocValues
     [exec]    [junit4] Completed on J3 in 0.01s, 8 tests, 8 skipped
     [exec]    [junit4] 
     [exec]    [junit4] Suite: org.apache.solr.search.CursorMarkTest
     [exec]    [junit4] Completed on J3 in 0.01s, 4 tests, 4 skipped
     [exec]    [junit4] 
     [exec]    [junit4] Suite: org.apache.solr.search.TestCustomSort
     [exec]    [junit4] Completed on J3 in 0.01s, 1 test, 1 skipped
     [exec]    [junit4] 
     [exec]    [junit4] Suite: org.apache.solr.search.TestMaxScoreQueryParser
     [exec]    [junit4] Completed on J3 in 0.01s, 6 tests, 6 skipped
     [exec]    [junit4] 
     [exec]    [junit4] Suite: org.apache.solr.search.TestOverriddenPrefixQueryForCustomFieldType
     [exec]    [junit4] Completed on J3 in 0.01s, 2 tests, 2 skipped
     [exec]    [junit4] 
     [exec]    [junit4] Suite: org.apache.solr.search.TestSearcherReuse
     [exec]    [junit4] Completed on J3 in 0.00s, 1 test, 1 skipped
     [exec]    [junit4] 
     [exec]    [junit4] Suite: org.apache.solr.search.TestStressUserVersions
     [exec]    [junit4] Completed on J3 in 0.00s, 1 test, 1 skipped
     [exec]    [junit4] 
     [exec]    [junit4] Suite: org.apache.solr.spelling.suggest.TestAnalyzeInfixSuggestions
     [exec]    [junit4] Completed on J3 in 0.00s, 2 tests, 2 skipped
     [exec]    [junit4] 
     [exec]    [junit4] Suite: org.apache.solr.spelling.suggest.TestBlendedInfixSuggestions
     [exec]    [junit4] Completed on J3 in 0.01s, 3 tests, 3 skipped
     [exec]    [junit4] 
     [exec]    [junit4] Suite: org.apache.solr.spelling.suggest.TestFreeTextSuggestions
     [exec]    [junit4] Completed on J3 in 0.00s, 1 test, 1 skipped
     [exec]    [junit4] 
     [exec]    [junit4] Suite: org.apache.solr.store.hdfs.HdfsLockFactoryTest
     [exec]    [junit4] Completed on J3 in 0.01s, 1 test, 1 skipped
     [exec]    [junit4] 
     [exec]    [junit4] Suite: org.apache.solr.update.AddBlockUpdateTest
     [exec]    [junit4] Completed on J3 in 0.01s, 6 tests, 6 skipped
     [exec]    [junit4] 
     [exec]    [junit4] Suite: org.apache.solr.core.TestSolrXmlPersistence
     [exec]    [junit4] Completed on J0 in 9.18s, 8 tests
     [exec]    [junit4] 
     [exec]    [junit4] Suite: org.apache.solr.update.AnalysisErrorHandlingTest
     [exec]    [junit4] Completed on J3 in 0.01s, 1 test, 1 skipped
     [exec]    [junit4] 
     [exec]    [junit4] Suite: org.apache.solr.update.processor.DocExpirationUpdateProcessorFactoryTest
     [exec]    [junit4] Completed on J3 in 0.01s, 5 tests, 5 skipped
     [exec]    [junit4] 
     [exec]    [junit4] Suite: org.apache.solr.update.processor.ParsingFieldUpdateProcessorsTest
     [exec]    [junit4] Completed on J3 in 0.02s, 33 tests, 33 skipped
     [exec]    [junit4] 
     [exec]    [junit4] Suite: org.apache.solr.update.processor.PreAnalyzedUpdateProcessorTest
     [exec]    [junit4] Completed on J3 in 0.01s, 2 tests, 2 skipped
     [exec]    [junit4] 
     [exec]    [junit4] Suite: org.apache.solr.util.TestRandomMergePolicy
     [exec]    [junit4] Completed on J3 in 0.01s, 2 tests, 2 skipped
     [exec]    [junit4] 
     [exec]    [junit4] Suite: org.apache.solr.update.processor.AddSchemaFieldsUpdateProcessorFactoryTest
     [exec]    [junit4] Completed on J2 in 6.90s, 6 tests
     [exec]    [junit4] 
     [exec]    [junit4] Suite: org.apache.solr.CursorPagingTest
     [exec]    [junit4] Completed on J1 in 20.15s, 5 tests
     [exec]    [junit4] 
     [exec]    [junit4] Suite: org.apache.solr.update.processor.AtomicUpdatesTest
     [exec]    [junit4] Completed on J0 in 2.56s, 4 tests
     [exec]    [junit4] 
     [exec]    [junit4] Suite: org.apache.solr.store.blockcache.BlockDirectoryTest
     [exec]    [junit4] Completed on J2 in 9.51s, 4 tests
     [exec]    [junit4] 
     [exec]    [junit4] Suite: org.apache.solr.internal.csv.writer.CSVFieldTest
     [exec]    [junit4] Completed on J2 in 0.01s, 2 tests
     [exec]    [junit4] 
     [exec]    [junit4] Suite: org.apache.solr.handler.component.DistributedExpandComponentTest
     [exec]    [junit4] Completed on J2 in 6.35s, 1 test
     [exec]    [junit4] 
     [exec]    [junit4] Suite: org.apache.solr.handler.XmlUpdateRequestHandlerTest
     [exec]    [junit4] Completed on J2 in 2.73s, 5 tests
     [exec]    [junit4] 
     [exec]    [junit4] Suite: org.apache.solr.core.AlternateDirectoryTest
     [exec]    [junit4] Completed on J2 in 1.96s, 2 tests
     [exec]    [junit4] 
     [exec]    [junit4] Suite: org.apache.solr.search.TestValueSourceCache
     [exec]    [junit4] Completed on J2 in 2.20s, 2 tests
     [exec]    [junit4] 
     [exec]    [junit4] Suite: org.apache.solr.schema.EnumFieldTest
     [exec]    [junit4] Completed on J2 in 1.03s, 6 tests
     [exec]    [junit4] 
     [exec]    [junit4] Suite: org.apache.solr.core.SolrCoreCheckLockOnStartupTest
     [exec]    [junit4] Completed on J2 in 4.64s, 2 tests
     [exec]    [junit4] 
     [exec]    [junit4] Suite: org.apache.solr.search.TestComplexPhraseQParserPlugin
     [exec]    [junit4] Completed on J2 in 2.40s, 6 tests
     [exec]    [junit4] 
     [exec]    [junit4] 
     [exec]    [junit4] Tests with failures:
     [exec]    [junit4]   - org.apache.solr.handler.TestReplicationHandlerBackup (suite)
     [exec]    [junit4] 
     [exec]    [junit4] 
     [exec]    [junit4] JVM J0:     3.39 ..   289.91 =   286.52s
     [exec]    [junit4] JVM J1:     3.64 ..   289.24 =   285.60s
     [exec]    [junit4] JVM J2:     3.17 ..   319.54 =   316.37s
     [exec]    [junit4] JVM J3:     3.40 ..   288.36 =   284.96s
     [exec]    [junit4] Execution time total: 5 minutes 19 seconds
     [exec]    [junit4] Tests summary: 408 suites, 1689 tests, 2 suite-level errors, 807 ignored (122 assumptions)
     [exec] 
     [exec] BUILD FAILED
     [exec] /usr/home/hudson/hudson-slave/workspace/Lucene-Solr-SmokeRelease-trunk/lucene/build/fakeReleaseTmp/unpack/solr-5.0.0/solr/build.xml:189: The following error occurred while executing this line:
     [exec] /usr/home/hudson/hudson-slave/workspace/Lucene-Solr-SmokeRelease-trunk/lucene/build/fakeReleaseTmp/unpack/solr-5.0.0/solr/common-build.xml:496: The following error occurred while executing this line:
     [exec] /usr/home/hudson/hudson-slave/workspace/Lucene-Solr-SmokeRelease-trunk/lucene/build/fakeReleaseTmp/unpack/solr-5.0.0/lucene/common-build.xml:1296: The following error occurred while executing this line:
     [exec] /usr/home/hudson/hudson-slave/workspace/Lucene-Solr-SmokeRelease-trunk/lucene/build/fakeReleaseTmp/unpack/solr-5.0.0/lucene/common-build.xml:920: There were test failures: 408 suites, 1689 tests, 2 suite-level errors, 807 ignored (122 assumptions)
     [exec] 
     [exec] Total time: 5 minutes 49 seconds
     [exec] 
     [exec] 
     [exec] Traceback (most recent call last):
     [exec]   File "/usr/home/hudson/hudson-slave/workspace/Lucene-Solr-SmokeRelease-trunk/dev-tools/scripts/smokeTestRelease.py", line 1343, in <module>
     [exec]     main()
     [exec]   File "/usr/home/hudson/hudson-slave/workspace/Lucene-Solr-SmokeRelease-trunk/dev-tools/scripts/smokeTestRelease.py", line 1287, in main
     [exec]     smokeTest(baseURL, svnRevision, version, tmpDir, isSigned, testArgs)
     [exec]   File "/usr/home/hudson/hudson-slave/workspace/Lucene-Solr-SmokeRelease-trunk/dev-tools/scripts/smokeTestRelease.py", line 1332, in smokeTest
     [exec]     unpackAndVerify('solr', tmpDir, 'solr-%s-src.tgz' % version, svnRevision, version, testArgs, baseURL)
     [exec]   File "/usr/home/hudson/hudson-slave/workspace/Lucene-Solr-SmokeRelease-trunk/dev-tools/scripts/smokeTestRelease.py", line 637, in unpackAndVerify
     [exec]     verifyUnpacked(project, artifact, unpackPath, svnRevision, version, testArgs, tmpDir, baseURL)
     [exec]   File "/usr/home/hudson/hudson-slave/workspace/Lucene-Solr-SmokeRelease-trunk/dev-tools/scripts/smokeTestRelease.py", line 744, in verifyUnpacked
     [exec]     run('%s; ant clean test -Dtests.slow=false %s' % (javaExe('1.7'), testArgs), '%s/test.log' % unpackPath)
     [exec]   File "/usr/home/hudson/hudson-slave/workspace/Lucene-Solr-SmokeRelease-trunk/dev-tools/scripts/smokeTestRelease.py", line 562, in run
     [exec]     raise RuntimeError('command "%s" failed; see log file %s' % (command, logPath))
     [exec] RuntimeError: command "export JAVA_HOME="/home/hudson/tools/java/latest1.7" PATH="/home/hudson/tools/java/latest1.7/bin:$PATH" JAVACMD="/home/hudson/tools/java/latest1.7/bin/java"; ant clean test -Dtests.slow=false -Dtests.jettyConnector=Socket  -Dtests.disableHdfs=true" failed; see log file /usr/home/hudson/hudson-slave/workspace/Lucene-Solr-SmokeRelease-trunk/lucene/build/fakeReleaseTmp/unpack/solr-5.0.0/test.log

BUILD FAILED
/usr/home/hudson/hudson-slave/workspace/Lucene-Solr-SmokeRelease-trunk/build.xml:387: exec returned: 1

Total time: 65 minutes 48 seconds
Build step 'Invoke Ant' marked build as failure
Email was triggered for: Failure
Sending email for trigger: Failure



Mime
View raw message