lucene-dev mailing list archives

Site index · List index
Message view « Date » · « Thread »
Top « Date » · « Thread »
From Policeman Jenkins Server <jenk...@thetaphi.de>
Subject [JENKINS] Lucene-Solr-trunk-Windows (32bit/jdk1.8.0_20-ea-b15) - Build # 4119 - Failure!
Date Mon, 16 Jun 2014 02:30:44 GMT
Build: http://jenkins.thetaphi.de/job/Lucene-Solr-trunk-Windows/4119/
Java: 32bit/jdk1.8.0_20-ea-b15 -client -XX:+UseParallelGC

1 tests failed.
FAILED:  org.apache.lucene.spatial.prefix.DateNRStrategyTest.testIntersects {#9 seed=[9A471D2338218380:7D5C3DAFC19B7D24]}

Error Message:
Should have matched I#1:[-1526755-03-07T23:18:19.371 TO -1526755-04-01T00:22] Q:[-1526755-04
TO -1526755-04-01T02:41:51.480]

Stack Trace:
java.lang.AssertionError: Should have matched I#1:[-1526755-03-07T23:18:19.371 TO -1526755-04-01T00:22]
Q:[-1526755-04 TO -1526755-04-01T02:41:51.480]
	at __randomizedtesting.SeedInfo.seed([9A471D2338218380:7D5C3DAFC19B7D24]:0)
	at org.junit.Assert.fail(Assert.java:93)
	at org.apache.lucene.spatial.prefix.BaseNonFuzzySpatialOpStrategyTest.fail(BaseNonFuzzySpatialOpStrategyTest.java:128)
	at org.apache.lucene.spatial.prefix.BaseNonFuzzySpatialOpStrategyTest.testOperation(BaseNonFuzzySpatialOpStrategyTest.java:122)
	at org.apache.lucene.spatial.prefix.BaseNonFuzzySpatialOpStrategyTest.testOperationRandomShapes(BaseNonFuzzySpatialOpStrategyTest.java:64)
	at org.apache.lucene.spatial.prefix.DateNRStrategyTest.testIntersects(DateNRStrategyTest.java:53)
	at sun.reflect.NativeMethodAccessorImpl.invoke0(Native Method)
	at sun.reflect.NativeMethodAccessorImpl.invoke(NativeMethodAccessorImpl.java:62)
	at sun.reflect.DelegatingMethodAccessorImpl.invoke(DelegatingMethodAccessorImpl.java:43)
	at java.lang.reflect.Method.invoke(Method.java:483)
	at com.carrotsearch.randomizedtesting.RandomizedRunner.invoke(RandomizedRunner.java:1618)
	at com.carrotsearch.randomizedtesting.RandomizedRunner$6.evaluate(RandomizedRunner.java:827)
	at com.carrotsearch.randomizedtesting.RandomizedRunner$7.evaluate(RandomizedRunner.java:863)
	at com.carrotsearch.randomizedtesting.RandomizedRunner$8.evaluate(RandomizedRunner.java:877)
	at org.apache.lucene.util.TestRuleSetupTeardownChained$1.evaluate(TestRuleSetupTeardownChained.java:50)
	at org.apache.lucene.util.AbstractBeforeAfterRule$1.evaluate(AbstractBeforeAfterRule.java:46)
	at com.carrotsearch.randomizedtesting.rules.SystemPropertiesInvariantRule$1.evaluate(SystemPropertiesInvariantRule.java:55)
	at org.apache.lucene.util.TestRuleThreadAndTestName$1.evaluate(TestRuleThreadAndTestName.java:49)
	at org.apache.lucene.util.TestRuleIgnoreAfterMaxFailures$1.evaluate(TestRuleIgnoreAfterMaxFailures.java:65)
	at org.apache.lucene.util.TestRuleMarkFailure$1.evaluate(TestRuleMarkFailure.java:48)
	at com.carrotsearch.randomizedtesting.rules.StatementAdapter.evaluate(StatementAdapter.java:36)
	at com.carrotsearch.randomizedtesting.ThreadLeakControl$StatementRunner.run(ThreadLeakControl.java:360)
	at com.carrotsearch.randomizedtesting.ThreadLeakControl.forkTimeoutingTask(ThreadLeakControl.java:793)
	at com.carrotsearch.randomizedtesting.ThreadLeakControl$3.evaluate(ThreadLeakControl.java:453)
	at com.carrotsearch.randomizedtesting.RandomizedRunner.runSingleTest(RandomizedRunner.java:836)
	at com.carrotsearch.randomizedtesting.RandomizedRunner$3.evaluate(RandomizedRunner.java:738)
	at com.carrotsearch.randomizedtesting.RandomizedRunner$4.evaluate(RandomizedRunner.java:772)
	at com.carrotsearch.randomizedtesting.RandomizedRunner$5.evaluate(RandomizedRunner.java:783)
	at org.apache.lucene.util.AbstractBeforeAfterRule$1.evaluate(AbstractBeforeAfterRule.java:46)
	at org.apache.lucene.util.TestRuleStoreClassName$1.evaluate(TestRuleStoreClassName.java:42)
	at com.carrotsearch.randomizedtesting.rules.SystemPropertiesInvariantRule$1.evaluate(SystemPropertiesInvariantRule.java:55)
	at com.carrotsearch.randomizedtesting.rules.NoShadowingOrOverridesOnMethodsRule$1.evaluate(NoShadowingOrOverridesOnMethodsRule.java:39)
	at com.carrotsearch.randomizedtesting.rules.NoShadowingOrOverridesOnMethodsRule$1.evaluate(NoShadowingOrOverridesOnMethodsRule.java:39)
	at com.carrotsearch.randomizedtesting.rules.StatementAdapter.evaluate(StatementAdapter.java:36)
	at com.carrotsearch.randomizedtesting.rules.StatementAdapter.evaluate(StatementAdapter.java:36)
	at com.carrotsearch.randomizedtesting.rules.StatementAdapter.evaluate(StatementAdapter.java:36)
	at org.apache.lucene.util.TestRuleAssertionsRequired$1.evaluate(TestRuleAssertionsRequired.java:43)
	at org.apache.lucene.util.TestRuleMarkFailure$1.evaluate(TestRuleMarkFailure.java:48)
	at org.apache.lucene.util.TestRuleIgnoreAfterMaxFailures$1.evaluate(TestRuleIgnoreAfterMaxFailures.java:65)
	at org.apache.lucene.util.TestRuleIgnoreTestSuites$1.evaluate(TestRuleIgnoreTestSuites.java:55)
	at com.carrotsearch.randomizedtesting.rules.StatementAdapter.evaluate(StatementAdapter.java:36)
	at com.carrotsearch.randomizedtesting.ThreadLeakControl$StatementRunner.run(ThreadLeakControl.java:360)
	at java.lang.Thread.run(Thread.java:745)




Build Log:
[...truncated 9594 lines...]
   [junit4] Suite: org.apache.lucene.spatial.prefix.DateNRStrategyTest
   [junit4]   2> NOTE: reproduce with: ant test  -Dtestcase=DateNRStrategyTest -Dtests.method=testIntersects
-Dtests.seed=9A471D2338218380 -Dtests.slow=true -Dtests.locale=fr -Dtests.timezone=America/Los_Angeles
-Dtests.file.encoding=US-ASCII
   [junit4] FAILURE 0.08s | DateNRStrategyTest.testIntersects {#9 seed=[9A471D2338218380:7D5C3DAFC19B7D24]}
<<<
   [junit4]    > Throwable #1: java.lang.AssertionError: Should have matched I#1:[-1526755-03-07T23:18:19.371
TO -1526755-04-01T00:22] Q:[-1526755-04 TO -1526755-04-01T02:41:51.480]
   [junit4]    > 	at __randomizedtesting.SeedInfo.seed([9A471D2338218380:7D5C3DAFC19B7D24]:0)
   [junit4]    > 	at org.apache.lucene.spatial.prefix.BaseNonFuzzySpatialOpStrategyTest.fail(BaseNonFuzzySpatialOpStrategyTest.java:128)
   [junit4]    > 	at org.apache.lucene.spatial.prefix.BaseNonFuzzySpatialOpStrategyTest.testOperation(BaseNonFuzzySpatialOpStrategyTest.java:122)
   [junit4]    > 	at org.apache.lucene.spatial.prefix.BaseNonFuzzySpatialOpStrategyTest.testOperationRandomShapes(BaseNonFuzzySpatialOpStrategyTest.java:64)
   [junit4]    > 	at org.apache.lucene.spatial.prefix.DateNRStrategyTest.testIntersects(DateNRStrategyTest.java:53)
   [junit4]    > 	at java.lang.Thread.run(Thread.java:745)
   [junit4]   2> NOTE: test params are: codec=HighCompressionCompressingStoredFields(storedFieldsFormat=CompressingStoredFieldsFormat(compressionMode=HIGH_COMPRESSION,
chunkSize=65), termVectorsFormat=CompressingTermVectorsFormat(compressionMode=HIGH_COMPRESSION,
chunkSize=65)), sim=DefaultSimilarity, locale=fr, timezone=America/Los_Angeles
   [junit4]   2> NOTE: Windows 7 6.1 x86/Oracle Corporation 1.8.0_20-ea (32-bit)/cpus=2,threads=1,free=125947896,total=315621376
   [junit4]   2> NOTE: All tests run in this JVM: [TestPointVectorStrategy, JtsPolygonTest,
SerializedStrategyTest, TestRecursivePrefixTreeStrategy, DateRangePrefixTreeTest, QueryEqualsHashCodeTest,
TestBBoxStrategy, TestTermQueryPrefixGridStrategy, PortedSolr3Test, SpatialOpRecursivePrefixTreeTest,
TestTestFramework, DistanceStrategyTest, SpatialPrefixTreeTest, SpatialArgsParserTest, DateNRStrategyTest]
   [junit4] Completed in 2.70s, 42 tests, 1 failure, 10 skipped <<< FAILURES!

[...truncated 9 lines...]
BUILD FAILED
C:\Users\JenkinsSlave\workspace\Lucene-Solr-trunk-Windows\build.xml:467: The following error
occurred while executing this line:
C:\Users\JenkinsSlave\workspace\Lucene-Solr-trunk-Windows\build.xml:447: The following error
occurred while executing this line:
C:\Users\JenkinsSlave\workspace\Lucene-Solr-trunk-Windows\build.xml:45: The following error
occurred while executing this line:
C:\Users\JenkinsSlave\workspace\Lucene-Solr-trunk-Windows\extra-targets.xml:37: The following
error occurred while executing this line:
C:\Users\JenkinsSlave\workspace\Lucene-Solr-trunk-Windows\lucene\build.xml:543: The following
error occurred while executing this line:
C:\Users\JenkinsSlave\workspace\Lucene-Solr-trunk-Windows\lucene\common-build.xml:2017: The
following error occurred while executing this line:
C:\Users\JenkinsSlave\workspace\Lucene-Solr-trunk-Windows\lucene\module-build.xml:60: The
following error occurred while executing this line:
C:\Users\JenkinsSlave\workspace\Lucene-Solr-trunk-Windows\lucene\common-build.xml:1296: The
following error occurred while executing this line:
C:\Users\JenkinsSlave\workspace\Lucene-Solr-trunk-Windows\lucene\common-build.xml:920: There
were test failures: 17 suites, 125 tests, 1 failure, 12 ignored (2 assumptions)

Total time: 32 minutes 56 seconds
Build step 'Invoke Ant' marked build as failure
Description set: Java: 32bit/jdk1.8.0_20-ea-b15 -client -XX:+UseParallelGC
Archiving artifacts
Recording test results
Email was triggered for: Failure - Any
Sending email for trigger: Failure - Any



Mime
View raw message