lucene-dev mailing list archives

Site index · List index
Message view « Date » · « Thread »
Top « Date » · « Thread »
From Policeman Jenkins Server <jenk...@thetaphi.de>
Subject [JENKINS] Lucene-Solr-4.x-MacOSX (64bit/jdk1.7.0) - Build # 1627 - Failure!
Date Fri, 20 Jun 2014 07:45:06 GMT
Build: http://jenkins.thetaphi.de/job/Lucene-Solr-4.x-MacOSX/1627/
Java: 64bit/jdk1.7.0 -XX:-UseCompressedOops -XX:+UseConcMarkSweepGC

2 tests failed.
REGRESSION:  org.apache.solr.cloud.SliceStateUpdateTest.testSliceStateUpdate

Error Message:
Path cannot be null

Stack Trace:
java.lang.IllegalArgumentException: Path cannot be null
	at __randomizedtesting.SeedInfo.seed([76ACA1B79F433096:A6CE2CFBC196EA12]:0)
	at org.apache.zookeeper.common.PathUtils.validatePath(PathUtils.java:45)
	at org.apache.zookeeper.ZooKeeper.delete(ZooKeeper.java:851)
	at org.apache.solr.common.cloud.SolrZkClient$2.execute(SolrZkClient.java:177)
	at org.apache.solr.common.cloud.SolrZkClient$2.execute(SolrZkClient.java:174)
	at org.apache.solr.common.cloud.ZkCmdExecutor.retryOperation(ZkCmdExecutor.java:73)
	at org.apache.solr.common.cloud.SolrZkClient.delete(SolrZkClient.java:174)
	at org.apache.solr.cloud.ElectionContext.cancelElection(ElectionContext.java:71)
	at org.apache.solr.cloud.OverseerElectionContext.cancelElection(ElectionContext.java:533)
	at org.apache.solr.cloud.SliceStateUpdateTest.testSliceStateUpdate(SliceStateUpdateTest.java:184)
	at sun.reflect.NativeMethodAccessorImpl.invoke0(Native Method)
	at sun.reflect.NativeMethodAccessorImpl.invoke(NativeMethodAccessorImpl.java:57)
	at sun.reflect.DelegatingMethodAccessorImpl.invoke(DelegatingMethodAccessorImpl.java:43)
	at java.lang.reflect.Method.invoke(Method.java:606)
	at com.carrotsearch.randomizedtesting.RandomizedRunner.invoke(RandomizedRunner.java:1618)
	at com.carrotsearch.randomizedtesting.RandomizedRunner$6.evaluate(RandomizedRunner.java:827)
	at com.carrotsearch.randomizedtesting.RandomizedRunner$7.evaluate(RandomizedRunner.java:863)
	at com.carrotsearch.randomizedtesting.RandomizedRunner$8.evaluate(RandomizedRunner.java:877)
	at com.carrotsearch.randomizedtesting.rules.SystemPropertiesRestoreRule$1.evaluate(SystemPropertiesRestoreRule.java:53)
	at org.apache.lucene.util.TestRuleSetupTeardownChained$1.evaluate(TestRuleSetupTeardownChained.java:50)
	at org.apache.lucene.util.TestRuleFieldCacheSanity$1.evaluate(TestRuleFieldCacheSanity.java:51)
	at org.apache.lucene.util.AbstractBeforeAfterRule$1.evaluate(AbstractBeforeAfterRule.java:46)
	at com.carrotsearch.randomizedtesting.rules.SystemPropertiesInvariantRule$1.evaluate(SystemPropertiesInvariantRule.java:55)
	at org.apache.lucene.util.TestRuleThreadAndTestName$1.evaluate(TestRuleThreadAndTestName.java:49)
	at org.apache.lucene.util.TestRuleIgnoreAfterMaxFailures$1.evaluate(TestRuleIgnoreAfterMaxFailures.java:65)
	at org.apache.lucene.util.TestRuleMarkFailure$1.evaluate(TestRuleMarkFailure.java:48)
	at com.carrotsearch.randomizedtesting.rules.StatementAdapter.evaluate(StatementAdapter.java:36)
	at com.carrotsearch.randomizedtesting.ThreadLeakControl$StatementRunner.run(ThreadLeakControl.java:360)
	at com.carrotsearch.randomizedtesting.ThreadLeakControl.forkTimeoutingTask(ThreadLeakControl.java:793)
	at com.carrotsearch.randomizedtesting.ThreadLeakControl$3.evaluate(ThreadLeakControl.java:453)
	at com.carrotsearch.randomizedtesting.RandomizedRunner.runSingleTest(RandomizedRunner.java:836)
	at com.carrotsearch.randomizedtesting.RandomizedRunner$3.evaluate(RandomizedRunner.java:738)
	at com.carrotsearch.randomizedtesting.RandomizedRunner$4.evaluate(RandomizedRunner.java:772)
	at com.carrotsearch.randomizedtesting.RandomizedRunner$5.evaluate(RandomizedRunner.java:783)
	at com.carrotsearch.randomizedtesting.rules.StatementAdapter.evaluate(StatementAdapter.java:36)
	at com.carrotsearch.randomizedtesting.rules.SystemPropertiesRestoreRule$1.evaluate(SystemPropertiesRestoreRule.java:53)
	at org.apache.lucene.util.AbstractBeforeAfterRule$1.evaluate(AbstractBeforeAfterRule.java:46)
	at org.apache.lucene.util.TestRuleStoreClassName$1.evaluate(TestRuleStoreClassName.java:42)
	at com.carrotsearch.randomizedtesting.rules.SystemPropertiesInvariantRule$1.evaluate(SystemPropertiesInvariantRule.java:55)
	at com.carrotsearch.randomizedtesting.rules.NoShadowingOrOverridesOnMethodsRule$1.evaluate(NoShadowingOrOverridesOnMethodsRule.java:39)
	at com.carrotsearch.randomizedtesting.rules.NoShadowingOrOverridesOnMethodsRule$1.evaluate(NoShadowingOrOverridesOnMethodsRule.java:39)
	at com.carrotsearch.randomizedtesting.rules.StatementAdapter.evaluate(StatementAdapter.java:36)
	at com.carrotsearch.randomizedtesting.rules.StatementAdapter.evaluate(StatementAdapter.java:36)
	at com.carrotsearch.randomizedtesting.rules.StatementAdapter.evaluate(StatementAdapter.java:36)
	at org.apache.lucene.util.TestRuleAssertionsRequired$1.evaluate(TestRuleAssertionsRequired.java:43)
	at org.apache.lucene.util.TestRuleMarkFailure$1.evaluate(TestRuleMarkFailure.java:48)
	at org.apache.lucene.util.TestRuleIgnoreAfterMaxFailures$1.evaluate(TestRuleIgnoreAfterMaxFailures.java:65)
	at org.apache.lucene.util.TestRuleIgnoreTestSuites$1.evaluate(TestRuleIgnoreTestSuites.java:55)
	at com.carrotsearch.randomizedtesting.rules.StatementAdapter.evaluate(StatementAdapter.java:36)
	at com.carrotsearch.randomizedtesting.ThreadLeakControl$StatementRunner.run(ThreadLeakControl.java:360)
	at java.lang.Thread.run(Thread.java:745)


REGRESSION:  org.apache.solr.core.TestNonNRTOpen.testReaderIsNotNRT

Error Message:
SOLR-5815? : wrong maxDoc: core=org.apache.solr.core.SolrCore@6ca5dad8 searcher=Searcher@1f954f51[collection1] main{StandardDirectoryReader(segments_8:16 _4(4.10):c1 _5(4.10):c1)} expected:<3> but was:<2>

Stack Trace:
java.lang.AssertionError: SOLR-5815? : wrong maxDoc: core=org.apache.solr.core.SolrCore@6ca5dad8 searcher=Searcher@1f954f51[collection1] main{StandardDirectoryReader(segments_8:16 _4(4.10):c1 _5(4.10):c1)} expected:<3> but was:<2>
	at __randomizedtesting.SeedInfo.seed([76ACA1B79F433096:C32AC03020828262]:0)
	at org.junit.Assert.fail(Assert.java:93)
	at org.junit.Assert.failNotEquals(Assert.java:647)
	at org.junit.Assert.assertEquals(Assert.java:128)
	at org.junit.Assert.assertEquals(Assert.java:472)
	at org.apache.solr.core.TestNonNRTOpen.assertNotNRT(TestNonNRTOpen.java:142)
	at org.apache.solr.core.TestNonNRTOpen.testReaderIsNotNRT(TestNonNRTOpen.java:100)
	at sun.reflect.NativeMethodAccessorImpl.invoke0(Native Method)
	at sun.reflect.NativeMethodAccessorImpl.invoke(NativeMethodAccessorImpl.java:57)
	at sun.reflect.DelegatingMethodAccessorImpl.invoke(DelegatingMethodAccessorImpl.java:43)
	at java.lang.reflect.Method.invoke(Method.java:606)
	at com.carrotsearch.randomizedtesting.RandomizedRunner.invoke(RandomizedRunner.java:1618)
	at com.carrotsearch.randomizedtesting.RandomizedRunner$6.evaluate(RandomizedRunner.java:827)
	at com.carrotsearch.randomizedtesting.RandomizedRunner$7.evaluate(RandomizedRunner.java:863)
	at com.carrotsearch.randomizedtesting.RandomizedRunner$8.evaluate(RandomizedRunner.java:877)
	at com.carrotsearch.randomizedtesting.rules.SystemPropertiesRestoreRule$1.evaluate(SystemPropertiesRestoreRule.java:53)
	at org.apache.lucene.util.TestRuleSetupTeardownChained$1.evaluate(TestRuleSetupTeardownChained.java:50)
	at org.apache.lucene.util.TestRuleFieldCacheSanity$1.evaluate(TestRuleFieldCacheSanity.java:51)
	at org.apache.lucene.util.AbstractBeforeAfterRule$1.evaluate(AbstractBeforeAfterRule.java:46)
	at com.carrotsearch.randomizedtesting.rules.SystemPropertiesInvariantRule$1.evaluate(SystemPropertiesInvariantRule.java:55)
	at org.apache.lucene.util.TestRuleThreadAndTestName$1.evaluate(TestRuleThreadAndTestName.java:49)
	at org.apache.lucene.util.TestRuleIgnoreAfterMaxFailures$1.evaluate(TestRuleIgnoreAfterMaxFailures.java:65)
	at org.apache.lucene.util.TestRuleMarkFailure$1.evaluate(TestRuleMarkFailure.java:48)
	at com.carrotsearch.randomizedtesting.rules.StatementAdapter.evaluate(StatementAdapter.java:36)
	at com.carrotsearch.randomizedtesting.ThreadLeakControl$StatementRunner.run(ThreadLeakControl.java:360)
	at com.carrotsearch.randomizedtesting.ThreadLeakControl.forkTimeoutingTask(ThreadLeakControl.java:793)
	at com.carrotsearch.randomizedtesting.ThreadLeakControl$3.evaluate(ThreadLeakControl.java:453)
	at com.carrotsearch.randomizedtesting.RandomizedRunner.runSingleTest(RandomizedRunner.java:836)
	at com.carrotsearch.randomizedtesting.RandomizedRunner$3.evaluate(RandomizedRunner.java:738)
	at com.carrotsearch.randomizedtesting.RandomizedRunner$4.evaluate(RandomizedRunner.java:772)
	at com.carrotsearch.randomizedtesting.RandomizedRunner$5.evaluate(RandomizedRunner.java:783)
	at com.carrotsearch.randomizedtesting.rules.StatementAdapter.evaluate(StatementAdapter.java:36)
	at com.carrotsearch.randomizedtesting.rules.SystemPropertiesRestoreRule$1.evaluate(SystemPropertiesRestoreRule.java:53)
	at org.apache.lucene.util.AbstractBeforeAfterRule$1.evaluate(AbstractBeforeAfterRule.java:46)
	at org.apache.lucene.util.TestRuleStoreClassName$1.evaluate(TestRuleStoreClassName.java:42)
	at com.carrotsearch.randomizedtesting.rules.SystemPropertiesInvariantRule$1.evaluate(SystemPropertiesInvariantRule.java:55)
	at com.carrotsearch.randomizedtesting.rules.NoShadowingOrOverridesOnMethodsRule$1.evaluate(NoShadowingOrOverridesOnMethodsRule.java:39)
	at com.carrotsearch.randomizedtesting.rules.NoShadowingOrOverridesOnMethodsRule$1.evaluate(NoShadowingOrOverridesOnMethodsRule.java:39)
	at com.carrotsearch.randomizedtesting.rules.StatementAdapter.evaluate(StatementAdapter.java:36)
	at com.carrotsearch.randomizedtesting.rules.StatementAdapter.evaluate(StatementAdapter.java:36)
	at com.carrotsearch.randomizedtesting.rules.StatementAdapter.evaluate(StatementAdapter.java:36)
	at org.apache.lucene.util.TestRuleAssertionsRequired$1.evaluate(TestRuleAssertionsRequired.java:43)
	at org.apache.lucene.util.TestRuleMarkFailure$1.evaluate(TestRuleMarkFailure.java:48)
	at org.apache.lucene.util.TestRuleIgnoreAfterMaxFailures$1.evaluate(TestRuleIgnoreAfterMaxFailures.java:65)
	at org.apache.lucene.util.TestRuleIgnoreTestSuites$1.evaluate(TestRuleIgnoreTestSuites.java:55)
	at com.carrotsearch.randomizedtesting.rules.StatementAdapter.evaluate(StatementAdapter.java:36)
	at com.carrotsearch.randomizedtesting.ThreadLeakControl$StatementRunner.run(ThreadLeakControl.java:360)
	at java.lang.Thread.run(Thread.java:745)




Build Log:
[...truncated 11139 lines...]
   [junit4] Suite: org.apache.solr.core.TestNonNRTOpen
   [junit4]   2> Creating dataDir: /Users/jenkins/workspace/Lucene-Solr-4.x-MacOSX/solr/build/solr-core/test/J0/./solr.core.TestNonNRTOpen-76ACA1B79F433096-001/init-core-data-001
   [junit4]   2> 1017784 T3275 oas.SolrTestCaseJ4.buildSSLConfig Randomized ssl (false) and clientAuth (false)
   [junit4]   2> 1017785 T3275 oas.SolrTestCaseJ4.initCore ####initCore
   [junit4]   2> 1017785 T3275 oasc.SolrResourceLoader.<init> new SolrResourceLoader for directory: '/Users/jenkins/workspace/Lucene-Solr-4.x-MacOSX/solr/core/src/test-files/solr/collection1/'
   [junit4]   2> 1017786 T3275 oasc.SolrResourceLoader.replaceClassLoader Adding 'file:/Users/jenkins/workspace/Lucene-Solr-4.x-MacOSX/solr/core/src/test-files/solr/collection1/lib/.svn/' to classloader
   [junit4]   2> 1017787 T3275 oasc.SolrResourceLoader.replaceClassLoader Adding 'file:/Users/jenkins/workspace/Lucene-Solr-4.x-MacOSX/solr/core/src/test-files/solr/collection1/lib/classes/' to classloader
   [junit4]   2> 1017787 T3275 oasc.SolrResourceLoader.replaceClassLoader Adding 'file:/Users/jenkins/workspace/Lucene-Solr-4.x-MacOSX/solr/core/src/test-files/solr/collection1/lib/README' to classloader
   [junit4]   2> 1017884 T3275 oasc.SolrConfig.<init> Using Lucene MatchVersion: LUCENE_4_10
   [junit4]   2> 1017928 T3275 oasc.SolrConfig.<init> Loaded SolrConfig: solrconfig-basic.xml
   [junit4]   2> 1017930 T3275 oass.IndexSchema.readSchema Reading Solr Schema from schema-minimal.xml
   [junit4]   2> 1017936 T3275 oass.IndexSchema.readSchema [null] Schema name=minimal
   [junit4]   2> 1017950 T3275 oass.IndexSchema.readSchema WARN no uniqueKey specified in schema.
   [junit4]   2> 1017952 T3275 oasc.SolrResourceLoader.locateSolrHome JNDI not configured for solr (NoInitialContextEx)
   [junit4]   2> 1017952 T3275 oasc.SolrResourceLoader.locateSolrHome using system property solr.solr.home: /Users/jenkins/workspace/Lucene-Solr-4.x-MacOSX/solr/core/src/test-files/solr
   [junit4]   2> 1017952 T3275 oasc.SolrResourceLoader.<init> new SolrResourceLoader for directory: '/Users/jenkins/workspace/Lucene-Solr-4.x-MacOSX/solr/core/src/test-files/solr/'
   [junit4]   2> 1018028 T3275 oasc.CoreContainer.<init> New CoreContainer 1472683378
   [junit4]   2> 1018029 T3275 oasc.CoreContainer.load Loading cores into CoreContainer [instanceDir=/Users/jenkins/workspace/Lucene-Solr-4.x-MacOSX/solr/core/src/test-files/solr/]
   [junit4]   2> 1018030 T3275 oashc.HttpShardHandlerFactory.getParameter Setting socketTimeout to: 0
   [junit4]   2> 1018030 T3275 oashc.HttpShardHandlerFactory.getParameter Setting urlScheme to: null
   [junit4]   2> 1018030 T3275 oashc.HttpShardHandlerFactory.getParameter Setting connTimeout to: 0
   [junit4]   2> 1018031 T3275 oashc.HttpShardHandlerFactory.getParameter Setting maxConnectionsPerHost to: 20
   [junit4]   2> 1018031 T3275 oashc.HttpShardHandlerFactory.getParameter Setting corePoolSize to: 0
   [junit4]   2> 1018031 T3275 oashc.HttpShardHandlerFactory.getParameter Setting maximumPoolSize to: 2147483647
   [junit4]   2> 1018031 T3275 oashc.HttpShardHandlerFactory.getParameter Setting maxThreadIdleTime to: 5
   [junit4]   2> 1018031 T3275 oashc.HttpShardHandlerFactory.getParameter Setting sizeOfQueue to: -1
   [junit4]   2> 1018032 T3275 oashc.HttpShardHandlerFactory.getParameter Setting fairnessPolicy to: false
   [junit4]   2> 1018032 T3275 oasl.LogWatcher.createWatcher SLF4J impl is org.slf4j.impl.Log4jLoggerFactory
   [junit4]   2> 1018033 T3275 oasl.LogWatcher.newRegisteredLogWatcher Registering Log Listener [Log4j (org.slf4j.impl.Log4jLoggerFactory)]
   [junit4]   2> 1018034 T3275 oasc.CoreContainer.load Host Name: 
   [junit4]   2> 1018038 T3276 oasc.SolrResourceLoader.<init> new SolrResourceLoader for directory: '/Users/jenkins/workspace/Lucene-Solr-4.x-MacOSX/solr/core/src/test-files/solr/collection1/'
   [junit4]   2> 1018038 T3276 oasc.SolrResourceLoader.replaceClassLoader Adding 'file:/Users/jenkins/workspace/Lucene-Solr-4.x-MacOSX/solr/core/src/test-files/solr/collection1/lib/.svn/' to classloader
   [junit4]   2> 1018039 T3276 oasc.SolrResourceLoader.replaceClassLoader Adding 'file:/Users/jenkins/workspace/Lucene-Solr-4.x-MacOSX/solr/core/src/test-files/solr/collection1/lib/classes/' to classloader
   [junit4]   2> 1018039 T3276 oasc.SolrResourceLoader.replaceClassLoader Adding 'file:/Users/jenkins/workspace/Lucene-Solr-4.x-MacOSX/solr/core/src/test-files/solr/collection1/lib/README' to classloader
   [junit4]   2> 1018097 T3276 oasc.SolrConfig.<init> Using Lucene MatchVersion: LUCENE_4_10
   [junit4]   2> 1018154 T3276 oasc.SolrConfig.<init> Loaded SolrConfig: solrconfig-basic.xml
   [junit4]   2> 1018156 T3276 oass.IndexSchema.readSchema Reading Solr Schema from schema-minimal.xml
   [junit4]   2> 1018164 T3276 oass.IndexSchema.readSchema [collection1] Schema name=minimal
   [junit4]   2> 1018174 T3276 oass.IndexSchema.readSchema WARN no uniqueKey specified in schema.
   [junit4]   2> 1018175 T3276 oasc.CoreContainer.create Creating SolrCore 'collection1' using configuration from instancedir /Users/jenkins/workspace/Lucene-Solr-4.x-MacOSX/solr/core/src/test-files/solr/collection1/
   [junit4]   2> 1018176 T3276 oasc.SolrCore.initDirectoryFactory solr.StandardDirectoryFactory
   [junit4]   2> 1018176 T3276 oasc.SolrCore.<init> [collection1] Opening new SolrCore at /Users/jenkins/workspace/Lucene-Solr-4.x-MacOSX/solr/core/src/test-files/solr/collection1/, dataDir=/Users/jenkins/workspace/Lucene-Solr-4.x-MacOSX/solr/build/solr-core/test/J0/./solr.core.TestNonNRTOpen-76ACA1B79F433096-001/init-core-data-001/
   [junit4]   2> 1018176 T3276 oasc.SolrCore.<init> JMX monitoring not detected for core: collection1
   [junit4]   2> 1018177 T3276 oasc.CachingDirectoryFactory.get return new directory for /Users/jenkins/workspace/Lucene-Solr-4.x-MacOSX/solr/build/solr-core/test/J0/solr.core.TestNonNRTOpen-76ACA1B79F433096-001/init-core-data-001
   [junit4]   2> 1018177 T3276 oasc.SolrCore.getNewIndexDir New index directory detected: old=null new=/Users/jenkins/workspace/Lucene-Solr-4.x-MacOSX/solr/build/solr-core/test/J0/./solr.core.TestNonNRTOpen-76ACA1B79F433096-001/init-core-data-001/index/
   [junit4]   2> 1018178 T3276 oasc.SolrCore.initIndex WARN [collection1] Solr index directory '/Users/jenkins/workspace/Lucene-Solr-4.x-MacOSX/solr/build/solr-core/test/J0/./solr.core.TestNonNRTOpen-76ACA1B79F433096-001/init-core-data-001/index' doesn't exist. Creating new index...
   [junit4]   2> 1018178 T3276 oasc.CachingDirectoryFactory.get return new directory for /Users/jenkins/workspace/Lucene-Solr-4.x-MacOSX/solr/build/solr-core/test/J0/solr.core.TestNonNRTOpen-76ACA1B79F433096-001/init-core-data-001/index
   [junit4]   2> 1018182 T3276 oasc.SolrDeletionPolicy.onCommit SolrDeletionPolicy.onCommit: commits: num=1
   [junit4]   2> 		commit{dir=/Users/jenkins/workspace/Lucene-Solr-4.x-MacOSX/solr/build/solr-core/test/J0/solr.core.TestNonNRTOpen-76ACA1B79F433096-001/init-core-data-001/index,segFN=segments_1,generation=1}
   [junit4]   2> 1018182 T3276 oasc.SolrDeletionPolicy.updateCommits newest commit generation = 1
   [junit4]   2> 1018184 T3276 oasc.SolrCore.loadUpdateProcessorChains no updateRequestProcessorChain defined as default, creating implicit default
   [junit4]   2> 1018184 T3276 oasc.RequestHandlers.initHandlersFromConfig created standard: solr.StandardRequestHandler
   [junit4]   2> 1018185 T3276 oasc.RequestHandlers.initHandlersFromConfig created /update: solr.UpdateRequestHandler
   [junit4]   2> 1018199 T3276 oashl.XMLLoader.init xsltCacheLifetimeSeconds=60
   [junit4]   2> 1018202 T3276 oasu.CommitTracker.<init> Hard AutoCommit: disabled
   [junit4]   2> 1018202 T3276 oasu.CommitTracker.<init> Soft AutoCommit: disabled
   [junit4]   2> 1018204 T3276 oass.SolrIndexSearcher.<init> Opening Searcher@28626316[collection1] main
   [junit4]   2> 1018205 T3276 oasr.ManagedResourceStorage$FileStorageIO.configure File-based storage initialized to use dir: /Users/jenkins/workspace/Lucene-Solr-4.x-MacOSX/solr/core/src/test-files/solr/collection1/conf
   [junit4]   2> 1018206 T3276 oasr.RestManager.init Initializing RestManager with initArgs: {storageDir=/Users/jenkins/workspace/Lucene-Solr-4.x-MacOSX/solr/core/src/test-files/solr/collection1/conf/}
   [junit4]   2> 1018206 T3276 oasr.ManagedResourceStorage.load Reading _rest_managed.json using file:dir=/Users/jenkins/workspace/Lucene-Solr-4.x-MacOSX/solr/core/src/test-files/solr/collection1/conf
   [junit4]   2> 1018207 T3276 oasr.ManagedResource.reloadFromStorage WARN No stored data found for /rest/managed
   [junit4]   2> 1018207 T3276 oasr.ManagedResource.notifyObserversDuringInit WARN No registered observers for /rest/managed
   [junit4]   2> 1018208 T3276 oasr.RestManager.init Initializing 0 registered ManagedResources
   [junit4]   2> 1018208 T3276 oasc.CoreContainer.registerCore registering core: collection1
   [junit4]   2> 1018209 T3277 oasc.SolrCore.registerSearcher [collection1] Registered new searcher Searcher@28626316[collection1] main{StandardDirectoryReader(segments_1:1)}
   [junit4]   2> 1018213 T3275 oas.SolrTestCaseJ4.initCore ####initCore end
   [junit4]   2> ASYNC  NEW_CORE C3678 name=collection1 org.apache.solr.core.SolrCore@29327393
   [junit4]   2> 1018216 T3275 C3678 oasc.SolrDeletionPolicy.onInit SolrDeletionPolicy.onInit: commits: num=1
   [junit4]   2> 		commit{dir=/Users/jenkins/workspace/Lucene-Solr-4.x-MacOSX/solr/build/solr-core/test/J0/solr.core.TestNonNRTOpen-76ACA1B79F433096-001/init-core-data-001/index,segFN=segments_1,generation=1}
   [junit4]   2> 1018217 T3275 C3678 oasc.SolrDeletionPolicy.updateCommits newest commit generation = 1
   [junit4]   2> 1018219 T3275 C3678 oasup.LogUpdateProcessor.finish [collection1] webapp=null path=null params={} {add=[(null)]} 0 6
   [junit4]   2> 1018224 T3275 C3678 oasu.DirectUpdateHandler2.commit start commit{,optimize=false,openSearcher=true,waitSearcher=true,expungeDeletes=false,softCommit=false,prepareCommit=false}
   [junit4]   2> 1018254 T3275 C3678 oasc.SolrDeletionPolicy.onCommit SolrDeletionPolicy.onCommit: commits: num=2
   [junit4]   2> 		commit{dir=/Users/jenkins/workspace/Lucene-Solr-4.x-MacOSX/solr/build/solr-core/test/J0/solr.core.TestNonNRTOpen-76ACA1B79F433096-001/init-core-data-001/index,segFN=segments_1,generation=1}
   [junit4]   2> 		commit{dir=/Users/jenkins/workspace/Lucene-Solr-4.x-MacOSX/solr/build/solr-core/test/J0/solr.core.TestNonNRTOpen-76ACA1B79F433096-001/init-core-data-001/index,segFN=segments_2,generation=2}
   [junit4]   2> 1018255 T3275 C3678 oasc.SolrDeletionPolicy.updateCommits newest commit generation = 2
   [junit4]   2> 1018265 T3275 C3678 oass.SolrIndexSearcher.<init> Opening Searcher@10cf61bd[collection1] main
   [junit4]   2> 1018266 T3275 C3678 oasu.DirectUpdateHandler2.commit end_commit_flush
   [junit4]   2> 1018266 T3277 oasc.SolrCore.registerSearcher [collection1] Registered new searcher Searcher@10cf61bd[collection1] main{StandardDirectoryReader(segments_2:3 _0(4.10):c1)}
   [junit4]   2> 1018268 T3275 C3678 oasup.LogUpdateProcessor.finish [collection1] webapp=null path=null params={} {commit=} 0 45
   [junit4]   2> 1018274 T3275 oas.SolrTestCaseJ4.deleteCore ###deleteCore
   [junit4]   2> 1018274 T3275 oasc.CoreContainer.shutdown Shutting down CoreContainer instance=1472683378
   [junit4]   2> 1018275 T3275 oasc.SolrCore.close [collection1]  CLOSING SolrCore org.apache.solr.core.SolrCore@29327393
   [junit4]   2> 1018275 T3275 oasu.DirectUpdateHandler2.close closing DirectUpdateHandler2{commits=1,autocommits=0,soft autocommits=0,optimizes=0,rollbacks=0,expungeDeletes=0,docsPending=0,adds=0,deletesById=0,deletesByQuery=0,errors=0,cumulative_adds=1,cumulative_deletesById=0,cumulative_deletesByQuery=0,cumulative_errors=0}
   [junit4]   2> 1018276 T3275 oasu.SolrCoreState.decrefSolrCoreState Closing SolrCoreState
   [junit4]   2> 1018276 T3275 oasu.DefaultSolrCoreState.closeIndexWriter SolrCoreState ref count has reached 0 - closing IndexWriter
   [junit4]   2> 1018277 T3275 oasu.DefaultSolrCoreState.closeIndexWriter closing IndexWriter with IndexWriterCloser
   [junit4]   2> 1018278 T3275 oasc.SolrCore.closeSearcher [collection1] Closing main searcher on request.
   [junit4]   2> 1018279 T3275 oasc.CachingDirectoryFactory.close Closing StandardDirectoryFactory - 2 directories currently being tracked
   [junit4]   2> 1018279 T3275 oasc.CachingDirectoryFactory.closeCacheValue looking to close /Users/jenkins/workspace/Lucene-Solr-4.x-MacOSX/solr/build/solr-core/test/J0/solr.core.TestNonNRTOpen-76ACA1B79F433096-001/init-core-data-001/index [CachedDir<<refCount=0;path=/Users/jenkins/workspace/Lucene-Solr-4.x-MacOSX/solr/build/solr-core/test/J0/solr.core.TestNonNRTOpen-76ACA1B79F433096-001/init-core-data-001/index;done=false>>]
   [junit4]   2> 1018280 T3275 oasc.CachingDirectoryFactory.close Closing directory: /Users/jenkins/workspace/Lucene-Solr-4.x-MacOSX/solr/build/solr-core/test/J0/solr.core.TestNonNRTOpen-76ACA1B79F433096-001/init-core-data-001/index
   [junit4]   2> 1018280 T3275 oasc.CachingDirectoryFactory.closeCacheValue looking to close /Users/jenkins/workspace/Lucene-Solr-4.x-MacOSX/solr/build/solr-core/test/J0/solr.core.TestNonNRTOpen-76ACA1B79F433096-001/init-core-data-001 [CachedDir<<refCount=0;path=/Users/jenkins/workspace/Lucene-Solr-4.x-MacOSX/solr/build/solr-core/test/J0/solr.core.TestNonNRTOpen-76ACA1B79F433096-001/init-core-data-001;done=false>>]
   [junit4]   2> 1018280 T3275 oasc.CachingDirectoryFactory.close Closing directory: /Users/jenkins/workspace/Lucene-Solr-4.x-MacOSX/solr/build/solr-core/test/J0/solr.core.TestNonNRTOpen-76ACA1B79F433096-001/init-core-data-001
   [junit4]   2> 1018282 T3275 oas.SolrTestCaseJ4.initCore ####initCore
   [junit4]   2> 1018283 T3275 oasc.SolrResourceLoader.<init> new SolrResourceLoader for directory: '/Users/jenkins/workspace/Lucene-Solr-4.x-MacOSX/solr/core/src/test-files/solr/collection1/'
   [junit4]   2> 1018286 T3275 oasc.SolrResourceLoader.replaceClassLoader Adding 'file:/Users/jenkins/workspace/Lucene-Solr-4.x-MacOSX/solr/core/src/test-files/solr/collection1/lib/.svn/' to classloader
   [junit4]   2> 1018287 T3275 oasc.SolrResourceLoader.replaceClassLoader Adding 'file:/Users/jenkins/workspace/Lucene-Solr-4.x-MacOSX/solr/core/src/test-files/solr/collection1/lib/classes/' to classloader
   [junit4]   2> 1018290 T3275 oasc.SolrResourceLoader.replaceClassLoader Adding 'file:/Users/jenkins/workspace/Lucene-Solr-4.x-MacOSX/solr/core/src/test-files/solr/collection1/lib/README' to classloader
   [junit4]   2> 1018395 T3275 oasc.SolrConfig.<init> Using Lucene MatchVersion: LUCENE_4_10
   [junit4]   2> 1018449 T3275 oasc.SolrConfig.<init> Loaded SolrConfig: solrconfig-basic.xml
   [junit4]   2> 1018450 T3275 oass.IndexSchema.readSchema Reading Solr Schema from schema-minimal.xml
   [junit4]   2> 1018458 T3275 oass.IndexSchema.readSchema [null] Schema name=minimal
   [junit4]   2> 1018474 T3275 oass.IndexSchema.readSchema WARN no uniqueKey specified in schema.
   [junit4]   2> 1018483 T3275 oasc.SolrResourceLoader.locateSolrHome JNDI not configured for solr (NoInitialContextEx)
   [junit4]   2> 1018483 T3275 oasc.SolrResourceLoader.locateSolrHome using system property solr.solr.home: /Users/jenkins/workspace/Lucene-Solr-4.x-MacOSX/solr/core/src/test-files/solr
   [junit4]   2> 1018484 T3275 oasc.SolrResourceLoader.<init> new SolrResourceLoader for directory: '/Users/jenkins/workspace/Lucene-Solr-4.x-MacOSX/solr/core/src/test-files/solr/'
   [junit4]   2> 1018550 T3275 oasc.CoreContainer.<init> New CoreContainer 267304412
   [junit4]   2> 1018550 T3275 oasc.CoreContainer.load Loading cores into CoreContainer [instanceDir=/Users/jenkins/workspace/Lucene-Solr-4.x-MacOSX/solr/core/src/test-files/solr/]
   [junit4]   2> 1018552 T3275 oashc.HttpShardHandlerFactory.getParameter Setting socketTimeout to: 0
   [junit4]   2> 1018552 T3275 oashc.HttpShardHandlerFactory.getParameter Setting urlScheme to: null
   [junit4]   2> 1018553 T3275 oashc.HttpShardHandlerFactory.getParameter Setting connTimeout to: 0
   [junit4]   2> 1018553 T3275 oashc.HttpShardHandlerFactory.getParameter Setting maxConnectionsPerHost to: 20
   [junit4]   2> 1018553 T3275 oashc.HttpShardHandlerFactory.getParameter Setting corePoolSize to: 0
   [junit4]   2> 1018553 T3275 oashc.HttpShardHandlerFactory.getParameter Setting maximumPoolSize to: 2147483647
   [junit4]   2> 1018554 T3275 oashc.HttpShardHandlerFactory.getParameter Setting maxThreadIdleTime to: 5
   [junit4]   2> 1018554 T3275 oashc.HttpShardHandlerFactory.getParameter Setting sizeOfQueue to: -1
   [junit4]   2> 1018554 T3275 oashc.HttpShardHandlerFactory.getParameter Setting fairnessPolicy to: false
   [junit4]   2> 1018555 T3275 oasl.LogWatcher.createWatcher SLF4J impl is org.slf4j.impl.Log4jLoggerFactory
   [junit4]   2> 1018555 T3275 oasl.LogWatcher.newRegisteredLogWatcher Registering Log Listener [Log4j (org.slf4j.impl.Log4jLoggerFactory)]
   [junit4]   2> 1018555 T3275 oasc.CoreContainer.load Host Name: 
   [junit4]   2> 1018560 T3279 oasc.SolrResourceLoader.<init> new SolrResourceLoader for directory: '/Users/jenkins/workspace/Lucene-Solr-4.x-MacOSX/solr/core/src/test-files/solr/collection1/'
   [junit4]   2> 1018561 T3279 oasc.SolrResourceLoader.replaceClassLoader Adding 'file:/Users/jenkins/workspace/Lucene-Solr-4.x-MacOSX/solr/core/src/test-files/solr/collection1/lib/.svn/' to classloader
   [junit4]   2> 1018561 T3279 oasc.SolrResourceLoader.replaceClassLoader Adding 'file:/Users/jenkins/workspace/Lucene-Solr-4.x-MacOSX/solr/core/src/test-files/solr/collection1/lib/classes/' to classloader
   [junit4]   2> 1018562 T3279 oasc.SolrResourceLoader.replaceClassLoader Adding 'file:/Users/jenkins/workspace/Lucene-Solr-4.x-MacOSX/solr/core/src/test-files/solr/collection1/lib/README' to classloader
   [junit4]   2> 1018622 T3279 oasc.SolrConfig.<init> Using Lucene MatchVersion: LUCENE_4_10
   [junit4]   2> 1018672 T3279 oasc.SolrConfig.<init> Loaded SolrConfig: solrconfig-basic.xml
   [junit4]   2> 1018673 T3279 oass.IndexSchema.readSchema Reading Solr Schema from schema-minimal.xml
   [junit4]   2> 1018682 T3279 oass.IndexSchema.readSchema [collection1] Schema name=minimal
   [junit4]   2> 1018717 T3279 oass.IndexSchema.readSchema WARN no uniqueKey specified in schema.
   [junit4]   2> 1018721 T3279 oasc.CoreContainer.create Creating SolrCore 'collection1' using configuration from instancedir /Users/jenkins/workspace/Lucene-Solr-4.x-MacOSX/solr/core/src/test-files/solr/collection1/
   [junit4]   2> 1018723 T3279 oasc.SolrCore.initDirectoryFactory solr.StandardDirectoryFactory
   [junit4]   2> 1018724 T3279 oasc.SolrCore.<init> [collection1] Opening new SolrCore at /Users/jenkins/workspace/Lucene-Solr-4.x-MacOSX/solr/core/src/test-files/solr/collection1/, dataDir=/Users/jenkins/workspace/Lucene-Solr-4.x-MacOSX/solr/build/solr-core/test/J0/./solr.core.TestNonNRTOpen-76ACA1B79F433096-001/init-core-data-001/
   [junit4]   2> 1018724 T3279 oasc.SolrCore.<init> JMX monitoring not detected for core: collection1
   [junit4]   2> 1018727 T3279 oasc.CachingDirectoryFactory.get return new directory for /Users/jenkins/workspace/Lucene-Solr-4.x-MacOSX/solr/build/solr-core/test/J0/solr.core.TestNonNRTOpen-76ACA1B79F433096-001/init-core-data-001
   [junit4]   2> 1018731 T3279 oasc.SolrCore.getNewIndexDir New index directory detected: old=null new=/Users/jenkins/workspace/Lucene-Solr-4.x-MacOSX/solr/build/solr-core/test/J0/./solr.core.TestNonNRTOpen-76ACA1B79F433096-001/init-core-data-001/index/
   [junit4]   2> 1018732 T3279 oasc.SolrCore.loadUpdateProcessorChains no updateRequestProcessorChain defined as default, creating implicit default
   [junit4]   2> 1018733 T3279 oasc.RequestHandlers.initHandlersFromConfig created standard: solr.StandardRequestHandler
   [junit4]   2> 1018733 T3279 oasc.RequestHandlers.initHandlersFromConfig created /update: solr.UpdateRequestHandler
   [junit4]   2> 1018748 T3279 oashl.XMLLoader.init xsltCacheLifetimeSeconds=60
   [junit4]   2> 1018750 T3279 oasu.CommitTracker.<init> Hard AutoCommit: disabled
   [junit4]   2> 1018751 T3279 oasu.CommitTracker.<init> Soft AutoCommit: disabled
   [junit4]   2> 1018752 T3279 oasc.CachingDirectoryFactory.get return new directory for /Users/jenkins/workspace/Lucene-Solr-4.x-MacOSX/solr/build/solr-core/test/J0/solr.core.TestNonNRTOpen-76ACA1B79F433096-001/init-core-data-001/index
   [junit4]   2> 1018755 T3279 oass.SolrIndexSearcher.<init> Opening Searcher@5c2c5123[collection1] main
   [junit4]   2> 1018755 T3279 oasr.ManagedResourceStorage$FileStorageIO.configure File-based storage initialized to use dir: /Users/jenkins/workspace/Lucene-Solr-4.x-MacOSX/solr/core/src/test-files/solr/collection1/conf
   [junit4]   2> 1018755 T3279 oasr.RestManager.init Initializing RestManager with initArgs: {storageDir=/Users/jenkins/workspace/Lucene-Solr-4.x-MacOSX/solr/core/src/test-files/solr/collection1/conf/}
   [junit4]   2> 1018755 T3279 oasr.ManagedResourceStorage.load Reading _rest_managed.json using file:dir=/Users/jenkins/workspace/Lucene-Solr-4.x-MacOSX/solr/core/src/test-files/solr/collection1/conf
   [junit4]   2> 1018756 T3279 oasr.ManagedResource.reloadFromStorage WARN No stored data found for /rest/managed
   [junit4]   2> 1018757 T3279 oasr.ManagedResource.notifyObserversDuringInit WARN No registered observers for /rest/managed
   [junit4]   2> 1018757 T3279 oasr.RestManager.init Initializing 0 registered ManagedResources
   [junit4]   2> 1018758 T3279 oasc.CoreContainer.registerCore registering core: collection1
   [junit4]   2> 1018758 T3280 oasc.SolrCore.registerSearcher [collection1] Registered new searcher Searcher@5c2c5123[collection1] main{StandardDirectoryReader(segments_2:3 _0(4.10):c1)}
   [junit4]   2> 1018761 T3275 oas.SolrTestCaseJ4.initCore ####initCore end
   [junit4]   2> 1018762 T3275 oasc.TestNonNRTOpen.assertNotNRT Checking notNRT & maxDoc=1 of core=org.apache.solr.core.SolrCore@17b470b9
   [junit4]   2> 1018770 T3275 oas.SolrTestCaseJ4.setUp ###Starting testSharedCores
   [junit4]   2> ASYNC  NEW_CORE C3679 name=collection1 org.apache.solr.core.SolrCore@17b470b9
   [junit4]   2> 1018770 T3275 C3679 oasu.DirectUpdateHandler2.deleteAll [collection1] REMOVING ALL DOCUMENTS FROM INDEX
   [junit4]   2> 1018777 T3275 C3679 oasc.SolrDeletionPolicy.onInit SolrDeletionPolicy.onInit: commits: num=1
   [junit4]   2> 		commit{dir=/Users/jenkins/workspace/Lucene-Solr-4.x-MacOSX/solr/build/solr-core/test/J0/solr.core.TestNonNRTOpen-76ACA1B79F433096-001/init-core-data-001/index,segFN=segments_2,generation=2}
   [junit4]   2> 1018777 T3275 C3679 oasc.SolrDeletionPolicy.updateCommits newest commit generation = 2
   [junit4]   2> 1018777 T3275 C3679 oasup.LogUpdateProcessor.finish [collection1] webapp=null path=null params={} {deleteByQuery=*:*} 0 7
   [junit4]   2> 1018781 T3275 C3679 oasup.LogUpdateProcessor.finish [collection1] webapp=null path=null params={} {add=[(null)]} 0 2
   [junit4]   2> 1018782 T3275 C3679 oasu.DirectUpdateHandler2.commit start commit{,optimize=false,openSearcher=true,waitSearcher=true,expungeDeletes=false,softCommit=false,prepareCommit=false}
   [junit4]   2> 1018809 T3275 C3679 oasc.SolrDeletionPolicy.onCommit SolrDeletionPolicy.onCommit: commits: num=2
   [junit4]   2> 		commit{dir=/Users/jenkins/workspace/Lucene-Solr-4.x-MacOSX/solr/build/solr-core/test/J0/solr.core.TestNonNRTOpen-76ACA1B79F433096-001/init-core-data-001/index,segFN=segments_2,generation=2}
   [junit4]   2> 		commit{dir=/Users/jenkins/workspace/Lucene-Solr-4.x-MacOSX/solr/build/solr-core/test/J0/solr.core.TestNonNRTOpen-76ACA1B79F433096-001/init-core-data-001/index,segFN=segments_3,generation=3}
   [junit4]   2> 1018810 T3275 C3679 oasc.SolrDeletionPolicy.updateCommits newest commit generation = 3
   [junit4]   2> 1018822 T3275 C3679 oass.SolrIndexSearcher.<init> Opening Searcher@48ec4ee6[collection1] main
   [junit4]   2> 1018823 T3275 C3679 oasu.DirectUpdateHandler2.commit end_commit_flush
   [junit4]   2> 1018823 T3280 oasc.SolrCore.registerSearcher [collection1] Registered new searcher Searcher@48ec4ee6[collection1] main{StandardDirectoryReader(segments_3:6 _1(4.10):c1)}
   [junit4]   2> 1018827 T3275 C3679 oasup.LogUpdateProcessor.finish [collection1] webapp=null path=null params={} {commit=} 0 45
   [junit4]   2> 1018832 T3275 C3679 oasu.DirectUpdateHandler2.commit start commit{,optimize=true,openSearcher=true,waitSearcher=true,expungeDeletes=false,softCommit=false,prepareCommit=false}
   [junit4]   2> 1018832 T3275 C3679 oasu.DirectUpdateHandler2.commit No uncommitted changes. Skipping IW.commit.
   [junit4]   2> 1018834 T3275 C3679 oasc.SolrCore.openNewSearcher SolrIndexSearcher has not changed - not re-opening: org.apache.solr.search.SolrIndexSearcher
   [junit4]   2> 1018834 T3275 C3679 oasu.DirectUpdateHandler2.commit end_commit_flush
   [junit4]   2> 1018836 T3275 C3679 oasup.LogUpdateProcessor.finish [collection1] webapp=null path=null params={} {optimize=} 0 4
   [junit4]   2> 1018839 T3275 C3679 oasup.LogUpdateProcessor.finish [collection1] webapp=null path=null params={} {add=[(null)]} 0 2
   [junit4]   2> 1018841 T3275 C3679 oasu.DirectUpdateHandler2.commit start commit{,optimize=false,openSearcher=true,waitSearcher=true,expungeDeletes=false,softCommit=false,prepareCommit=false}
   [junit4]   2> 1018866 T3275 C3679 oasc.SolrDeletionPolicy.onCommit SolrDeletionPolicy.onCommit: commits: num=2
   [junit4]   2> 		commit{dir=/Users/jenkins/workspace/Lucene-Solr-4.x-MacOSX/solr/build/solr-core/test/J0/solr.core.TestNonNRTOpen-76ACA1B79F433096-001/init-core-data-001/index,segFN=segments_3,generation=3}
   [junit4]   2> 		commit{dir=/Users/jenkins/workspace/Lucene-Solr-4.x-MacOSX/solr/build/solr-core/test/J0/solr.core.TestNonNRTOpen-76ACA1B79F433096-001/init-core-data-001/index,segFN=segments_4,generation=4}
   [junit4]   2> 1018867 T3275 C3679 oasc.SolrDeletionPolicy.updateCommits newest commit generation = 4
   [junit4]   2> 1018879 T3275 C3679 oass.SolrIndexSearcher.<init> Opening Searcher@3da1e8d0[collection1] main
   [junit4]   2> 1018880 T3275 C3679 oasu.DirectUpdateHandler2.commit end_commit_flush
   [junit4]   2> 1018880 T3280 oasc.SolrCore.registerSearcher [collection1] Registered new searcher Searcher@3da1e8d0[collection1] main{StandardDirectoryReader(segments_4:8 _1(4.10):c1 _2(4.10):c1)}
   [junit4]   2> 1018881 T3275 C3679 oasup.LogUpdateProcessor.finish [collection1] webapp=null path=null params={} {commit=} 0 40
   [junit4]   2> 1018888 T3275 C3679 oasup.LogUpdateProcessor.finish [collection1] webapp=null path=null params={} {add=[(null)]} 0 1
   [junit4]   2> 1018892 T3275 C3679 oasup.LogUpdateProcessor.finish [collection1] webapp=null path=null params={} {add=[(null)]} 0 0
   [junit4]   2> 1018893 T3275 C3679 oasu.DirectUpdateHandler2.commit start commit{,optimize=false,openSearcher=true,waitSearcher=true,expungeDeletes=false,softCommit=false,prepareCommit=false}
   [junit4]   2> 1018928 T3275 C3679 oasc.SolrDeletionPolicy.onCommit SolrDeletionPolicy.onCommit: commits: num=2
   [junit4]   2> 		commit{dir=/Users/jenkins/workspace/Lucene-Solr-4.x-MacOSX/solr/build/solr-core/test/J0/solr.core.TestNonNRTOpen-76ACA1B79F433096-001/init-core-data-001/index,segFN=segments_4,generation=4}
   [junit4]   2> 		commit{dir=/Users/jenkins/workspace/Lucene-Solr-4.x-MacOSX/solr/build/solr-core/test/J0/solr.core.TestNonNRTOpen-76ACA1B79F433096-001/init-core-data-001/index,segFN=segments_5,generation=5}
   [junit4]   2> 1018929 T3275 C3679 oasc.SolrDeletionPolicy.updateCommits newest commit generation = 5
   [junit4]   2> 1018940 T3275 C3679 oass.SolrIndexSearcher.<init> Opening Searcher@c1b326f[collection1] main
   [junit4]   2> 1018940 T3275 C3679 oasu.DirectUpdateHandler2.commit end_commit_flush
   [junit4]   2> 1018941 T3280 oasc.SolrCore.registerSearcher [collection1] Registered new searcher Searcher@c1b326f[collection1] main{StandardDirectoryReader(segments_5:10 _1(4.10):c1 _2(4.10):c1 _3(4.10):c2)}
   [junit4]   2> 1018942 T3275 C3679 oasup.LogUpdateProcessor.finish [collection1] webapp=null path=null params={} {commit=} 0 49
   [junit4]   2> 1018946 T3275 C3679 oasup.LogUpdateProcessor.finish [collection1] webapp=null path=null params={} {deleteByQuery=foo2:doc} 0 0
   [junit4]   2> 1018948 T3275 C3679 oasu.DirectUpdateHandler2.commit start commit{,optimize=false,openSearcher=true,waitSearcher=true,expungeDeletes=false,softCommit=false,prepareCommit=false}
   [junit4]   2> 1018964 T3275 C3679 oasc.SolrDeletionPolicy.onCommit SolrDeletionPolicy.onCommit: commits: num=2
   [junit4]   2> 		commit{dir=/Users/jenkins/workspace/Lucene-Solr-4.x-MacOSX/solr/build/solr-core/test/J0/solr.core.TestNonNRTOpen-76ACA1B79F433096-001/init-core-data-001/index,segFN=segments_5,generation=5}
   [junit4]   2> 		commit{dir=/Users/jenkins/workspace/Lucene-Solr-4.x-MacOSX/solr/build/solr-core/test/J0/solr.core.TestNonNRTOpen-76ACA1B79F433096-001/init-core-data-001/index,segFN=segments_6,generation=6}
   [junit4]   2> 1018965 T3275 C3679 oasc.SolrDeletionPolicy.updateCommits newest commit generation = 6
   [junit4]   2> 1018977 T3275 C3679 oass.SolrIndexSearcher.<init> Opening Searcher@12349259[collection1] main
   [junit4]   2> 1018978 T3275 C3679 oasu.DirectUpdateHandler2.commit end_commit_flush
   [junit4]   2> 1018978 T3280 oasc.SolrCore.registerSearcher [collection1] Registered new searcher Searcher@12349259[collection1] main{StandardDirectoryReader(segments_6:11 _1(4.10):c1 _2(4.10):c1 _3(4.10):c2/1:delGen=1)}
   [junit4]   2> 1018979 T3275 C3679 oasup.LogUpdateProcessor.finish [collection1] webapp=null path=null params={} {commit=} 0 31
   [junit4]   2> 1018983 T3275 oas.SolrTestCaseJ4.tearDown ###Ending testSharedCores
   [junit4]   2> 1018990 T3275 oas.SolrTestCaseJ4.setUp ###Starting testReaderIsNotNRT
   [junit4]   2> 1018991 T3275 C3679 oasu.DirectUpdateHandler2.deleteAll [collection1] REMOVING ALL DOCUMENTS FROM INDEX
   [junit4]   2> 1018991 T3275 C3679 oasup.LogUpdateProcessor.finish [collection1] webapp=null path=null params={} {deleteByQuery=*:*} 0 0
   [junit4]   2> 1018994 T3275 C3679 oasup.LogUpdateProcessor.finish [collection1] webapp=null path=null params={} {add=[(null)]} 0 1
   [junit4]   2> 1018995 T3275 C3679 oasu.DirectUpdateHandler2.commit start commit{,optimize=false,openSearcher=true,waitSearcher=true,expungeDeletes=false,softCommit=false,prepareCommit=false}
   [junit4]   2> 1019019 T3275 C3679 oasc.SolrDeletionPolicy.onCommit SolrDeletionPolicy.onCommit: commits: num=2
   [junit4]   2> 		commit{dir=/Users/jenkins/workspace/Lucene-Solr-4.x-MacOSX/solr/build/solr-core/test/J0/solr.core.TestNonNRTOpen-76ACA1B79F433096-001/init-core-data-001/index,segFN=segments_6,generation=6}
   [junit4]   2> 		commit{dir=/Users/jenkins/workspace/Lucene-Solr-4.x-MacOSX/solr/build/solr-core/test/J0/solr.core.TestNonNRTOpen-76ACA1B79F433096-001/init-core-data-001/index,segFN=segments_7,generation=7}
   [junit4]   2> 1019020 T3275 C3679 oasc.SolrDeletionPolicy.updateCommits newest commit generation = 7
   [junit4]   2> 1019035 T3275 C3679 oass.SolrIndexSearcher.<init> Opening Searcher@29c7cb92[collection1] main
   [junit4]   2> 1019035 T3275 C3679 oasu.DirectUpdateHandler2.commit end_commit_flush
   [junit4]   2> 1019036 T3280 oasc.SolrCore.registerSearcher [collection1] Registered new searcher Searcher@29c7cb92[collection1] main{StandardDirectoryReader(segments_7:14 _4(4.10):c1)}
   [junit4]   2> 1019037 T3275 C3679 oasup.LogUpdateProcessor.finish [collection1] webapp=null path=null params={} {commit=} 0 42
   [junit4]   2> 1019047 T3275 oasc.TestNonNRTOpen.assertNotNRT Checking notNRT & maxDoc=1 of core=org.apache.solr.core.SolrCore@17b470b9
   [junit4]   2> 1019048 T3275 oasc.TestNonNRTOpen.testReaderIsNotNRT Reloading core: org.apache.solr.core.SolrCore@17b470b9
   [junit4]   2> 1019048 T3275 oasc.SolrResourceLoader.<init> new SolrResourceLoader for directory: '/Users/jenkins/workspace/Lucene-Solr-4.x-MacOSX/solr/core/src/test-files/solr/collection1/'
   [junit4]   2> 1019049 T3275 oasc.SolrResourceLoader.replaceClassLoader Adding 'file:/Users/jenkins/workspace/Lucene-Solr-4.x-MacOSX/solr/core/src/test-files/solr/collection1/lib/.svn/' to classloader
   [junit4]   2> 1019050 T3275 oasc.SolrResourceLoader.replaceClassLoader Adding 'file:/Users/jenkins/workspace/Lucene-Solr-4.x-MacOSX/solr/core/src/test-files/solr/collection1/lib/classes/' to classloader
   [junit4]   2> 1019050 T3275 oasc.SolrResourceLoader.replaceClassLoader Adding 'file:/Users/jenkins/workspace/Lucene-Solr-4.x-MacOSX/solr/core/src/test-files/solr/collection1/lib/README' to classloader
   [junit4]   2> 1019147 T3275 oasc.SolrConfig.<init> Using Lucene MatchVersion: LUCENE_4_10
   [junit4]   2> 1019193 T3275 oasc.SolrConfig.<init> Loaded SolrConfig: solrconfig-basic.xml
   [junit4]   2> 1019193 T3275 oass.IndexSchema.readSchema Reading Solr Schema from schema-minimal.xml
   [junit4]   2> 1019201 T3275 oass.IndexSchema.readSchema [collection1] Schema name=minimal
   [junit4]   2> 1019211 T3275 oass.IndexSchema.readSchema WARN no uniqueKey specified in schema.
   [junit4]   2> 1019213 T3275 oasc.CoreContainer.reload Reloading SolrCore 'collection1' using configuration from instancedir /Users/jenkins/workspace/Lucene-Solr-4.x-MacOSX/solr/core/src/test-files/solr/collection1/
   [junit4]   2> 1019213 T3275 oasc.SolrCore.<init> [collection1] Opening new SolrCore at /Users/jenkins/workspace/Lucene-Solr-4.x-MacOSX/solr/core/src/test-files/solr/collection1/, dataDir=/Users/jenkins/workspace/Lucene-Solr-4.x-MacOSX/solr/build/solr-core/test/J0/./solr.core.TestNonNRTOpen-76ACA1B79F433096-001/init-core-data-001/
   [junit4]   2> 1019213 T3275 oasc.SolrCore.<init> JMX monitoring not detected for core: collection1
   [junit4]   2> 1019214 T3275 oasc.SolrCore.getNewIndexDir New index directory detected: old=null new=/Users/jenkins/workspace/Lucene-Solr-4.x-MacOSX/solr/build/solr-core/test/J0/./solr.core.TestNonNRTOpen-76ACA1B79F433096-001/init-core-data-001/index/
   [junit4]   2> 1019216 T3275 oasc.SolrCore.loadUpdateProcessorChains no updateRequestProcessorChain defined as default, creating implicit default
   [junit4]   2> 1019216 T3275 oasc.RequestHandlers.initHandlersFromConfig created standard: solr.StandardRequestHandler
   [junit4]   2> 1019217 T3275 oasc.RequestHandlers.initHandlersFromConfig created /update: solr.UpdateRequestHandler
   [junit4]   2> 1019231 T3275 oashl.XMLLoader.init xsltCacheLifetimeSeconds=60
   [junit4]   2> 1019234 T3275 oasu.CommitTracker.<init> Hard AutoCommit: disabled
   [junit4]   2> 1019235 T3275 oasu.CommitTracker.<init> Soft AutoCommit: disabled
   [junit4]   2> 1019240 T3275 oass.SolrIndexSearcher.<init> Opening Searcher@a44747e[collection1] main
   [junit4]   2> 1019241 T3275 oasr.ManagedResourceStorage$FileStorageIO.configure File-based storage initialized to use dir: /Users/jenkins/workspace/Lucene-Solr-4.x-MacOSX/solr/core/src/test-files/solr/collection1/conf
   [junit4]   2> 1019242 T3275 oasr.RestManager.init Initializing RestManager with initArgs: {storageDir=/Users/jenkins/workspace/Lucene-Solr-4.x-MacOSX/solr/core/src/test-files/solr/collection1/conf/}
   [junit4]   2> 1019244 T3275 oasr.ManagedResourceStorage.load Reading _rest_managed.json using file:dir=/Users/jenkins/workspace/Lucene-Solr-4.x-MacOSX/solr/core/src/test-files/solr/collection1/conf
   [junit4]   2> 1019246 T3275 oasr.ManagedResource.reloadFromStorage WARN No stored data found for /rest/managed
   [junit4]   2> 1019247 T3275 oasr.ManagedResource.notifyObserversDuringInit WARN No registered observers for /rest/managed
   [junit4]   2> 1019247 T3275 oasr.RestManager.init Initializing 0 registered ManagedResources
   [junit4]   2> 1019248 T3275 oasu.DefaultSolrCoreState.newIndexWriter Creating new IndexWriter...
   [junit4]   2> 1019248 T3275 oasu.DefaultSolrCoreState.newIndexWriter Waiting until IndexWriter is unused... core=collection1
   [junit4]   2> 1019249 T3275 oasu.DefaultSolrCoreState.closeIndexWriter Closing old IndexWriter... core=collection1
   [junit4]   2> 1019248 T3282 oasc.SolrCore.registerSearcher [collection1] Registered new searcher Searcher@a44747e[collection1] main{StandardDirectoryReader(segments_7:14 _4(4.10):c1)}
   [junit4]   2> 1019256 T3275 oasc.SolrDeletionPolicy.onInit SolrDeletionPolicy.onInit: commits: num=1
   [junit4]   2> 		commit{dir=/Users/jenkins/workspace/Lucene-Solr-4.x-MacOSX/solr/build/solr-core/test/J0/solr.core.TestNonNRTOpen-76ACA1B79F433096-001/init-core-data-001/index,segFN=segments_7,generation=7}
   [junit4]   2> 1019257 T3275 oasc.SolrDeletionPolicy.updateCommits newest commit generation = 7
   [junit4]   2> 1019257 T3275 oasu.DefaultSolrCoreState.newIndexWriter New IndexWriter is ready to be used.
   [junit4]   2> 1019260 T3275 oasc.SolrCore.openNewSearcher SolrIndexSearcher has not changed - not re-opening: org.apache.solr.search.SolrIndexSearcher
   [junit4]   2> 1019260 T3275 oasc.CoreContainer.registerCore replacing core: collection1
   [junit4]   2> 1019261 T3275 oasc.SolrCore.close [collection1]  CLOSING SolrCore org.apache.solr.core.SolrCore@17b470b9
   [junit4]   2> 1019261 T3275 oasu.DirectUpdateHandler2.close closing DirectUpdateHandler2{commits=5,autocommits=0,soft autocommits=0,optimizes=1,rollbacks=0,expungeDeletes=0,docsPending=0,adds=0,deletesById=0,deletesByQuery=0,errors=0,cumulative_adds=5,cumulative_deletesById=0,cumulative_deletesByQuery=3,cumulative_errors=0}
   [junit4]   2> 1019262 T3275 oasc.SolrCore.closeSearcher [collection1] Closing main searcher on request.
   [junit4]   2> 1019262 T3275 oasc.TestNonNRTOpen.assertNotNRT Checking notNRT & maxDoc=1 of core=org.apache.solr.core.SolrCore@7241d872
   [junit4]   2> ASYNC  NEW_CORE C3680 name=collection1 org.apache.solr.core.SolrCore@7241d872
   [junit4]   2> 1019264 T3275 C3680 oasup.LogUpdateProcessor.finish [collection1] webapp=null path=null params={} {add=[(null)]} 0 1
   [junit4]   2> 1019266 T3275 C3680 oasu.DirectUpdateHandler2.commit start commit{,optimize=false,openSearcher=true,waitSearcher=true,expungeDeletes=false,softCommit=false,prepareCommit=false}
   [junit4]   2> 1019292 T3275 C3680 oasc.SolrDeletionPolicy.onCommit SolrDeletionPolicy.onCommit: commits: num=2
   [junit4]   2> 		commit{dir=/Users/jenkins/workspace/Lucene-Solr-4.x-MacOSX/solr/build/solr-core/test/J0/solr.core.TestNonNRTOpen-76ACA1B79F433096-001/init-core-data-001/index,segFN=segments_7,generation=7}
   [junit4]   2> 		commit{dir=/Users/jenkins/workspace/Lucene-Solr-4.x-MacOSX/solr/build/solr-core/test/J0/solr.core.TestNonNRTOpen-76ACA1B79F433096-001/init-core-data-001/index,segFN=segments_8,generation=8}
   [junit4]   2> 1019292 T3275 C3680 oasc.SolrDeletionPolicy.updateCommits newest commit generation = 8
   [junit4]   2> 1019303 T3275 C3680 oass.SolrIndexSearcher.<init> Opening Searcher@7d19eb7d[collection1] main
   [junit4]   2> 1019304 T3275 C3680 oasu.DirectUpdateHandler2.commit end_commit_flush
   [junit4]   2> 1019304 T3282 oasc.SolrCore.registerSearcher [collection1] Registered new searcher Searcher@7d19eb7d[collection1] main{StandardDirectoryReader(segments_8:16 _4(4.10):c1 _5(4.10):c1)}
   [junit4]   2> 1019305 T3275 C3680 oasup.LogUpdateProcessor.finish [collection1] webapp=null path=null params={} {commit=} 0 40
   [junit4]   2> 1019310 T3275 oasc.TestNonNRTOpen.assertNotNRT Checking notNRT & maxDoc=2 of core=org.apache.solr.core.SolrCore@7241d872
   [junit4]   2> 1019312 T3275 C3680 oasup.LogUpdateProcessor.finish [collection1] webapp=null path=null params={} {add=[(null)]} 0 2
   [junit4]   2> 1019313 T3275 oasc.TestNonNRTOpen.testReaderIsNotNRT Reloading core: org.apache.solr.core.SolrCore@7241d872
   [junit4]   2> 1019313 T3275 oasc.SolrResourceLoader.<init> new SolrResourceLoader for directory: '/Users/jenkins/workspace/Lucene-Solr-4.x-MacOSX/solr/core/src/test-files/solr/collection1/'
   [junit4]   2> 1019315 T3275 oasc.SolrResourceLoader.replaceClassLoader Adding 'file:/Users/jenkins/workspace/Lucene-Solr-4.x-MacOSX/solr/core/src/test-files/solr/collection1/lib/.svn/' to classloader
   [junit4]   2> 1019316 T3275 oasc.SolrResourceLoader.replaceClassLoader Adding 'file:/Users/jenkins/workspace/Lucene-Solr-4.x-MacOSX/solr/core/src/test-files/solr/collection1/lib/classes/' to classloader
   [junit4]   2> 1019317 T3275 oasc.SolrResourceLoader.replaceClassLoader Adding 'file:/Users/jenkins/workspace/Lucene-Solr-4.x-MacOSX/solr/core/src/test-files/solr/collection1/lib/README' to classloader
   [junit4]   2> 1019425 T3275 oasc.SolrConfig.<init> Using Lucene MatchVersion: LUCENE_4_10
   [junit4]   2> 1019475 T3275 oasc.SolrConfig.<init> Loaded SolrConfig: solrconfig-basic.xml
   [junit4]   2> 1019475 T3275 oass.IndexSchema.readSchema Reading Solr Schema from schema-minimal.xml
   [junit4]   2> 1019483 T3275 oass.IndexSchema.readSchema [collection1] Schema name=minimal
   [junit4]   2> 1019499 T3275 oass.IndexSchema.readSchema WARN no uniqueKey specified in schema.
   [junit4]   2> 1019500 T3275 oasc.CoreContainer.reload Reloading SolrCore 'collection1' using configuration from instancedir /Users/jenkins/workspace/Lucene-Solr-4.x-MacOSX/solr/core/src/test-files/solr/collection1/
   [junit4]   2> 1019500 T3275 oasc.SolrCore.<init> [collection1] Opening new SolrCore at /Users/jenkins/workspace/Lucene-Solr-4.x-MacOSX/solr/core/src/test-files/solr/collection1/, dataDir=/Users/jenkins/workspace/Lucene-Solr-4.x-MacOSX/solr/build/solr-core/test/J0/./solr.core.TestNonNRTOpen-76ACA1B79F433096-001/init-core-data-001/
   [junit4]   2> 1019501 T3275 oasc.SolrCore.<init> JMX monitoring not detected for core: collection1
   [junit4]   2> 1019501 T3275 oasc.SolrCore.getNewIndexDir New index directory detected: old=null new=/Users/jenkins/workspace/Lucene-Solr-4.x-MacOSX/solr/build/solr-core/test/J0/./solr.core.TestNonNRTOpen-76ACA1B79F433096-001/init-core-data-001/index/
   [junit4]   2> 1019502 T3275 oasc.SolrCore.loadUpdateProcessorChains no updateRequestProcessorChain defined as default, creating implicit default
   [junit4]   2> 1019503 T3275 oasc.RequestHandlers.initHandlersFromConfig created standard: solr.StandardRequestHandler
   [junit4]   2> 1019503 T3275 oasc.RequestHandlers.initHandlersFromConfig created /update: solr.UpdateRequestHandler
   [junit4]   2> 1019515 T3275 oashl.XMLLoader.init xsltCacheLifetimeSeconds=60
   [junit4]   2> 1019518 T3275 oasu.CommitTracker.<init> Hard AutoCommit: disabled
   [junit4]   2> 1019518 T3275 oasu.CommitTracker.<init> Soft AutoCommit: disabled
   [junit4]   2> 1019524 T3275 oass.SolrIndexSearcher.<init> Opening Searcher@1f954f51[collection1] main
   [junit4]   2> 1019524 T3275 oasr.ManagedResourceStorage$FileStorageIO.configure File-based storage initialized to use dir: /Users/jenkins/workspace/Lucene-Solr-4.x-MacOSX/solr/core/src/test-files/solr/collection1/conf
   [junit4]   2> 1019525 T3275 oasr.RestManager.init Initializing RestManager with initArgs: {storageDir=/Users/jenkins/workspace/Lucene-Solr-4.x-MacOSX/solr/core/src/test-files/solr/collection1/conf/}
   [junit4]   2> 1019525 T3275 oasr.ManagedResourceStorage.load Reading _rest_managed.json using file:dir=/Users/jenkins/workspace/Lucene-Solr-4.x-MacOSX/solr/core/src/test-files/solr/collection1/conf
   [junit4]   2> 1019526 T3275 oasr.ManagedResource.reloadFromStorage WARN No stored data found for /rest/managed
   [junit4]   2> 1019526 T3275 oasr.ManagedResource.notifyObserversDuringInit WARN No registered observers for /rest/managed
   [junit4]   2> 1019527 T3275 oasr.RestManager.init Initializing 0 registered ManagedResources
   [junit4]   2> 1019527 T3275 oasu.DefaultSolrCoreState.newIndexWriter Creating new IndexWriter...
   [junit4]   2> 1019528 T3275 oasu.DefaultSolrCoreState.newIndexWriter Waiting until IndexWriter is unused... core=collection1
   [junit4]   2> 1019528 T3275 oasu.DefaultSolrCoreState.closeIndexWriter Closing old IndexWriter... core=collection1
   [junit4]   2> 1019527 T3283 oasc.SolrCore.registerSearcher [collection1] Registered new searcher Searcher@1f954f51[collection1] main{StandardDirectoryReader(segments_8:16 _4(4.10):c1 _5(4.10):c1)}
   [junit4]   2> 1019560 T3275 oasc.SolrDeletionPolicy.onCommit SolrDeletionPolicy.onCommit: commits: num=2
   [junit4]   2> 		commit{dir=/Users/jenkins/workspace/Lucene-Solr-4.x-MacOSX/solr/build/solr-core/test/J0/solr.core.TestNonNRTOpen-76ACA1B79F433096-001/init-core-data-001/index,segFN=segments_8,generation=8}
   [junit4]   2> 		commit{dir=/Users/jenkins/workspace/Lucene-Solr-4.x-MacOSX/solr/build/solr-core/test/J0/solr.core.TestNonNRTOpen-76ACA1B79F433096-001/init-core-data-001/index,segFN=segments_9,generation=9}
   [junit4]   2> 1019561 T3275 oasc.SolrDeletionPolicy.updateCommits newest commit generation = 9
   [junit4]   2> 1019577 T3275 oasc.SolrDeletionPolicy.onInit SolrDeletionPolicy.onInit: commits: num=1
   [junit4]   2> 		commit{dir=/Users/jenkins/workspace/Lucene-Solr-4.x-MacOSX/solr/build/solr-core/test/J0/solr.core.TestNonNRTOpen-76ACA1B79F433096-001/init-core-data-001/index,segFN=segments_9,generation=9}
   [junit4]   2> 1019578 T3275 oasc.SolrDeletionPolicy.updateCommits newest commit generation = 9
   [junit4]   2> 1019578 T3275 oasu.DefaultSolrCoreState.newIndexWriter New IndexWriter is ready to be used.
   [junit4]   2> 1019585 T3275 oass.SolrIndexSearcher.<init> Opening Searcher@3239bcfa[collection1] main
   [junit4]   2> 1019586 T3275 oasc.CoreContainer.registerCore replacing core: collection1
   [junit4]   2> 1019586 T3275 oasc.SolrCore.close [collection1]  CLOSING SolrCore org.apache.solr.core.SolrCore@7241d872
   [junit4]   2> 1019586 T3275 oasu.DirectUpdateHandler2.close closing DirectUpdateHandler2{commits=1,autocommits=0,soft autocommits=0,optimizes=0,rollbacks=0,expungeDeletes=0,docsPending=1,adds=1,deletesById=0,deletesByQuery=0,errors=0,cumulative_adds=2,cumulative_deletesById=0,cumulative_deletesByQuery=0,cumulative_errors=0}
   [junit4]   2> 1019587 T3275 oasc.SolrCore.closeSearcher [collection1] Closing main searcher on request.
   [junit4]   2> 1019588 T3275 oasc.TestNonNRTOpen.assertNotNRT Checking notNRT & maxDoc=3 of core=org.apache.solr.core.SolrCore@6ca5dad8
   [junit4]   2> 1019589 T3275 oas.SolrTestCaseJ4.tearDown ###Ending testReaderIsNotNRT
   [junit4]   2> 1019590 T3283 oasc.SolrCore.registerSearcher [collection1] Registered new searcher Searcher@3239bcfa[collection1] main{StandardDirectoryReader(segments_9:18 _4(4.10):c1 _5(4.10):c1 _6(4.10):c1)}
   [junit4]   2> NOTE: reproduce with: ant test  -Dtestcase=TestNonNRTOpen -Dtests.method=testReaderIsNotNRT -Dtests.seed=76ACA1B79F433096 -Dtests.slow=true -Dtests.locale=it_IT -Dtests.timezone=America/Godthab -Dtests.file.encoding=ISO-8859-1
   [junit4] FAILURE 0.62s | TestNonNRTOpen.testReaderIsNotNRT <<<
   [junit4]    > Throwable #1: java.lang.AssertionError: SOLR-5815? : wrong maxDoc: core=org.apache.solr.core.SolrCore@6ca5dad8 searcher=Searcher@1f954f51[collection1] main{StandardDirectoryReader(segments_8:16 _4(4.10):c1 _5(4.10):c1)} expected:<3> but was:<2>
   [junit4]    > 	at __randomizedtesting.SeedInfo.seed([76ACA1B79F433096:C32AC03020828262]:0)
   [junit4]    > 	at org.apache.solr.core.TestNonNRTOpen.assertNotNRT(TestNonNRTOpen.java:142)
   [junit4]    > 	at org.apache.solr.core.TestNonNRTOpen.testReaderIsNotNRT(TestNonNRTOpen.java:100)
   [junit4]    > 	at java.lang.Thread.run(Thread.java:745)
   [junit4]   2> 1019600 T3275 oas.SolrTestCaseJ4.deleteCore ###deleteCore
   [junit4]   2> 1019600 T3275 oasc.CoreContainer.shutdown Shutting down CoreContainer instance=267304412
   [junit4]   2> 1019601 T3275 oasc.SolrCore.close [collection1]  CLOSING SolrCore org.apache.solr.core.SolrCore@6ca5dad8
   [junit4]   2> 1019601 T3275 oasu.DirectUpdateHandler2.close closing DirectUpdateHandler2{commits=0,autocommits=0,soft autocommits=0,optimizes=0,rollbacks=0,expungeDeletes=0,docsPending=0,adds=0,deletesById=0,deletesByQuery=0,errors=0,cumulative_adds=0,cumulative_deletesById=0,cumulative_deletesByQuery=0,cumulative_errors=0}
   [junit4]   2> 1019601 T3275 oasu.SolrCoreState.decrefSolrCoreState Closing SolrCoreState
   [junit4]   2> 1019602 T3275 oasu.DefaultSolrCoreState.closeIndexWriter SolrCoreState ref count has reached 0 - closing IndexWriter
   [junit4]   2> 1019602 T3275 oasu.DefaultSolrCoreState.closeIndexWriter closing IndexWriter with IndexWriterCloser
   [junit4]   2> 1019603 T3275 oasc.SolrCore.closeSearcher [collection1] Closing main searcher on request.
   [junit4]   2> 1019603 T3275 oasc.CachingDirectoryFactory.close Closing StandardDirectoryFactory - 2 directories currently being tracked
   [junit4]   2> 1019604 T3275 oasc.CachingDirectoryFactory.closeCacheValue looking to close /Users/jenkins/workspace/Lucene-Solr-4.x-MacOSX/solr/build/solr-core/test/J0/solr.core.TestNonNRTOpen-76ACA1B79F433096-001/init-core-data-001 [CachedDir<<refCount=0;path=/Users/jenkins/workspace/Lucene-Solr-4.x-MacOSX/solr/build/solr-core/test/J0/solr.core.TestNonNRTOpen-76ACA1B79F433096-001/init-core-data-001;done=false>>]
   [junit4]   2> 1019604 T3275 oasc.CachingDirectoryFactory.close Closing directory: /Users/jenkins/workspace/Lucene-Solr-4.x-MacOSX/solr/build/solr-core/test/J0/solr.core.TestNonNRTOpen-76ACA1B79F433096-001/init-core-data-001
   [junit4]   2> 1019604 T3275 oasc.CachingDirectoryFactory.closeCacheValue looking to close /Users/jenkins/workspace/Lucene-Solr-4.x-MacOSX/solr/build/solr-core/test/J0/solr.core.TestNonNRTOpen-76ACA1B79F433096-001/init-core-data-001/index [CachedDir<<refCount=0;path=/Users/jenkins/workspace/Lucene-Solr-4.x-MacOSX/solr/build/solr-core/test/J0/solr.core.TestNonNRTOpen-76ACA1B79F433096-001/init-core-data-001/index;done=false>>]
   [junit4]   2> 1019604 T3275 oasc.CachingDirectoryFactory.close Closing directory: /Users/jenkins/workspace/Lucene-Solr-4.x-MacOSX/solr/build/solr-core/test/J0/solr.core.TestNonNRTOpen-76ACA1B79F433096-001/init-core-data-001/index
   [junit4]   2> NOTE: leaving temporary files on disk at: /Users/jenkins/workspace/Lucene-Solr-4.x-MacOSX/solr/build/solr-core/test/J0/./solr.core.TestNonNRTOpen-76ACA1B79F433096-001
   [junit4]   2> NOTE: test params are: codec=Lucene3x, sim=DefaultSimilarity, locale=it_IT, timezone=America/Godthab
   [junit4]   2> NOTE: Mac OS X 10.8.5 x86_64/Oracle Corporation 1.7.0_60 (64-bit)/cpus=2,threads=1,free=65806304,total=230019072
   [junit4]   2> NOTE: All tests run in this JVM: [TestSearcherReuse, QueryEqualityTest, TestCloudManagedSchema, PrimUtilsTest, TestReplicationHandler, TestDistributedSearch, TestJmxIntegration, DistributedSuggestComponentTest, TestReplicationHandlerBackup, SuggesterTSTTest, TestSolrXmlPersistence, OutputWriterTest, TestManagedSynonymFilterFactory, TestShortCircuitedRequests, TestSurroundQueryParser, SortByFunctionTest, TestElisionMultitermQuery, TestExceedMaxTermLength, TestSolrQueryParserDefaultOperatorResource, AddSchemaFieldsUpdateProcessorFactoryTest, PreAnalyzedFieldTest, DateFieldTest, TestAtomicUpdateErrorCases, TestSchemaSimilarityResource, TestRangeQuery, SolrCmdDistributorTest, TestConfig, SimplePostToolTest, EnumFieldTest, HttpPartitionTest, TestSolrXml, TestRealTimeGet, TestInitQParser, TestPostingsSolrHighlighter, TestZkChroot, BasicFunctionalityTest, CursorPagingTest, TestSearchPerf, TestIndexSearcher, HdfsWriteToMultipleCollectionsTest, DistanceFunctionTest, FullSolrCloudDistribCmdsTest, TestStressRecovery, TestQueryUtils, SSLMigrationTest, HighlighterMaxOffsetTest, ConnectionManagerTest, TestJoin, CursorMarkTest, TestCollectionAPI, FileBasedSpellCheckerTest, TestSchemaResource, TestSimpleQParserPlugin, IndexBasedSpellCheckerTest, HdfsRecoveryZkTest, TestNRTOpen, ChaosMonkeySafeLeaderTest, QueryResultKeyTest, SolrIndexSplitterTest, TestNonNRTOpen]
   [junit4] Completed in 1.86s, 2 tests, 1 failure <<< FAILURES!

[...truncated 465 lines...]
   [junit4] Suite: org.apache.solr.cloud.SliceStateUpdateTest
   [junit4]   2> Creating dataDir: /Users/jenkins/workspace/Lucene-Solr-4.x-MacOSX/solr/build/solr-core/test/J0/./solr.cloud.SliceStateUpdateTest-76ACA1B79F433096-001/init-core-data-001
   [junit4]   2> 3200130 T10432 oas.SolrTestCaseJ4.buildSSLConfig Randomized ssl (false) and clientAuth (false)
   [junit4]   2> 3200134 T10432 oas.SolrTestCaseJ4.setUp ###Starting testSliceStateUpdate
   [junit4]   2> 3200135 T10432 oasc.ZkTestServer.run STARTING ZK TEST SERVER
   [junit4]   1> client port:0.0.0.0/0.0.0.0:0
   [junit4]   2> 3200136 T10433 oasc.ZkTestServer$ZKServerMain.runFromConfig Starting server
   [junit4]   2> 3200237 T10432 oasc.ZkTestServer.run start zk server on port:56629
   [junit4]   2> 3200241 T10432 oascc.ConnectionManager.waitForConnected Waiting for client to connect to ZooKeeper
   [junit4]   2> 3200251 T10439 oascc.ConnectionManager.process Watcher org.apache.solr.common.cloud.ConnectionManager@5ca70d25 name:ZooKeeperConnection Watcher:127.0.0.1:56629 got event WatchedEvent state:SyncConnected type:None path:null path:null type:None
   [junit4]   2> 3200252 T10432 oascc.ConnectionManager.waitForConnected Client is connected to ZooKeeper
   [junit4]   2> 3200253 T10432 oascc.SolrZkClient.makePath makePath: /solr
   [junit4]   2> 3200264 T10432 oascc.ConnectionManager.waitForConnected Waiting for client to connect to ZooKeeper
   [junit4]   2> 3200268 T10441 oascc.ConnectionManager.process Watcher org.apache.solr.common.cloud.ConnectionManager@4fb67feb name:ZooKeeperConnection Watcher:127.0.0.1:56629/solr got event WatchedEvent state:SyncConnected type:None path:null path:null type:None
   [junit4]   2> 3200268 T10432 oascc.ConnectionManager.waitForConnected Client is connected to ZooKeeper
   [junit4]   2> 3200269 T10432 oascc.SolrZkClient.makePath makePath: /collections/collection1
   [junit4]   2> 3200276 T10432 oascc.SolrZkClient.makePath makePath: /collections/collection1/shards
   [junit4]   2> 3200282 T10432 oascc.SolrZkClient.makePath makePath: /collections/control_collection
   [junit4]   2> 3200287 T10432 oascc.SolrZkClient.makePath makePath: /collections/control_collection/shards
   [junit4]   2> 3200293 T10432 oasc.AbstractZkTestCase.putConfig put /Users/jenkins/workspace/Lucene-Solr-4.x-MacOSX/solr/core/src/test-files/solr/collection1/conf/solrconfig.xml to /configs/conf1/solrconfig.xml
   [junit4]   2> 3200294 T10432 oascc.SolrZkClient.makePath makePath: /configs/conf1/solrconfig.xml
   [junit4]   2> 3200304 T10432 oasc.AbstractZkTestCase.putConfig put /Users/jenkins/workspace/Lucene-Solr-4.x-MacOSX/solr/core/src/test-files/solr/collection1/conf/schema.xml to /configs/conf1/schema.xml
   [junit4]   2> 3200304 T10432 oascc.SolrZkClient.makePath makePath: /configs/conf1/schema.xml
   [junit4]   2> 3200312 T10432 oasc.AbstractZkTestCase.putConfig put /Users/jenkins/workspace/Lucene-Solr-4.x-MacOSX/solr/core/src/test-files/solr/collection1/conf/solrconfig.snippet.randomindexconfig.xml to /configs/conf1/solrconfig.snippet.randomindexconfig.xml
   [junit4]   2> 3200312 T10432 oascc.SolrZkClient.makePath makePath: /configs/conf1/solrconfig.snippet.randomindexconfig.xml
   [junit4]   2> 3200320 T10432 oasc.AbstractZkTestCase.putConfig put /Users/jenkins/workspace/Lucene-Solr-4.x-MacOSX/solr/core/src/test-files/solr/collection1/conf/stopwords.txt to /configs/conf1/stopwords.txt
   [junit4]   2> 3200320 T10432 oascc.SolrZkClient.makePath makePath: /configs/conf1/stopwords.txt
   [junit4]   2> 3200327 T10432 oasc.AbstractZkTestCase.putConfig put /Users/jenkins/workspace/Lucene-Solr-4.x-MacOSX/solr/core/src/test-files/solr/collection1/conf/protwords.txt to /configs/conf1/protwords.txt
   [junit4]   2> 3200329 T10432 oascc.SolrZkClient.makePath makePath: /configs/conf1/protwords.txt
   [junit4]   2> 3200345 T10432 oasc.AbstractZkTestCase.putConfig put /Users/jenkins/workspace/Lucene-Solr-4.x-MacOSX/solr/core/src/test-files/solr/collection1/conf/currency.xml to /configs/conf1/currency.xml
   [junit4]   2> 3200345 T10432 oascc.SolrZkClient.makePath makePath: /configs/conf1/currency.xml
   [junit4]   2> 3200353 T10432 oasc.AbstractZkTestCase.putConfig put /Users/jenkins/workspace/Lucene-Solr-4.x-MacOSX/solr/core/src/test-files/solr/collection1/conf/enumsConfig.xml to /configs/conf1/enumsConfig.xml
   [junit4]   2> 3200354 T10432 oascc.SolrZkClient.makePath makePath: /configs/conf1/enumsConfig.xml
   [junit4]   2> 3200361 T10432 oasc.AbstractZkTestCase.putConfig put /Users/jenkins/workspace/Lucene-Solr-4.x-MacOSX/solr/core/src/test-files/solr/collection1/conf/open-exchange-rates.json to /configs/conf1/open-exchange-rates.json
   [junit4]   2> 3200361 T10432 oascc.SolrZkClient.makePath makePath: /configs/conf1/open-exchange-rates.json
   [junit4]   2> 3200367 T10432 oasc.AbstractZkTestCase.putConfig put /Users/jenkins/workspace/Lucene-Solr-4.x-MacOSX/solr/core/src/test-files/solr/collection1/conf/mapping-ISOLatin1Accent.txt to /configs/conf1/mapping-ISOLatin1Accent.txt
   [junit4]   2> 3200368 T10432 oascc.SolrZkClient.makePath makePath: /configs/conf1/mapping-ISOLatin1Accent.txt
   [junit4]   2> 3200375 T10432 oasc.AbstractZkTestCase.putConfig put /Users/jenkins/workspace/Lucene-Solr-4.x-MacOSX/solr/core/src/test-files/solr/collection1/conf/old_synonyms.txt to /configs/conf1/old_synonyms.txt
   [junit4]   2> 3200376 T10432 oascc.SolrZkClient.makePath makePath: /configs/conf1/old_synonyms.txt
   [junit4]   2> 3200382 T10432 oasc.AbstractZkTestCase.putConfig put /Users/jenkins/workspace/Lucene-Solr-4.x-MacOSX/solr/core/src/test-files/solr/collection1/conf/synonyms.txt to /configs/conf1/synonyms.txt
   [junit4]   2> 3200383 T10432 oascc.SolrZkClient.makePath makePath: /configs/conf1/synonyms.txt
   [junit4]   2> 3200390 T10432 oasc.SliceStateUpdateTest.setUp ####SETUP_START testSliceStateUpdate
   [junit4]   2> 3200391 T10432 oascc.ConnectionManager.waitForConnected Waiting for client to connect to ZooKeeper
   [junit4]   2> 3200395 T10443 oascc.ConnectionManager.process Watcher org.apache.solr.common.cloud.ConnectionManager@7276af58 name:ZooKeeperConnection Watcher:127.0.0.1:56629/solr got event WatchedEvent state:SyncConnected type:None path:null path:null type:None
   [junit4]   2> 3200395 T10432 oascc.ConnectionManager.waitForConnected Client is connected to ZooKeeper
   [junit4]   2> 3200395 T10432 oascc.SolrZkClient.makePath makePath: /collections/testcore
   [junit4]   2> 3200400 T10432 oascc.SolrZkClient.makePath makePath: /collections/testcore/shards
   [junit4]   2> 3200412 T10432 oasc.SolrResourceLoader.locateSolrHome JNDI not configured for solr (NoInitialContextEx)
   [junit4]   2> 3200412 T10432 oasc.SolrResourceLoader.locateSolrHome using system property solr.solr.home: /Users/jenkins/workspace/Lucene-Solr-4.x-MacOSX/solr/core/src/test-files/solr
   [junit4]   2> 3200413 T10432 oasc.SolrResourceLoader.<init> new SolrResourceLoader for directory: '/Users/jenkins/workspace/Lucene-Solr-4.x-MacOSX/solr/core/src/test-files/solr/'
   [junit4]   2> 3200460 T10432 oasc.ConfigSolr.fromFile Loading container configuration from /Users/jenkins/workspace/Lucene-Solr-4.x-MacOSX/solr/core/src/test-files/solr/solr.xml
   [junit4]   2> 3200525 T10432 oasc.CoreContainer.<init> New CoreContainer 2023496864
   [junit4]   2> 3200526 T10432 oasc.CoreContainer.load Loading cores into CoreContainer [instanceDir=/Users/jenkins/workspace/Lucene-Solr-4.x-MacOSX/solr/core/src/test-files/solr/]
   [junit4]   2> 3200527 T10432 oashc.HttpShardHandlerFactory.getParameter Setting socketTimeout to: 90000
   [junit4]   2> 3200527 T10432 oashc.HttpShardHandlerFactory.getParameter Setting urlScheme to: 
   [junit4]   2> 3200528 T10432 oashc.HttpShardHandlerFactory.getParameter Setting connTimeout to: 15000
   [junit4]   2> 3200528 T10432 oashc.HttpShardHandlerFactory.getParameter Setting maxConnectionsPerHost to: 20
   [junit4]   2> 3200528 T10432 oashc.HttpShardHandlerFactory.getParameter Setting corePoolSize to: 0
   [junit4]   2> 3200529 T10432 oashc.HttpShardHandlerFactory.getParameter Setting maximumPoolSize to: 2147483647
   [junit4]   2> 3200529 T10432 oashc.HttpShardHandlerFactory.getParameter Setting maxThreadIdleTime to: 5
   [junit4]   2> 3200530 T10432 oashc.HttpShardHandlerFactory.getParameter Setting sizeOfQueue to: -1
   [junit4]   2> 3200530 T10432 oashc.HttpShardHandlerFactory.getParameter Setting fairnessPolicy to: false
   [junit4]   2> 3200531 T10432 oasl.LogWatcher.createWatcher SLF4J impl is org.slf4j.impl.Log4jLoggerFactory
   [junit4]   2> 3200531 T10432 oasl.LogWatcher.newRegisteredLogWatcher Registering Log Listener [Log4j (org.slf4j.impl.Log4jLoggerFactory)]
   [junit4]   2> 3200531 T10432 oasc.CoreContainer.load Host Name: 127.0.0.1
   [junit4]   2> 3200532 T10432 oasc.ZkContainer.initZooKeeper Zookeeper client=127.0.0.1:56629/solr
   [junit4]   2> 3200533 T10432 oasc.ZkController.checkChrootPath zkHost includes chroot
   [junit4]   2> 3200535 T10432 oascc.ConnectionManager.waitForConnected Waiting for client to connect to ZooKeeper
   [junit4]   2> 3200540 T10445 oascc.ConnectionManager.process Watcher org.apache.solr.common.cloud.ConnectionManager@511b8a3c name:ZooKeeperConnection Watcher:127.0.0.1:56629 got event WatchedEvent state:SyncConnected type:None path:null path:null type:None
   [junit4]   2> 3200540 T10432 oascc.ConnectionManager.waitForConnected Client is connected to ZooKeeper
   [junit4]   2> 3200545 T10432 oascc.ConnectionManager.waitForConnected Waiting for client to connect to ZooKeeper
   [junit4]   2> 3200548 T10447 oascc.ConnectionManager.process Watcher org.apache.solr.common.cloud.ConnectionManager@77eae602 name:ZooKeeperConnection Watcher:127.0.0.1:56629/solr got event WatchedEvent state:SyncConnected type:None path:null path:null type:None
   [junit4]   2> 3200548 T10432 oascc.ConnectionManager.waitForConnected Client is connected to ZooKeeper
   [junit4]   2> 3200551 T10432 oascc.SolrZkClient.makePath makePath: /overseer/queue
   [junit4]   2> 3200560 T10432 oascc.SolrZkClient.makePath makePath: /overseer/collection-queue-work
   [junit4]   2> 3200569 T10432 oascc.SolrZkClient.makePath makePath: /overseer/collection-map-running
   [junit4]   2> 3200577 T10432 oascc.SolrZkClient.makePath makePath: /overseer/collection-map-completed
   [junit4]   2> 3200586 T10432 oascc.SolrZkClient.makePath makePath: /overseer/collection-map-failure
   [junit4]   2> 3200597 T10432 oascc.SolrZkClient.makePath makePath: /live_nodes
   [junit4]   2> 3200604 T10432 oasc.ZkController.createEphemeralLiveNode Register node as live in ZooKeeper:/live_nodes/127.0.0.1:1661_solr
   [junit4]   2> 3200606 T10432 oascc.SolrZkClient.makePath makePath: /live_nodes/127.0.0.1:1661_solr
   [junit4]   2> 3200615 T10432 oascc.SolrZkClient.makePath makePath: /overseer_elect
   [junit4]   2> 3200619 T10432 oascc.SolrZkClient.makePath makePath: /overseer_elect/election
   [junit4]   2> 3200631 T10432 oasc.OverseerElectionContext.runLeaderProcess I am going to be the leader 127.0.0.1:1661_solr
   [junit4]   2> 3200631 T10432 oascc.SolrZkClient.makePath makePath: /overseer_elect/leader
   [junit4]   2> 3200637 T10432 oasc.Overseer.start Overseer (id=91963297389740036-127.0.0.1:1661_solr-n_0000000000) starting
   [junit4]   2> 3200646 T10432 oascc.SolrZkClient.makePath makePath: /overseer/queue-work
   [junit4]   2> 3200678 T10449 oasc.OverseerCollectionProcessor.run Process current queue of collection creations
   [junit4]   2> 3200682 T10432 oascc.SolrZkClient.makePath makePath: /clusterstate.json
   [junit4]   2> 3200689 T10432 oascc.SolrZkClient.makePath makePath: /aliases.json
   [junit4]   2> 3200694 T10432 oascc.ZkStateReader.createClusterStateWatchersAndUpdate Updating cluster state from ZooKeeper... 
   [junit4]   2> 3200700 T10448 oasc.Overseer$ClusterStateUpdater.run Starting to work on the main queue
   [junit4]   2> 3200710 T10450 oasc.ZkController.publish publishing core=collection1 state=down collection=collection1
   [junit4]   2> 3200710 T10450 oasc.ZkController.publish numShards not found on descriptor - reading it from system property
   [junit4]   2> 3200713 T10447 oasc.DistributedQueue$LatchChildWatcher.process LatchChildWatcher fired on path: /overseer/queue state: SyncConnected type NodeChildrenChanged
   [junit4]   2> 3200713 T10450 oasc.ZkController.waitForCoreNodeName look for our core node name
   [junit4]   2> 3200717 T10448 oascc.ZkStateReader.updateClusterState Updating cloud state from ZooKeeper... 
   [junit4]   2> 3200719 T10448 oasc.Overseer$ClusterStateUpdater.updateState Update state numShards=null message={
   [junit4]   2> 	  "operation":"state",
   [junit4]   2> 	  "state":"down",
   [junit4]   2> 	  "base_url":"http://127.0.0.1:1661/solr",
   [junit4]   2> 	  "core":"collection1",
   [junit4]   2> 	  "roles":null,
   [junit4]   2> 	  "node_name":"127.0.0.1:1661_solr",
   [junit4]   2> 	  "shard":null,
   [junit4]   2> 	  "collection":"collection1",
   [junit4]   2> 	  "numShards":null,
   [junit4]   2> 	  "core_node_name":null}
   [junit4]   2> 3200719 T10448 oasc.Overseer$ClusterStateUpdater.updateState Assigning new node to shard shard=shard1
   [junit4]   2> 3200726 T10447 oasc.DistributedQueue$LatchChildWatcher.process LatchChildWatcher fired on path: /overseer/queue state: SyncConnected type NodeChildrenChanged
   [junit4]   2> 3200727 T10447 oascc.ZkStateReader$2.process A cluster state change: WatchedEvent state:SyncConnected type:NodeDataChanged path:/clusterstate.json, has occurred - updating... (live nodes size: 1)
   [junit4]   2> 3201716 T10450 oasc.ZkController.waitForShardId waiting to find shard id in clusterstate for collection1
   [junit4]   2> 3201719 T10450 oasc.ZkController.createCollectionZkNode Check for collection zkNode:collection1
   [junit4]   2> 3201722 T10450 oasc.ZkController.createCollectionZkNode Collection zkNode exists
   [junit4]   2> 3201723 T10450 oascc.ZkStateReader.readConfigName Load collection config from:/collections/collection1
   [junit4]   2> 3201730 T10450 oascc.ZkStateReader.readConfigName path=/collections/collection1 configName=conf1 specified config exists in ZooKeeper
   [junit4]   2> 3201732 T10450 oasc.SolrResourceLoader.<init> new SolrResourceLoader for directory: '/Users/jenkins/workspace/Lucene-Solr-4.x-MacOSX/solr/core/src/test-files/solr/collection1/'
   [junit4]   2> 3201738 T10450 oasc.SolrResourceLoader.replaceClassLoader Adding 'file:/Users/jenkins/workspace/Lucene-Solr-4.x-MacOSX/solr/core/src/test-files/solr/collection1/lib/.svn/' to classloader
   [junit4]   2> 3201738 T10450 oasc.SolrResourceLoader.replaceClassLoader Adding 'file:/Users/jenkins/workspace/Lucene-Solr-4.x-MacOSX/solr/core/src/test-files/solr/collection1/lib/classes/' to classloader
   [junit4]   2> 3201739 T10450 oasc.SolrResourceLoader.replaceClassLoader Adding 'file:/Users/jenkins/workspace/Lucene-Solr-4.x-MacOSX/solr/core/src/test-files/solr/collection1/lib/README' to classloader
   [junit4]   2> 3201816 T10450 oasc.SolrConfig.<init> Using Lucene MatchVersion: LUCENE_4_10
   [junit4]   2> 3201880 T10450 oasc.SolrConfig.<init> Loaded SolrConfig: solrconfig.xml
   [junit4]   2> 3201884 T10450 oass.IndexSchema.readSchema Reading Solr Schema from schema.xml
   [junit4]   2> 3201895 T10450 oass.IndexSchema.readSchema [collection1] Schema name=test
   [junit4]   2> 3202369 T10450 oass.ByteField.init WARN ByteField is deprecated and will be removed in 5.0. You should use TrieIntField instead.
   [junit4]   2> 3202369 T10450 oass.ShortField.init WARN ShortField is deprecated and will be removed in 5.0. You should use TrieIntField instead.
   [junit4]   2> 3202371 T10450 oass.OpenExchangeRatesOrgProvider.init Initialized with rates=open-exchange-rates.json, refreshInterval=1440.
   [junit4]   2> 3202379 T10450 oass.IndexSchema.readSchema default search field in schema is text
   [junit4]   2> 3202382 T10450 oass.IndexSchema.readSchema unique key field: id
   [junit4]   2> 3202410 T10450 oass.FileExchangeRateProvider.reload Reloading exchange rates from file currency.xml
   [junit4]   2> 3202416 T10450 oass.FileExchangeRateProvider.reload Reloading exchange rates from file currency.xml
   [junit4]   2> 3202423 T10450 oass.OpenExchangeRatesOrgProvider.reload Reloading exchange rates from open-exchange-rates.json
   [junit4]   2> 3202426 T10450 oass.OpenExchangeRatesOrgProvider$OpenExchangeRates.<init> WARN Unknown key IMPORTANT NOTE
   [junit4]   2> 3202426 T10450 oass.OpenExchangeRatesOrgProvider$OpenExchangeRates.<init> WARN Expected key, got STRING
   [junit4]   2> 3202426 T10450 oass.OpenExchangeRatesOrgProvider.reload Reloading exchange rates from open-exchange-rates.json
   [junit4]   2> 3202429 T10450 oass.OpenExchangeRatesOrgProvider$OpenExchangeRates.<init> WARN Unknown key IMPORTANT NOTE
   [junit4]   2> 3202429 T10450 oass.OpenExchangeRatesOrgProvider$OpenExchangeRates.<init> WARN Expected key, got STRING
   [junit4]   2> 3202429 T10450 oasc.CoreContainer.create Creating SolrCore 'collection1' using configuration from collection collection1
   [junit4]   2> 3202429 T10450 oasc.SolrCore.initDirectoryFactory org.apache.solr.core.MockDirectoryFactory
   [junit4]   2> 3202430 T10450 oasc.SolrCore.<init> [collection1] Opening new SolrCore at /Users/jenkins/workspace/Lucene-Solr-4.x-MacOSX/solr/core/src/test-files/solr/collection1/, dataDir=/Users/jenkins/workspace/Lucene-Solr-4.x-MacOSX/solr/build/solr-core/test/J0/./solr.cloud.SliceStateUpdateTest-76ACA1B79F433096-001/data1-001/
   [junit4]   2> 3202430 T10450 oasc.JmxMonitoredMap.<init> JMX monitoring is enabled. Adding Solr mbeans to JMX Server: com.sun.jmx.mbeanserver.JmxMBeanServer@7775969d
   [junit4]   2> 3202431 T10450 oasc.CachingDirectoryFactory.get return new directory for /Users/jenkins/workspace/Lucene-Solr-4.x-MacOSX/solr/build/solr-core/test/J0/./solr.cloud.SliceStateUpdateTest-76ACA1B79F433096-001/data1-001
   [junit4]   2> 3202431 T10450 oasc.SolrCore.getNewIndexDir New index directory detected: old=null new=/Users/jenkins/workspace/Lucene-Solr-4.x-MacOSX/solr/build/solr-core/test/J0/./solr.cloud.SliceStateUpdateTest-76ACA1B79F433096-001/data1-001/index/
   [junit4]   2> 3202431 T10450 oasc.SolrCore.initIndex WARN [collection1] Solr index directory '/Users/jenkins/workspace/Lucene-Solr-4.x-MacOSX/solr/build/solr-core/test/J0/./solr.cloud.SliceStateUpdateTest-76ACA1B79F433096-001/data1-001/index' doesn't exist. Creating new index...
   [junit4]   2> 3202432 T10450 oasc.CachingDirectoryFactory.get return new directory for /Users/jenkins/workspace/Lucene-Solr-4.x-MacOSX/solr/build/solr-core/test/J0/./solr.cloud.SliceStateUpdateTest-76ACA1B79F433096-001/data1-001/index
   [junit4]   2> 3202432 T10450 oasu.RandomMergePolicy.<init> RandomMergePolicy wrapping class org.apache.lucene.index.LogDocMergePolicy: [LogDocMergePolicy: minMergeSize=1000, mergeFactor=39, maxMergeSize=9223372036854775807, maxMergeSizeForForcedMerge=9223372036854775807, calibrateSizeByDeletes=false, maxMergeDocs=2147483647, maxCFSSegmentSizeMB=8.796093022207999E12, noCFSRatio=1.0]
   [junit4]   2> 3202433 T10450 oasc.SolrDeletionPolicy.onCommit SolrDeletionPolicy.onCommit: commits: num=1
   [junit4]   2> 		commit{dir=RateLimitedDirectoryWrapper(MockDirectoryWrapper(RAMDirectory@7a25cc2b lockFactory=org.apache.lucene.store.SingleInstanceLockFactory@5e3f948f)),segFN=segments_1,generation=1}
   [junit4]   2> 3202434 T10450 oasc.SolrDeletionPolicy.updateCommits newest commit generation = 1
   [junit4]   2> 3202435 T10450 oasc.SolrCore.initWriters created xml: solr.XMLResponseWriter
   [junit4]   2> 3202440 T10450 oasup.UpdateRequestProcessorChain.init creating updateRequestProcessorChain "dedupe"
   [junit4]   2> 3202441 T10450 oasup.UpdateRequestProcessorChain.init inserting DistributedUpdateProcessorFactory into updateRequestProcessorChain "dedupe"
   [junit4]   2> 3202441 T10450 oasup.UpdateRequestProcessorChain.init creating updateRequestProcessorChain "dedupe-allfields"
   [junit4]   2> 3202442 T10450 oasup.UpdateRequestProcessorChain.init inserting DistributedUpdateProcessorFactory into updateRequestProcessorChain "dedupe-allfields"
   [junit4]   2> 3202442 T10450 oasup.UpdateRequestProcessorChain.init creating updateRequestProcessorChain "stored_sig"
   [junit4]   2> 3202442 T10450 oasup.UpdateRequestProcessorChain.init inserting DistributedUpdateProcessorFactory into updateRequestProcessorChain "stored_sig"
   [junit4]   2> 3202442 T10450 oasup.UpdateRequestProcessorChain.init creating updateRequestProcessorChain "uniq-fields"
   [junit4]   2> 3202444 T10450 oasup.UniqFieldsUpdateProcessorFactory.init WARN Use of the 'fields' init param in UniqFieldsUpdateProcessorFactory is deprecated, please use 'fieldName' (or another FieldMutatingUpdateProcessorFactory selector option) instead
   [junit4]   2> 3202444 T10450 oasup.UniqFieldsUpdateProcessorFactory.init Replacing 'fields' init param with (individual) 'fieldName' params
   [junit4]   2> 3202444 T10450 oasup.UpdateRequestProcessorChain.init inserting DistributedUpdateProcessorFactory into updateRequestProcessorChain "uniq-fields"
   [junit4]   2> 3202445 T10450 oasup.UpdateRequestProcessorChain.init creating updateRequestProcessorChain "distrib-dup-test-chain-explicit"
   [junit4]   2> 3202445 T10450 oasup.UpdateRequestProcessorChain.init creating updateRequestProcessorChain "distrib-dup-test-chain-implicit"
   [junit4]   2> 3202445 T10450 oasup.UpdateRequestProcessorChain.init inserting DistributedUpdateProcessorFactory into updateRequestProcessorChain "distrib-dup-test-chain-implicit"
   [junit4]   2> 3202446 T10450 oasc.SolrCore.loadUpdateProcessorChains no updateRequestProcessorChain defined as default, creating implicit default
   [junit4]   2> 3202446 T10450 oasc.RequestHandlers.initHandlersFromConfig adding lazy requestHandler: solr.ReplicationHandler
   [junit4]   2> 3202447 T10450 oasc.RequestHandlers.initHandlersFromConfig created /replication: solr.ReplicationHandler
   [junit4]   2> 3202448 T10450 oasc.RequestHandlers.initHandlersFromConfig created standard: solr.StandardRequestHandler
   [junit4]   2> 3202449 T10450 oasc.RequestHandlers.initHandlersFromConfig created /get: solr.RealTimeGetHandler
   [junit4]   2> 3202449 T10450 oasc.RequestHandlers.initHandlersFromConfig created dismax: solr.SearchHandler
   [junit4]   2> 3202450 T10450 oasc.RequestHandlers.initHandlersFromConfig created mock: org.apache.solr.core.MockQuerySenderListenerReqHandler
   [junit4]   2> 3202451 T10450 oasc.RequestHandlers.initHandlersFromConfig created /admin/: org.apache.solr.handler.admin.AdminHandlers
   [junit4]   2> 3202451 T10450 oasc.RequestHandlers.initHandlersFromConfig created /admin/file: solr.admin.ShowFileRequestHandler
   [junit4]   2> 3202452 T10450 oasc.RequestHandlers.initHandlersFromConfig created defaults: solr.StandardRequestHandler
   [junit4]   2> 3202452 T10450 oasc.RequestHandlers.initHandlersFromConfig adding lazy requestHandler: solr.StandardRequestHandler
   [junit4]   2> 3202452 T10450 oasc.RequestHandlers.initHandlersFromConfig created lazy: solr.StandardRequestHandler
   [junit4]   2> 3202453 T10450 oasc.RequestHandlers.initHandlersFromConfig created /update: solr.UpdateRequestHandler
   [junit4]   2> 3202454 T10450 oasc.RequestHandlers.initHandlersFromConfig created /terms: org.apache.solr.handler.component.SearchHandler
   [junit4]   2> 3202454 T10450 oasc.RequestHandlers.initHandlersFromConfig created spellCheckCompRH: org.apache.solr.handler.component.SearchHandler
   [junit4]   2> 3202455 T10450 oasc.RequestHandlers.initHandlersFromConfig created spellCheckCompRH_Direct: org.apache.solr.handler.component.SearchHandler
   [junit4]   2> 3202455 T10450 oasc.RequestHandlers.initHandlersFromConfig created spellCheckWithWordbreak: org.apache.solr.handler.component.SearchHandler
   [junit4]   2> 3202456 T10450 oasc.RequestHandlers.initHandlersFromConfig created spellCheckWithWordbreak_Direct: org.apache.solr.handler.component.SearchHandler
   [junit4]   2> 3202456 T10450 oasc.RequestHandlers.initHandlersFromConfig created spellCheckCompRH1: org.apache.solr.handler.component.SearchHandler
   [junit4]   2> 3202456 T10450 oasc.RequestHandlers.initHandlersFromConfig created mltrh: org.apache.solr.handler.component.SearchHandler
   [junit4]   2> 3202457 T10450 oasc.RequestHandlers.initHandlersFromConfig created tvrh: org.apache.solr.handler.component.SearchHandler
   [junit4]   2> 3202457 T10450 oasc.RequestHandlers.initHandlersFromConfig created /mlt: solr.MoreLikeThisHandler
   [junit4]   2> 3202458 T10450 oasc.RequestHandlers.initHandlersFromConfig created /debug/dump: solr.DumpRequestHandler
   [junit4]   2> 3202470 T10450 oashl.XMLLoader.init xsltCacheLifetimeSeconds=60
   [junit4]   2> 3202471 T10450 oasc.SolrCore.initDeprecatedSupport WARN solrconfig.xml uses deprecated <admin/gettableFiles>, Please update your config to use the ShowFileRequestHandler.
   [junit4]   2> 3202474 T10450 oasu.CommitTracker.<init> Hard AutoCommit: disabled
   [junit4]   2> 3202474 T10450 oasu.CommitTracker.<init> Soft AutoCommit: disabled
   [junit4]   2> 3202475 T10450 oasu.RandomMergePolicy.<init> RandomMergePolicy wrapping class org.apache.lucene.index.LogByteSizeMergePolicy: [LogByteSizeMergePolicy: minMergeSize=1677721, mergeFactor=45, maxMergeSize=2147483648, maxMergeSizeForForcedMerge=9223372036854775807, calibrateSizeByDeletes=false, maxMergeDocs=2147483647, maxCFSSegmentSizeMB=8.796093022207999E12, noCFSRatio=0.7179958211961186]
   [junit4]   2> 3202475 T10450 oasc.SolrDeletionPolicy.onInit SolrDeletionPolicy.onInit: commits: num=1
   [junit4]   2> 		commit{dir=RateLimitedDirectoryWrapper(MockDirectoryWrapper(RAMDirectory@7a25cc2b lockFactory=org.apache.lucene.store.SingleInstanceLockFactory@5e3f948f)),segFN=segments_1,generation=1}
   [junit4]   2> 3202476 T10450 oasc.SolrDeletionPolicy.updateCommits newest commit generation = 1
   [junit4]   2> 3202476 T10450 oass.SolrIndexSearcher.<init> Opening Searcher@783a8445[collection1] main
   [junit4]   2> 3202477 T10450 oascc.ZkStateReader.readConfigName Load collection config from:/collections/collection1
   [junit4]   2> 3202479 T10450 oascc.ZkStateReader.readConfigName path=/collections/collection1 configName=conf1 specified config exists in ZooKeeper
   [junit4]   2> 3202480 T10450 oasr.RestManager.init Initializing RestManager with initArgs: {storageIO=org.apache.solr.rest.ManagedResourceStorage$InMemoryStorageIO}
   [junit4]   2> 3202480 T10450 oasr.ManagedResourceStorage.load Reading _rest_managed.json using InMemoryStorage
   [junit4]   2> 3202480 T10450 oasr.ManagedResource.reloadFromStorage WARN No stored data found for /rest/managed
   [junit4]   2> 3202481 T10450 oasr.ManagedResource.notifyObserversDuringInit WARN No registered observers for /rest/managed
   [junit4]   2> 3202481 T10450 oasr.RestManager.init Initializing 0 registered ManagedResources
   [junit4]   2> 3202481 T10450 oashc.SpellCheckComponent.inform Initializing spell checkers
   [junit4]   2> 3202492 T10450 oass.DirectSolrSpellChecker.init init: {name=direct,classname=DirectSolrSpellChecker,field=lowerfilt,minQueryLength=3}
   [junit4]   2> 3202538 T10451 oasc.SolrCore.registerSearcher [collection1] Registered new searcher Searcher@783a8445[collection1] main{StandardDirectoryReader(segments_1:1:nrt)}
   [junit4]   2> 3202541 T10450 oasc.CoreContainer.registerCore registering core: collection1
   [junit4]   2> 3202543 T10454 oasc.ZkController.register Register replica - core:collection1 address:http://127.0.0.1:1661/solr collection:collection1 shard:shard1
   [junit4]   2> 3202544 T10432 oasc.SolrResourceLoader.locateSolrHome JNDI not configured for solr (NoInitialContextEx)
   [junit4]   2> 3202544 T10432 oasc.SolrResourceLoader.locateSolrHome using system property solr.solr.home: /Users/jenkins/workspace/Lucene-Solr

[...truncated too long message...]

ionLoss for /overseer
   [junit4]   2> 	at org.apache.solr.cloud.Overseer.createOverseerNode(Overseer.java:1287)
   [junit4]   2> 	at org.apache.solr.cloud.Overseer.getCompletedMap(Overseer.java:1256)
   [junit4]   2> 	at org.apache.solr.cloud.OverseerCollectionProcessor.<init>(OverseerCollectionProcessor.java:200)
   [junit4]   2> 	at org.apache.solr.cloud.Overseer.start(Overseer.java:1194)
   [junit4]   2> 	at org.apache.solr.cloud.OverseerElectionContext.runLeaderProcess(ElectionContext.java:529)
   [junit4]   2> 	at org.apache.solr.cloud.LeaderElector.runIamLeaderProcess(LeaderElector.java:163)
   [junit4]   2> 	at org.apache.solr.cloud.LeaderElector.checkIfIamLeader(LeaderElector.java:125)
   [junit4]   2> 	at org.apache.solr.cloud.LeaderElector.access$200(LeaderElector.java:55)
   [junit4]   2> 	at org.apache.solr.cloud.LeaderElector$ElectionWatcher.process(LeaderElector.java:357)
   [junit4]   2> 	at org.apache.zookeeper.ClientCnxn$EventThread.processEvent(ClientCnxn.java:522)
   [junit4]   2> 	at org.apache.zookeeper.ClientCnxn$EventThread.run(ClientCnxn.java:498)
   [junit4]   2> Caused by: org.apache.zookeeper.KeeperException$ConnectionLossException: KeeperErrorCode = ConnectionLoss for /overseer
   [junit4]   2> 	at org.apache.zookeeper.KeeperException.create(KeeperException.java:99)
   [junit4]   2> 	at org.apache.zookeeper.KeeperException.create(KeeperException.java:51)
   [junit4]   2> 	at org.apache.zookeeper.ZooKeeper.create(ZooKeeper.java:783)
   [junit4]   2> 	at org.apache.solr.common.cloud.SolrZkClient$9.execute(SolrZkClient.java:312)
   [junit4]   2> 	at org.apache.solr.common.cloud.SolrZkClient$9.execute(SolrZkClient.java:309)
   [junit4]   2> 	at org.apache.solr.common.cloud.ZkCmdExecutor.retryOperation(ZkCmdExecutor.java:73)
   [junit4]   2> 	at org.apache.solr.common.cloud.SolrZkClient.create(SolrZkClient.java:309)
   [junit4]   2> 	at org.apache.solr.cloud.Overseer.createOverseerNode(Overseer.java:1278)
   [junit4]   2> 	... 10 more
   [junit4]   2> 
   [junit4]   2> 3207246 T10458 oascc.ZkStateReader$3.process WARN ZooKeeper watch triggered, but Solr cannot talk to ZK
   [junit4]   2> 3207247 T10458 oasc.LeaderElector$ElectionWatcher.process WARN  org.apache.zookeeper.KeeperException$SessionExpiredException: KeeperErrorCode = Session expired for /collections/collection1/leader_elect/shard1/election
   [junit4]   2> 	at org.apache.zookeeper.KeeperException.create(KeeperException.java:127)
   [junit4]   2> 	at org.apache.zookeeper.KeeperException.create(KeeperException.java:51)
   [junit4]   2> 	at org.apache.zookeeper.ZooKeeper.getChildren(ZooKeeper.java:1472)
   [junit4]   2> 	at org.apache.solr.common.cloud.SolrZkClient$6.execute(SolrZkClient.java:260)
   [junit4]   2> 	at org.apache.solr.common.cloud.SolrZkClient$6.execute(SolrZkClient.java:257)
   [junit4]   2> 	at org.apache.solr.common.cloud.ZkCmdExecutor.retryOperation(ZkCmdExecutor.java:73)
   [junit4]   2> 	at org.apache.solr.common.cloud.SolrZkClient.getChildren(SolrZkClient.java:257)
   [junit4]   2> 	at org.apache.solr.cloud.LeaderElector.checkIfIamLeader(LeaderElector.java:94)
   [junit4]   2> 	at org.apache.solr.cloud.LeaderElector.access$200(LeaderElector.java:55)
   [junit4]   2> 	at org.apache.solr.cloud.LeaderElector$ElectionWatcher.process(LeaderElector.java:357)
   [junit4]   2> 	at org.apache.zookeeper.ClientCnxn$EventThread.processEvent(ClientCnxn.java:522)
   [junit4]   2> 	at org.apache.zookeeper.ClientCnxn$EventThread.run(ClientCnxn.java:498)
   [junit4]   2> 
   [junit4]   2> NOTE: test params are: codec=Lucene49: {}, docValues:{}, sim=DefaultSimilarity, locale=en_CA, timezone=America/Vancouver
   [junit4]   2> NOTE: Mac OS X 10.8.5 x86_64/Oracle Corporation 1.7.0_60 (64-bit)/cpus=2,threads=1,free=182455288,total=519438336
   [junit4]   2> NOTE: All tests run in this JVM: [TestSearcherReuse, QueryEqualityTest, TestCloudManagedSchema, PrimUtilsTest, TestReplicationHandler, TestDistributedSearch, TestJmxIntegration, DistributedSuggestComponentTest, TestReplicationHandlerBackup, SuggesterTSTTest, TestSolrXmlPersistence, OutputWriterTest, TestManagedSynonymFilterFactory, TestShortCircuitedRequests, TestSurroundQueryParser, SortByFunctionTest, TestElisionMultitermQuery, TestExceedMaxTermLength, TestSolrQueryParserDefaultOperatorResource, AddSchemaFieldsUpdateProcessorFactoryTest, PreAnalyzedFieldTest, DateFieldTest, TestAtomicUpdateErrorCases, TestSchemaSimilarityResource, TestRangeQuery, SolrCmdDistributorTest, TestConfig, SimplePostToolTest, EnumFieldTest, HttpPartitionTest, TestSolrXml, TestRealTimeGet, TestInitQParser, TestPostingsSolrHighlighter, TestZkChroot, BasicFunctionalityTest, CursorPagingTest, TestSearchPerf, TestIndexSearcher, HdfsWriteToMultipleCollectionsTest, DistanceFunctionTest, FullSolrCloudDistribCmdsTest, TestStressRecovery, TestQueryUtils, SSLMigrationTest, HighlighterMaxOffsetTest, ConnectionManagerTest, TestJoin, CursorMarkTest, TestCollectionAPI, FileBasedSpellCheckerTest, TestSchemaResource, TestSimpleQParserPlugin, IndexBasedSpellCheckerTest, HdfsRecoveryZkTest, TestNRTOpen, ChaosMonkeySafeLeaderTest, QueryResultKeyTest, SolrIndexSplitterTest, TestNonNRTOpen, SuggesterFSTTest, MultiTermTest, AtomicUpdatesTest, TestSolrDeletionPolicy2, SolrPluginUtilsTest, DirectUpdateHandlerTest, TestWriterPerf, TestRemoteStreaming, MergeStrategyTest, TestCollationField, HdfsUnloadDistributedZkTest, ExternalFileFieldSortTest, TestSolrIndexConfig, CoreMergeIndexesAdminHandlerTest, BJQParserTest, TestCollationFieldDocValues, JSONWriterTest, TestQuerySenderListener, TestComplexPhraseQParserPlugin, TestExpandComponent, TestCSVLoader, HighlighterTest, TestFiltering, TestExtendedDismaxParser, TestCollapseQParserPlugin, XmlUpdateRequestHandlerTest, TestNoOpRegenerator, TestBadConfig, CoreAdminRequestStatusTest, TestDynamicFieldResource, BadComponentTest, TestSerializedLuceneMatchVersion, TestPerFieldSimilarity, TestComponentsName, TestRandomDVFaceting, AddBlockUpdateTest, TestStressLucene, TestDefaultSimilarityFactory, FileUtilsTest, ShardRoutingCustomTest, MultiThreadedOCPTest, ZkNodePropsTest, DistributedTermsComponentTest, TestDocumentBuilder, TestAnalyzeInfixSuggestions, SolrCoreTest, TestBinaryResponseWriter, SearchHandlerTest, TestReRankQParserPlugin, DistributedQueryElevationComponentTest, TestCopyFieldCollectionResource, HdfsBasicDistributedZk2Test, TestDefaultSearchFieldResource, TestArbitraryIndexDir, TestManagedSchema, TestDistribDocBasedVersion, SliceStateTest, TestWordDelimiterFilterFactory, SchemaVersionSpecificBehaviorTest, RankQueryTest, TestSchemaNameResource, TestCloudInspectUtil, AlternateDirectoryTest, TestMaxScoreQueryParser, SampleTest, TestLFUCache, WordBreakSolrSpellCheckerTest, RollingRestartTest, SolrCoreCheckLockOnStartupTest, UpdateParamsTest, TestOverriddenPrefixQueryForCustomFieldType, ZkCLITest, OverseerTest, IndexSchemaTest, TestSuggestSpellingConverter, DocumentBuilderTest, DirectUpdateHandlerOptimizeTest, ConvertedLegacyTest, AsyncMigrateRouteKeyTest, SolrRequestParserTest, TestLazyCores, LukeRequestHandlerTest, OverseerRolesTest, DebugComponentTest, OpenExchangeRatesOrgProviderTest, TestFieldSortValues, AnalyticsMergeStrategyTest, DistributedQueryComponentCustomSortTest, TestRTGBase, TestDistributedGrouping, TestFieldResource, MBeansHandlerTest, MoreLikeThisHandlerTest, TestCursorMarkWithoutUniqueKey, EchoParamsTest, InfoHandlerTest, NoCacheHeaderTest, UnloadDistributedZkTest, TestManagedStopFilterFactory, HdfsDirectoryTest, SpellCheckCollatorTest, DOMUtilTest, TimeZoneUtilsTest, TestBlendedInfixSuggestions, ClusterStateTest, TestBM25SimilarityFactory, SOLR749Test, DocValuesMissingTest, TestPhraseSuggestions, TestSolrCoreProperties, DocumentAnalysisRequestHandlerTest, AssignTest, NumericFieldsTest, XsltUpdateRequestHandlerTest, DeleteReplicaTest, BinaryUpdateRequestHandlerTest, TestFuzzyAnalyzedSuggestions, TestFieldTypeResource, SignatureUpdateProcessorFactoryTest, TestMultiCoreConfBootstrap, TestStressUserVersions, TestQueryTypes, PrimitiveFieldTypeTest, TermVectorComponentTest, TestSolrXMLSerializer, CollectionsAPIDistributedZkTest, ReplicationFactorTest, LeaderElectionTest, PathHierarchyTokenizerFactoryTest, ScriptEngineTest, TestCSVResponseWriter, TestXIncludeConfig, TestSolrQueryParser, MigrateRouteKeyTest, BasicDistributedZkTest, BasicDistributedZk2Test, SyncSliceTest, OpenCloseCoreStressTest, LeaderElectionIntegrationTest, ShardRoutingTest, BasicZkTest, RecoveryZkTest, ClusterStateUpdateTest, TestRandomFaceting, ZkSolrClientTest, SliceStateUpdateTest]
   [junit4] Completed in 7.30s, 1 test, 1 error <<< FAILURES!

[...truncated 596 lines...]
BUILD FAILED
/Users/jenkins/workspace/Lucene-Solr-4.x-MacOSX/build.xml:467: The following error occurred while executing this line:
/Users/jenkins/workspace/Lucene-Solr-4.x-MacOSX/build.xml:447: The following error occurred while executing this line:
/Users/jenkins/workspace/Lucene-Solr-4.x-MacOSX/build.xml:45: The following error occurred while executing this line:
/Users/jenkins/workspace/Lucene-Solr-4.x-MacOSX/extra-targets.xml:37: The following error occurred while executing this line:
/Users/jenkins/workspace/Lucene-Solr-4.x-MacOSX/solr/build.xml:189: The following error occurred while executing this line:
/Users/jenkins/workspace/Lucene-Solr-4.x-MacOSX/solr/common-build.xml:496: The following error occurred while executing this line:
/Users/jenkins/workspace/Lucene-Solr-4.x-MacOSX/lucene/common-build.xml:1297: The following error occurred while executing this line:
/Users/jenkins/workspace/Lucene-Solr-4.x-MacOSX/lucene/common-build.xml:921: There were test failures: 404 suites, 1654 tests, 1 error, 1 failure, 42 ignored (15 assumptions)

Total time: 123 minutes 54 seconds
Build step 'Invoke Ant' marked build as failure
Description set: Java: 64bit/jdk1.7.0 -XX:-UseCompressedOops -XX:+UseConcMarkSweepGC
Archiving artifacts
Recording test results
Email was triggered for: Failure - Any
Sending email for trigger: Failure - Any



Mime
View raw message