lucene-dev mailing list archives

Site index · List index
Message view « Date » · « Thread »
Top « Date » · « Thread »
From Policeman Jenkins Server <jenk...@thetaphi.de>
Subject [JENKINS] Lucene-Solr-trunk-Linux (32bit/jdk1.7.0_60) - Build # 10570 - Still Failing!
Date Mon, 16 Jun 2014 00:35:00 GMT
Build: http://jenkins.thetaphi.de/job/Lucene-Solr-trunk-Linux/10570/
Java: 32bit/jdk1.7.0_60 -server -XX:+UseConcMarkSweepGC

4 tests failed.
FAILED:  junit.framework.TestSuite.org.apache.solr.cloud.CollectionsAPIDistributedZkTest

Error Message:
ERROR: SolrZkClient opens=19 closes=18

Stack Trace:
java.lang.AssertionError: ERROR: SolrZkClient opens=19 closes=18
	at __randomizedtesting.SeedInfo.seed([BCEE7429D618ABA4]:0)
	at org.junit.Assert.fail(Assert.java:93)
	at org.apache.solr.SolrTestCaseJ4.endTrackingZkClients(SolrTestCaseJ4.java:451)
	at org.apache.solr.SolrTestCaseJ4.afterClass(SolrTestCaseJ4.java:185)
	at sun.reflect.GeneratedMethodAccessor27.invoke(Unknown Source)
	at sun.reflect.DelegatingMethodAccessorImpl.invoke(DelegatingMethodAccessorImpl.java:43)
	at java.lang.reflect.Method.invoke(Method.java:606)
	at com.carrotsearch.randomizedtesting.RandomizedRunner.invoke(RandomizedRunner.java:1618)
	at com.carrotsearch.randomizedtesting.RandomizedRunner$5.evaluate(RandomizedRunner.java:790)
	at com.carrotsearch.randomizedtesting.rules.StatementAdapter.evaluate(StatementAdapter.java:36)
	at com.carrotsearch.randomizedtesting.rules.SystemPropertiesRestoreRule$1.evaluate(SystemPropertiesRestoreRule.java:53)
	at org.apache.lucene.util.AbstractBeforeAfterRule$1.evaluate(AbstractBeforeAfterRule.java:46)
	at org.apache.lucene.util.TestRuleStoreClassName$1.evaluate(TestRuleStoreClassName.java:42)
	at com.carrotsearch.randomizedtesting.rules.SystemPropertiesInvariantRule$1.evaluate(SystemPropertiesInvariantRule.java:55)
	at com.carrotsearch.randomizedtesting.rules.NoShadowingOrOverridesOnMethodsRule$1.evaluate(NoShadowingOrOverridesOnMethodsRule.java:39)
	at com.carrotsearch.randomizedtesting.rules.NoShadowingOrOverridesOnMethodsRule$1.evaluate(NoShadowingOrOverridesOnMethodsRule.java:39)
	at com.carrotsearch.randomizedtesting.rules.StatementAdapter.evaluate(StatementAdapter.java:36)
	at com.carrotsearch.randomizedtesting.rules.StatementAdapter.evaluate(StatementAdapter.java:36)
	at com.carrotsearch.randomizedtesting.rules.StatementAdapter.evaluate(StatementAdapter.java:36)
	at org.apache.lucene.util.TestRuleAssertionsRequired$1.evaluate(TestRuleAssertionsRequired.java:43)
	at org.apache.lucene.util.TestRuleMarkFailure$1.evaluate(TestRuleMarkFailure.java:48)
	at org.apache.lucene.util.TestRuleIgnoreAfterMaxFailures$1.evaluate(TestRuleIgnoreAfterMaxFailures.java:65)
	at org.apache.lucene.util.TestRuleIgnoreTestSuites$1.evaluate(TestRuleIgnoreTestSuites.java:55)
	at com.carrotsearch.randomizedtesting.rules.StatementAdapter.evaluate(StatementAdapter.java:36)
	at com.carrotsearch.randomizedtesting.ThreadLeakControl$StatementRunner.run(ThreadLeakControl.java:360)
	at java.lang.Thread.run(Thread.java:745)


FAILED:  junit.framework.TestSuite.org.apache.solr.cloud.CollectionsAPIDistributedZkTest

Error Message:
2 threads leaked from SUITE scope at org.apache.solr.cloud.CollectionsAPIDistributedZkTest:     1) Thread[id=3737, name=TEST-CollectionsAPIDistributedZkTest.testDistribSearch-seed#[BCEE7429D618ABA4]-EventThread, state=WAITING, group=TGRP-CollectionsAPIDistributedZkTest]         at sun.misc.Unsafe.park(Native Method)         at java.util.concurrent.locks.LockSupport.park(LockSupport.java:186)         at java.util.concurrent.locks.AbstractQueuedSynchronizer$ConditionObject.await(AbstractQueuedSynchronizer.java:2043)         at java.util.concurrent.LinkedBlockingQueue.take(LinkedBlockingQueue.java:442)         at org.apache.zookeeper.ClientCnxn$EventThread.run(ClientCnxn.java:494)    2) Thread[id=3736, name=TEST-CollectionsAPIDistributedZkTest.testDistribSearch-seed#[BCEE7429D618ABA4]-SendThread(127.0.0.1:34352), state=TIMED_WAITING, group=TGRP-CollectionsAPIDistributedZkTest]         at java.lang.Thread.sleep(Native Method)         at org.apache.zookeeper.ClientCnxn$SendThread.run(ClientCnxn.java:994)

Stack Trace:
com.carrotsearch.randomizedtesting.ThreadLeakError: 2 threads leaked from SUITE scope at org.apache.solr.cloud.CollectionsAPIDistributedZkTest: 
   1) Thread[id=3737, name=TEST-CollectionsAPIDistributedZkTest.testDistribSearch-seed#[BCEE7429D618ABA4]-EventThread, state=WAITING, group=TGRP-CollectionsAPIDistributedZkTest]
        at sun.misc.Unsafe.park(Native Method)
        at java.util.concurrent.locks.LockSupport.park(LockSupport.java:186)
        at java.util.concurrent.locks.AbstractQueuedSynchronizer$ConditionObject.await(AbstractQueuedSynchronizer.java:2043)
        at java.util.concurrent.LinkedBlockingQueue.take(LinkedBlockingQueue.java:442)
        at org.apache.zookeeper.ClientCnxn$EventThread.run(ClientCnxn.java:494)
   2) Thread[id=3736, name=TEST-CollectionsAPIDistributedZkTest.testDistribSearch-seed#[BCEE7429D618ABA4]-SendThread(127.0.0.1:34352), state=TIMED_WAITING, group=TGRP-CollectionsAPIDistributedZkTest]
        at java.lang.Thread.sleep(Native Method)
        at org.apache.zookeeper.ClientCnxn$SendThread.run(ClientCnxn.java:994)
	at __randomizedtesting.SeedInfo.seed([BCEE7429D618ABA4]:0)


FAILED:  junit.framework.TestSuite.org.apache.solr.cloud.CollectionsAPIDistributedZkTest

Error Message:
There are still zombie threads that couldn't be terminated:    1) Thread[id=3736, name=TEST-CollectionsAPIDistributedZkTest.testDistribSearch-seed#[BCEE7429D618ABA4]-SendThread(127.0.0.1:34352), state=TIMED_WAITING, group=TGRP-CollectionsAPIDistributedZkTest]         at java.lang.Thread.sleep(Native Method)         at org.apache.zookeeper.client.StaticHostProvider.next(StaticHostProvider.java:101)         at org.apache.zookeeper.ClientCnxn$SendThread.startConnect(ClientCnxn.java:940)         at org.apache.zookeeper.ClientCnxn$SendThread.run(ClientCnxn.java:1003)

Stack Trace:
com.carrotsearch.randomizedtesting.ThreadLeakError: There are still zombie threads that couldn't be terminated:
   1) Thread[id=3736, name=TEST-CollectionsAPIDistributedZkTest.testDistribSearch-seed#[BCEE7429D618ABA4]-SendThread(127.0.0.1:34352), state=TIMED_WAITING, group=TGRP-CollectionsAPIDistributedZkTest]
        at java.lang.Thread.sleep(Native Method)
        at org.apache.zookeeper.client.StaticHostProvider.next(StaticHostProvider.java:101)
        at org.apache.zookeeper.ClientCnxn$SendThread.startConnect(ClientCnxn.java:940)
        at org.apache.zookeeper.ClientCnxn$SendThread.run(ClientCnxn.java:1003)
	at __randomizedtesting.SeedInfo.seed([BCEE7429D618ABA4]:0)


REGRESSION:  org.apache.solr.cloud.CollectionsAPIDistributedZkTest.testDistribSearch

Error Message:
collection already exists: awholynewcollection_0

Stack Trace:
org.apache.solr.client.solrj.impl.HttpSolrServer$RemoteSolrException: collection already exists: awholynewcollection_0
	at __randomizedtesting.SeedInfo.seed([BCEE7429D618ABA4:3D08FA31A147CB98]:0)
	at org.apache.solr.client.solrj.impl.HttpSolrServer.executeMethod(HttpSolrServer.java:554)
	at org.apache.solr.client.solrj.impl.HttpSolrServer.request(HttpSolrServer.java:210)
	at org.apache.solr.client.solrj.impl.HttpSolrServer.request(HttpSolrServer.java:206)
	at org.apache.solr.client.solrj.impl.LBHttpSolrServer.doRequest(LBHttpSolrServer.java:340)
	at org.apache.solr.client.solrj.impl.LBHttpSolrServer.request(LBHttpSolrServer.java:301)
	at org.apache.solr.client.solrj.impl.CloudSolrServer.request(CloudSolrServer.java:659)
	at org.apache.solr.cloud.AbstractFullDistribZkTestBase.createCollection(AbstractFullDistribZkTestBase.java:1505)
	at org.apache.solr.cloud.AbstractFullDistribZkTestBase.createCollection(AbstractFullDistribZkTestBase.java:1526)
	at org.apache.solr.cloud.CollectionsAPIDistributedZkTest.testCollectionsAPI(CollectionsAPIDistributedZkTest.java:708)
	at org.apache.solr.cloud.CollectionsAPIDistributedZkTest.doTest(CollectionsAPIDistributedZkTest.java:203)
	at org.apache.solr.BaseDistributedSearchTestCase.testDistribSearch(BaseDistributedSearchTestCase.java:863)
	at sun.reflect.NativeMethodAccessorImpl.invoke0(Native Method)
	at sun.reflect.NativeMethodAccessorImpl.invoke(NativeMethodAccessorImpl.java:57)
	at sun.reflect.DelegatingMethodAccessorImpl.invoke(DelegatingMethodAccessorImpl.java:43)
	at java.lang.reflect.Method.invoke(Method.java:606)
	at com.carrotsearch.randomizedtesting.RandomizedRunner.invoke(RandomizedRunner.java:1618)
	at com.carrotsearch.randomizedtesting.RandomizedRunner$6.evaluate(RandomizedRunner.java:827)
	at com.carrotsearch.randomizedtesting.RandomizedRunner$7.evaluate(RandomizedRunner.java:863)
	at com.carrotsearch.randomizedtesting.RandomizedRunner$8.evaluate(RandomizedRunner.java:877)
	at com.carrotsearch.randomizedtesting.rules.SystemPropertiesRestoreRule$1.evaluate(SystemPropertiesRestoreRule.java:53)
	at org.apache.lucene.util.TestRuleSetupTeardownChained$1.evaluate(TestRuleSetupTeardownChained.java:50)
	at org.apache.lucene.util.AbstractBeforeAfterRule$1.evaluate(AbstractBeforeAfterRule.java:46)
	at com.carrotsearch.randomizedtesting.rules.SystemPropertiesInvariantRule$1.evaluate(SystemPropertiesInvariantRule.java:55)
	at org.apache.lucene.util.TestRuleThreadAndTestName$1.evaluate(TestRuleThreadAndTestName.java:49)
	at org.apache.lucene.util.TestRuleIgnoreAfterMaxFailures$1.evaluate(TestRuleIgnoreAfterMaxFailures.java:65)
	at org.apache.lucene.util.TestRuleMarkFailure$1.evaluate(TestRuleMarkFailure.java:48)
	at com.carrotsearch.randomizedtesting.rules.StatementAdapter.evaluate(StatementAdapter.java:36)
	at com.carrotsearch.randomizedtesting.ThreadLeakControl$StatementRunner.run(ThreadLeakControl.java:360)
	at com.carrotsearch.randomizedtesting.ThreadLeakControl.forkTimeoutingTask(ThreadLeakControl.java:793)
	at com.carrotsearch.randomizedtesting.ThreadLeakControl$3.evaluate(ThreadLeakControl.java:453)
	at com.carrotsearch.randomizedtesting.RandomizedRunner.runSingleTest(RandomizedRunner.java:836)
	at com.carrotsearch.randomizedtesting.RandomizedRunner$3.evaluate(RandomizedRunner.java:738)
	at com.carrotsearch.randomizedtesting.RandomizedRunner$4.evaluate(RandomizedRunner.java:772)
	at com.carrotsearch.randomizedtesting.RandomizedRunner$5.evaluate(RandomizedRunner.java:783)
	at com.carrotsearch.randomizedtesting.rules.StatementAdapter.evaluate(StatementAdapter.java:36)
	at com.carrotsearch.randomizedtesting.rules.SystemPropertiesRestoreRule$1.evaluate(SystemPropertiesRestoreRule.java:53)
	at org.apache.lucene.util.AbstractBeforeAfterRule$1.evaluate(AbstractBeforeAfterRule.java:46)
	at org.apache.lucene.util.TestRuleStoreClassName$1.evaluate(TestRuleStoreClassName.java:42)
	at com.carrotsearch.randomizedtesting.rules.SystemPropertiesInvariantRule$1.evaluate(SystemPropertiesInvariantRule.java:55)
	at com.carrotsearch.randomizedtesting.rules.NoShadowingOrOverridesOnMethodsRule$1.evaluate(NoShadowingOrOverridesOnMethodsRule.java:39)
	at com.carrotsearch.randomizedtesting.rules.NoShadowingOrOverridesOnMethodsRule$1.evaluate(NoShadowingOrOverridesOnMethodsRule.java:39)
	at com.carrotsearch.randomizedtesting.rules.StatementAdapter.evaluate(StatementAdapter.java:36)
	at com.carrotsearch.randomizedtesting.rules.StatementAdapter.evaluate(StatementAdapter.java:36)
	at com.carrotsearch.randomizedtesting.rules.StatementAdapter.evaluate(StatementAdapter.java:36)
	at org.apache.lucene.util.TestRuleAssertionsRequired$1.evaluate(TestRuleAssertionsRequired.java:43)
	at org.apache.lucene.util.TestRuleMarkFailure$1.evaluate(TestRuleMarkFailure.java:48)
	at org.apache.lucene.util.TestRuleIgnoreAfterMaxFailures$1.evaluate(TestRuleIgnoreAfterMaxFailures.java:65)
	at org.apache.lucene.util.TestRuleIgnoreTestSuites$1.evaluate(TestRuleIgnoreTestSuites.java:55)
	at com.carrotsearch.randomizedtesting.rules.StatementAdapter.evaluate(StatementAdapter.java:36)
	at com.carrotsearch.randomizedtesting.ThreadLeakControl$StatementRunner.run(ThreadLeakControl.java:360)
	at java.lang.Thread.run(Thread.java:745)




Build Log:
[...truncated 11323 lines...]
   [junit4] Suite: org.apache.solr.cloud.CollectionsAPIDistributedZkTest
   [junit4]   2> Creating dataDir: /mnt/ssd/jenkins/workspace/Lucene-Solr-trunk-Linux/solr/build/solr-core/test/J0/./temp/solr.cloud.CollectionsAPIDistributedZkTest-BCEE7429D618ABA4-001/init-core-data-001
   [junit4]   2> 837439 T3575 oas.SolrTestCaseJ4.buildSSLConfig Randomized ssl (true) and clientAuth (true)
   [junit4]   2> 837440 T3575 oas.BaseDistributedSearchTestCase.initHostContext Setting hostContext system property: /
   [junit4]   2> 837443 T3575 oas.SolrTestCaseJ4.setUp ###Starting testDistribSearch
   [junit4]   2> 837444 T3575 oasc.ZkTestServer.run STARTING ZK TEST SERVER
   [junit4]   1> client port:0.0.0.0/0.0.0.0:0
   [junit4]   2> 837444 T3576 oasc.ZkTestServer$ZKServerMain.runFromConfig Starting server
   [junit4]   2> 837544 T3575 oasc.ZkTestServer.run start zk server on port:34352
   [junit4]   2> 837545 T3575 oascc.ConnectionManager.waitForConnected Waiting for client to connect to ZooKeeper
   [junit4]   2> 845583 T3579 oazsp.FileTxnLog.commit WARN fsync-ing the write ahead log in SyncThread:0 took 8036ms which will adversely effect operation latency. See the ZooKeeper troubleshooting guide
   [junit4]   2> 845587 T3582 oascc.ConnectionManager.process Watcher org.apache.solr.common.cloud.ConnectionManager@1b93f38 name:ZooKeeperConnection Watcher:127.0.0.1:34352 got event WatchedEvent state:SyncConnected type:None path:null path:null type:None
   [junit4]   2> 845588 T3575 oascc.ConnectionManager.waitForConnected Client is connected to ZooKeeper
   [junit4]   2> 845588 T3575 oascc.SolrZkClient.makePath makePath: /solr
   [junit4]   2> 845627 T3575 oascc.ConnectionManager.waitForConnected Waiting for client to connect to ZooKeeper
   [junit4]   2> 845646 T3584 oascc.ConnectionManager.process Watcher org.apache.solr.common.cloud.ConnectionManager@1341556 name:ZooKeeperConnection Watcher:127.0.0.1:34352/solr got event WatchedEvent state:SyncConnected type:None path:null path:null type:None
   [junit4]   2> 845646 T3575 oascc.ConnectionManager.waitForConnected Client is connected to ZooKeeper
   [junit4]   2> 845647 T3575 oascc.SolrZkClient.makePath makePath: /collections/collection1
   [junit4]   2> 845686 T3575 oascc.SolrZkClient.makePath makePath: /collections/collection1/shards
   [junit4]   2> 845706 T3575 oascc.SolrZkClient.makePath makePath: /collections/control_collection
   [junit4]   2> 845726 T3575 oascc.SolrZkClient.makePath makePath: /collections/control_collection/shards
   [junit4]   2> 845746 T3575 oasc.AbstractZkTestCase.putConfig put /mnt/ssd/jenkins/workspace/Lucene-Solr-trunk-Linux/solr/core/src/test-files/solr/collection1/conf/solrconfig-tlog.xml to /configs/conf1/solrconfig.xml
   [junit4]   2> 845747 T3575 oascc.SolrZkClient.makePath makePath: /configs/conf1/solrconfig.xml
   [junit4]   2> 846882 T3579 oazsp.FileTxnLog.commit WARN fsync-ing the write ahead log in SyncThread:0 took 1095ms which will adversely effect operation latency. See the ZooKeeper troubleshooting guide
   [junit4]   2> 846883 T3575 oasc.AbstractZkTestCase.putConfig put /mnt/ssd/jenkins/workspace/Lucene-Solr-trunk-Linux/solr/core/src/test-files/solr/collection1/conf/schema.xml to /configs/conf1/schema.xml
   [junit4]   2> 846884 T3575 oascc.SolrZkClient.makePath makePath: /configs/conf1/schema.xml
   [junit4]   2> 846887 T3575 oasc.AbstractZkTestCase.putConfig put /mnt/ssd/jenkins/workspace/Lucene-Solr-trunk-Linux/solr/core/src/test-files/solr/collection1/conf/solrconfig.snippet.randomindexconfig.xml to /configs/conf1/solrconfig.snippet.randomindexconfig.xml
   [junit4]   2> 846887 T3575 oascc.SolrZkClient.makePath makePath: /configs/conf1/solrconfig.snippet.randomindexconfig.xml
   [junit4]   2> 846889 T3575 oasc.AbstractZkTestCase.putConfig put /mnt/ssd/jenkins/workspace/Lucene-Solr-trunk-Linux/solr/core/src/test-files/solr/collection1/conf/stopwords.txt to /configs/conf1/stopwords.txt
   [junit4]   2> 846890 T3575 oascc.SolrZkClient.makePath makePath: /configs/conf1/stopwords.txt
   [junit4]   2> 846892 T3575 oasc.AbstractZkTestCase.putConfig put /mnt/ssd/jenkins/workspace/Lucene-Solr-trunk-Linux/solr/core/src/test-files/solr/collection1/conf/protwords.txt to /configs/conf1/protwords.txt
   [junit4]   2> 846892 T3575 oascc.SolrZkClient.makePath makePath: /configs/conf1/protwords.txt
   [junit4]   2> 846894 T3575 oasc.AbstractZkTestCase.putConfig put /mnt/ssd/jenkins/workspace/Lucene-Solr-trunk-Linux/solr/core/src/test-files/solr/collection1/conf/currency.xml to /configs/conf1/currency.xml
   [junit4]   2> 846895 T3575 oascc.SolrZkClient.makePath makePath: /configs/conf1/currency.xml
   [junit4]   2> 846896 T3575 oasc.AbstractZkTestCase.putConfig put /mnt/ssd/jenkins/workspace/Lucene-Solr-trunk-Linux/solr/core/src/test-files/solr/collection1/conf/enumsConfig.xml to /configs/conf1/enumsConfig.xml
   [junit4]   2> 846897 T3575 oascc.SolrZkClient.makePath makePath: /configs/conf1/enumsConfig.xml
   [junit4]   2> 846899 T3575 oasc.AbstractZkTestCase.putConfig put /mnt/ssd/jenkins/workspace/Lucene-Solr-trunk-Linux/solr/core/src/test-files/solr/collection1/conf/open-exchange-rates.json to /configs/conf1/open-exchange-rates.json
   [junit4]   2> 846900 T3575 oascc.SolrZkClient.makePath makePath: /configs/conf1/open-exchange-rates.json
   [junit4]   2> 846902 T3575 oasc.AbstractZkTestCase.putConfig put /mnt/ssd/jenkins/workspace/Lucene-Solr-trunk-Linux/solr/core/src/test-files/solr/collection1/conf/mapping-ISOLatin1Accent.txt to /configs/conf1/mapping-ISOLatin1Accent.txt
   [junit4]   2> 846902 T3575 oascc.SolrZkClient.makePath makePath: /configs/conf1/mapping-ISOLatin1Accent.txt
   [junit4]   2> 846905 T3575 oasc.AbstractZkTestCase.putConfig put /mnt/ssd/jenkins/workspace/Lucene-Solr-trunk-Linux/solr/core/src/test-files/solr/collection1/conf/old_synonyms.txt to /configs/conf1/old_synonyms.txt
   [junit4]   2> 846906 T3575 oascc.SolrZkClient.makePath makePath: /configs/conf1/old_synonyms.txt
   [junit4]   2> 846908 T3575 oasc.AbstractZkTestCase.putConfig put /mnt/ssd/jenkins/workspace/Lucene-Solr-trunk-Linux/solr/core/src/test-files/solr/collection1/conf/synonyms.txt to /configs/conf1/synonyms.txt
   [junit4]   2> 846908 T3575 oascc.SolrZkClient.makePath makePath: /configs/conf1/synonyms.txt
   [junit4]   2> 846911 T3575 oascc.ConnectionManager.waitForConnected Waiting for client to connect to ZooKeeper
   [junit4]   2> 846912 T3586 oascc.ConnectionManager.process Watcher org.apache.solr.common.cloud.ConnectionManager@fd2db6 name:ZooKeeperConnection Watcher:127.0.0.1:34352/solr got event WatchedEvent state:SyncConnected type:None path:null path:null type:None
   [junit4]   2> 846912 T3575 oascc.ConnectionManager.waitForConnected Client is connected to ZooKeeper
   [junit4]   2> Using old style solr.xml
   [junit4]   2> 846914 T3575 oascc.ConnectionManager.waitForConnected Waiting for client to connect to ZooKeeper
   [junit4]   2> 846915 T3588 oascc.ConnectionManager.process Watcher org.apache.solr.common.cloud.ConnectionManager@182efe9 name:ZooKeeperConnection Watcher:127.0.0.1:34352 got event WatchedEvent state:SyncConnected type:None path:null path:null type:None
   [junit4]   2> 846915 T3575 oascc.ConnectionManager.waitForConnected Client is connected to ZooKeeper
   [junit4]   2> 846915 T3575 oascc.SolrZkClient.makePath makePath: /solr
   [junit4]   2> 846917 T3575 oascc.ConnectionManager.waitForConnected Waiting for client to connect to ZooKeeper
   [junit4]   2> 846918 T3590 oascc.ConnectionManager.process Watcher org.apache.solr.common.cloud.ConnectionManager@aba32d name:ZooKeeperConnection Watcher:127.0.0.1:34352/solr got event WatchedEvent state:SyncConnected type:None path:null path:null type:None
   [junit4]   2> 846918 T3575 oascc.ConnectionManager.waitForConnected Client is connected to ZooKeeper
   [junit4]   2> 846919 T3575 oasc.AbstractZkTestCase.putConfig put /mnt/ssd/jenkins/workspace/Lucene-Solr-trunk-Linux/solr/core/src/test-files/solr/collection1/conf/solrconfig.xml to /configs/conf2/solrconfig.xml
   [junit4]   2> 846919 T3575 oascc.SolrZkClient.makePath makePath: /configs/conf2/solrconfig.xml
   [junit4]   2> 846922 T3575 oasc.AbstractZkTestCase.putConfig put /mnt/ssd/jenkins/workspace/Lucene-Solr-trunk-Linux/solr/core/src/test-files/solr/collection1/conf/schema.xml to /configs/conf2/schema.xml
   [junit4]   2> 846922 T3575 oascc.SolrZkClient.makePath makePath: /configs/conf2/schema.xml
   [junit4]   2> 846925 T3575 oasc.AbstractZkTestCase.putConfig put /mnt/ssd/jenkins/workspace/Lucene-Solr-trunk-Linux/solr/core/src/test-files/solr/collection1/conf/solrconfig.snippet.randomindexconfig.xml to /configs/conf2/solrconfig.snippet.randomindexconfig.xml
   [junit4]   2> 846926 T3575 oascc.SolrZkClient.makePath makePath: /configs/conf2/solrconfig.snippet.randomindexconfig.xml
   [junit4]   2> 846927 T3575 oasc.AbstractZkTestCase.putConfig put /mnt/ssd/jenkins/workspace/Lucene-Solr-trunk-Linux/solr/core/src/test-files/solr/collection1/conf/stopwords.txt to /configs/conf2/stopwords.txt
   [junit4]   2> 846927 T3575 oascc.SolrZkClient.makePath makePath: /configs/conf2/stopwords.txt
   [junit4]   2> 846929 T3575 oasc.AbstractZkTestCase.putConfig put /mnt/ssd/jenkins/workspace/Lucene-Solr-trunk-Linux/solr/core/src/test-files/solr/collection1/conf/protwords.txt to /configs/conf2/protwords.txt
   [junit4]   2> 846929 T3575 oascc.SolrZkClient.makePath makePath: /configs/conf2/protwords.txt
   [junit4]   2> 846931 T3575 oasc.AbstractZkTestCase.putConfig put /mnt/ssd/jenkins/workspace/Lucene-Solr-trunk-Linux/solr/core/src/test-files/solr/collection1/conf/currency.xml to /configs/conf2/currency.xml
   [junit4]   2> 846932 T3575 oascc.SolrZkClient.makePath makePath: /configs/conf2/currency.xml
   [junit4]   2> 846933 T3575 oasc.AbstractZkTestCase.putConfig put /mnt/ssd/jenkins/workspace/Lucene-Solr-trunk-Linux/solr/core/src/test-files/solr/collection1/conf/open-exchange-rates.json to /configs/conf2/open-exchange-rates.json
   [junit4]   2> 846934 T3575 oascc.SolrZkClient.makePath makePath: /configs/conf2/open-exchange-rates.json
   [junit4]   2> 846935 T3575 oasc.AbstractZkTestCase.putConfig put /mnt/ssd/jenkins/workspace/Lucene-Solr-trunk-Linux/solr/core/src/test-files/solr/collection1/conf/mapping-ISOLatin1Accent.txt to /configs/conf2/mapping-ISOLatin1Accent.txt
   [junit4]   2> 846935 T3575 oascc.SolrZkClient.makePath makePath: /configs/conf2/mapping-ISOLatin1Accent.txt
   [junit4]   2> 846938 T3575 oasc.AbstractZkTestCase.putConfig put /mnt/ssd/jenkins/workspace/Lucene-Solr-trunk-Linux/solr/core/src/test-files/solr/collection1/conf/old_synonyms.txt to /configs/conf2/old_synonyms.txt
   [junit4]   2> 846938 T3575 oascc.SolrZkClient.makePath makePath: /configs/conf2/old_synonyms.txt
   [junit4]   2> 846940 T3575 oasc.AbstractZkTestCase.putConfig put /mnt/ssd/jenkins/workspace/Lucene-Solr-trunk-Linux/solr/core/src/test-files/solr/collection1/conf/synonyms.txt to /configs/conf2/synonyms.txt
   [junit4]   2> 846940 T3575 oascc.SolrZkClient.makePath makePath: /configs/conf2/synonyms.txt
   [junit4]   2> 846942 T3575 oasc.AbstractZkTestCase.putConfig put /mnt/ssd/jenkins/workspace/Lucene-Solr-trunk-Linux/solr/core/src/test-files/solr/collection1/conf/elevate.xml to /configs/conf2/elevate.xml
   [junit4]   2> 846942 T3575 oascc.SolrZkClient.makePath makePath: /configs/conf2/elevate.xml
   [junit4]   2> 847171 T3575 oejs.Server.doStart jetty-8.1.10.v20130312
   [junit4]   2> 847179 T3575 oejus.SslContextFactory.doStart Enabled Protocols [SSLv2Hello, SSLv3, TLSv1, TLSv1.1, TLSv1.2] of [SSLv2Hello, SSLv3, TLSv1, TLSv1.1, TLSv1.2]
   [junit4]   2> 847181 T3575 oejs.AbstractConnector.doStart Started SslSelectChannelConnector@127.0.0.1:40216
   [junit4]   2> 847182 T3575 oass.SolrDispatchFilter.init SolrDispatchFilter.init()
   [junit4]   2> 847183 T3575 oasc.SolrResourceLoader.locateSolrHome JNDI not configured for solr (NoInitialContextEx)
   [junit4]   2> 847183 T3575 oasc.SolrResourceLoader.locateSolrHome using system property solr.solr.home: ../../../../../../../../../../mnt/ssd/jenkins/workspace/Lucene-Solr-trunk-Linux/solr/build/solr-core/test/J0/./temp/solr.cloud.CollectionsAPIDistributedZkTest-BCEE7429D618ABA4-001/tempDir-002
   [junit4]   2> 847183 T3575 oasc.SolrResourceLoader.<init> new SolrResourceLoader for directory: '../../../../../../../../../../mnt/ssd/jenkins/workspace/Lucene-Solr-trunk-Linux/solr/build/solr-core/test/J0/./temp/solr.cloud.CollectionsAPIDistributedZkTest-BCEE7429D618ABA4-001/tempDir-002/'
   [junit4]   2> 847194 T3575 oasc.ConfigSolr.fromFile Loading container configuration from /mnt/ssd/jenkins/workspace/Lucene-Solr-trunk-Linux/solr/build/solr-core/test/J0/../../../../../../../../../../mnt/ssd/jenkins/workspace/Lucene-Solr-trunk-Linux/solr/build/solr-core/test/J0/./temp/solr.cloud.CollectionsAPIDistributedZkTest-BCEE7429D618ABA4-001/tempDir-002/solr.xml
   [junit4]   2> 847216 T3575 oasc.CoreContainer.<init> New CoreContainer 17695539
   [junit4]   2> 847217 T3575 oasc.CoreContainer.load Loading cores into CoreContainer [instanceDir=../../../../../../../../../../mnt/ssd/jenkins/workspace/Lucene-Solr-trunk-Linux/solr/build/solr-core/test/J0/./temp/solr.cloud.CollectionsAPIDistributedZkTest-BCEE7429D618ABA4-001/tempDir-002/]
   [junit4]   2> 847217 T3575 oashc.HttpShardHandlerFactory.getParameter Setting socketTimeout to: 120000
   [junit4]   2> 847218 T3575 oashc.HttpShardHandlerFactory.getParameter Setting urlScheme to: null
   [junit4]   2> 847218 T3575 oashc.HttpShardHandlerFactory.getParameter Setting connTimeout to: 15000
   [junit4]   2> 847218 T3575 oashc.HttpShardHandlerFactory.getParameter Setting maxConnectionsPerHost to: 20
   [junit4]   2> 847218 T3575 oashc.HttpShardHandlerFactory.getParameter Setting corePoolSize to: 0
   [junit4]   2> 847219 T3575 oashc.HttpShardHandlerFactory.getParameter Setting maximumPoolSize to: 2147483647
   [junit4]   2> 847219 T3575 oashc.HttpShardHandlerFactory.getParameter Setting maxThreadIdleTime to: 5
   [junit4]   2> 847219 T3575 oashc.HttpShardHandlerFactory.getParameter Setting sizeOfQueue to: -1
   [junit4]   2> 847219 T3575 oashc.HttpShardHandlerFactory.getParameter Setting fairnessPolicy to: false
   [junit4]   2> 847221 T3575 oasl.LogWatcher.createWatcher SLF4J impl is org.slf4j.impl.Log4jLoggerFactory
   [junit4]   2> 847222 T3575 oasl.LogWatcher.newRegisteredLogWatcher Registering Log Listener [Log4j (org.slf4j.impl.Log4jLoggerFactory)]
   [junit4]   2> 847222 T3575 oasc.CoreContainer.load Host Name: 127.0.0.1
   [junit4]   2> 847222 T3575 oasc.ZkContainer.initZooKeeper Zookeeper client=127.0.0.1:34352/solr
   [junit4]   2> 847223 T3575 oasc.ZkController.checkChrootPath zkHost includes chroot
   [junit4]   2> 847223 T3575 oascc.ConnectionManager.waitForConnected Waiting for client to connect to ZooKeeper
   [junit4]   2> 847225 T3601 oascc.ConnectionManager.process Watcher org.apache.solr.common.cloud.ConnectionManager@b9ef79 name:ZooKeeperConnection Watcher:127.0.0.1:34352 got event WatchedEvent state:SyncConnected type:None path:null path:null type:None
   [junit4]   2> 847226 T3575 oascc.ConnectionManager.waitForConnected Client is connected to ZooKeeper
   [junit4]   2> 847228 T3575 oascc.ConnectionManager.waitForConnected Waiting for client to connect to ZooKeeper
   [junit4]   2> 847229 T3603 oascc.ConnectionManager.process Watcher org.apache.solr.common.cloud.ConnectionManager@a8c9c2 name:ZooKeeperConnection Watcher:127.0.0.1:34352/solr got event WatchedEvent state:SyncConnected type:None path:null path:null type:None
   [junit4]   2> 847229 T3575 oascc.ConnectionManager.waitForConnected Client is connected to ZooKeeper
   [junit4]   2> 847230 T3575 oascc.SolrZkClient.makePath makePath: /overseer/queue
   [junit4]   2> 847234 T3575 oascc.SolrZkClient.makePath makePath: /overseer/collection-queue-work
   [junit4]   2> 847237 T3575 oascc.SolrZkClient.makePath makePath: /overseer/collection-map-running
   [junit4]   2> 847239 T3575 oascc.SolrZkClient.makePath makePath: /overseer/collection-map-completed
   [junit4]   2> 847242 T3575 oascc.SolrZkClient.makePath makePath: /overseer/collection-map-failure
   [junit4]   2> 847244 T3575 oascc.SolrZkClient.makePath makePath: /live_nodes
   [junit4]   2> 847246 T3575 oasc.ZkController.createEphemeralLiveNode Register node as live in ZooKeeper:/live_nodes/127.0.0.1:40216_
   [junit4]   2> 847247 T3575 oascc.SolrZkClient.makePath makePath: /live_nodes/127.0.0.1:40216_
   [junit4]   2> 847249 T3575 oascc.SolrZkClient.makePath makePath: /overseer_elect
   [junit4]   2> 847250 T3575 oascc.SolrZkClient.makePath makePath: /overseer_elect/election
   [junit4]   2> 847253 T3575 oasc.OverseerElectionContext.runLeaderProcess I am going to be the leader 127.0.0.1:40216_
   [junit4]   2> 847253 T3575 oascc.SolrZkClient.makePath makePath: /overseer_elect/leader
   [junit4]   2> 847255 T3575 oasc.Overseer.start Overseer (id=91939059801784326-127.0.0.1:40216_-n_0000000000) starting
   [junit4]   2> 847258 T3575 oascc.SolrZkClient.makePath makePath: /overseer/queue-work
   [junit4]   2> 847279 T3575 oascc.SolrZkClient.makePath makePath: /clusterstate.json
   [junit4]   2> 847279 T3605 oasc.OverseerCollectionProcessor.run Process current queue of collection creations
   [junit4]   2> 847282 T3575 oascc.SolrZkClient.makePath makePath: /aliases.json
   [junit4]   2> 847283 T3575 oascc.ZkStateReader.createClusterStateWatchersAndUpdate Updating cluster state from ZooKeeper... 
   [junit4]   2> 847285 T3604 oasc.Overseer$ClusterStateUpdater.run Starting to work on the main queue
   [junit4]   2> 847288 T3575 oass.SolrDispatchFilter.init user.dir=/mnt/ssd/jenkins/workspace/Lucene-Solr-trunk-Linux/solr/build/solr-core/test/J0
   [junit4]   2> 847288 T3575 oass.SolrDispatchFilter.init SolrDispatchFilter.init() done
   [junit4]   2> 847291 T3575 oascc.ConnectionManager.waitForConnected Waiting for client to connect to ZooKeeper
   [junit4]   2> 847292 T3608 oascc.ConnectionManager.process Watcher org.apache.solr.common.cloud.ConnectionManager@1a3970f name:ZooKeeperConnection Watcher:127.0.0.1:34352/solr got event WatchedEvent state:SyncConnected type:None path:null path:null type:None
   [junit4]   2> 847292 T3575 oascc.ConnectionManager.waitForConnected Client is connected to ZooKeeper
   [junit4]   2> 847293 T3575 oascc.ZkStateReader.createClusterStateWatchersAndUpdate Updating cluster state from ZooKeeper... 
   [junit4]   2> 847294 T3575 oasc.ChaosMonkey.monkeyLog monkey: init - expire sessions:false cause connection loss:false
   [junit4]   2> 847532 T3575 oasc.AbstractFullDistribZkTestBase.createJettys create jetty 1
   [junit4]   2> 847533 T3575 oejs.Server.doStart jetty-8.1.10.v20130312
   [junit4]   2> 847536 T3575 oejus.SslContextFactory.doStart Enabled Protocols [SSLv2Hello, SSLv3, TLSv1, TLSv1.1, TLSv1.2] of [SSLv2Hello, SSLv3, TLSv1, TLSv1.1, TLSv1.2]
   [junit4]   2> 847536 T3575 oejs.AbstractConnector.doStart Started SslSelectChannelConnector@127.0.0.1:46091
   [junit4]   2> 847538 T3575 oass.SolrDispatchFilter.init SolrDispatchFilter.init()
   [junit4]   2> 847539 T3575 oasc.SolrResourceLoader.locateSolrHome JNDI not configured for solr (NoInitialContextEx)
   [junit4]   2> 847539 T3575 oasc.SolrResourceLoader.locateSolrHome using system property solr.solr.home: /mnt/ssd/jenkins/workspace/Lucene-Solr-trunk-Linux/solr/build/solr-core/test/J0/./temp/solr.cloud.CollectionsAPIDistributedZkTest-BCEE7429D618ABA4-001/tempDir-003
   [junit4]   2> 847539 T3575 oasc.SolrResourceLoader.<init> new SolrResourceLoader for directory: '/mnt/ssd/jenkins/workspace/Lucene-Solr-trunk-Linux/solr/build/solr-core/test/J0/./temp/solr.cloud.CollectionsAPIDistributedZkTest-BCEE7429D618ABA4-001/tempDir-003/'
   [junit4]   2> 847549 T3575 oasc.ConfigSolr.fromFile Loading container configuration from /mnt/ssd/jenkins/workspace/Lucene-Solr-trunk-Linux/solr/build/solr-core/test/J0/./temp/solr.cloud.CollectionsAPIDistributedZkTest-BCEE7429D618ABA4-001/tempDir-003/solr.xml
   [junit4]   2> 847571 T3575 oasc.CoreContainer.<init> New CoreContainer 27253816
   [junit4]   2> 847571 T3575 oasc.CoreContainer.load Loading cores into CoreContainer [instanceDir=/mnt/ssd/jenkins/workspace/Lucene-Solr-trunk-Linux/solr/build/solr-core/test/J0/./temp/solr.cloud.CollectionsAPIDistributedZkTest-BCEE7429D618ABA4-001/tempDir-003/]
   [junit4]   2> 847578 T3575 oashc.HttpShardHandlerFactory.getParameter Setting socketTimeout to: 120000
   [junit4]   2> 847579 T3575 oashc.HttpShardHandlerFactory.getParameter Setting urlScheme to: null
   [junit4]   2> 847579 T3575 oashc.HttpShardHandlerFactory.getParameter Setting connTimeout to: 15000
   [junit4]   2> 847579 T3575 oashc.HttpShardHandlerFactory.getParameter Setting maxConnectionsPerHost to: 20
   [junit4]   2> 847579 T3575 oashc.HttpShardHandlerFactory.getParameter Setting corePoolSize to: 0
   [junit4]   2> 847580 T3575 oashc.HttpShardHandlerFactory.getParameter Setting maximumPoolSize to: 2147483647
   [junit4]   2> 847580 T3575 oashc.HttpShardHandlerFactory.getParameter Setting maxThreadIdleTime to: 5
   [junit4]   2> 847580 T3575 oashc.HttpShardHandlerFactory.getParameter Setting sizeOfQueue to: -1
   [junit4]   2> 847580 T3575 oashc.HttpShardHandlerFactory.getParameter Setting fairnessPolicy to: false
   [junit4]   2> 847582 T3575 oasl.LogWatcher.createWatcher SLF4J impl is org.slf4j.impl.Log4jLoggerFactory
   [junit4]   2> 847583 T3575 oasl.LogWatcher.newRegisteredLogWatcher Registering Log Listener [Log4j (org.slf4j.impl.Log4jLoggerFactory)]
   [junit4]   2> 847583 T3575 oasc.CoreContainer.load Host Name: 127.0.0.1
   [junit4]   2> 847583 T3575 oasc.ZkContainer.initZooKeeper Zookeeper client=127.0.0.1:34352/solr
   [junit4]   2> 847584 T3575 oasc.ZkController.checkChrootPath zkHost includes chroot
   [junit4]   2> 847584 T3575 oascc.ConnectionManager.waitForConnected Waiting for client to connect to ZooKeeper
   [junit4]   2> 847586 T3619 oascc.ConnectionManager.process Watcher org.apache.solr.common.cloud.ConnectionManager@1830345 name:ZooKeeperConnection Watcher:127.0.0.1:34352 got event WatchedEvent state:SyncConnected type:None path:null path:null type:None
   [junit4]   2> 847586 T3575 oascc.ConnectionManager.waitForConnected Client is connected to ZooKeeper
   [junit4]   2> 847588 T3575 oascc.ConnectionManager.waitForConnected Waiting for client to connect to ZooKeeper
   [junit4]   2> 847589 T3621 oascc.ConnectionManager.process Watcher org.apache.solr.common.cloud.ConnectionManager@1210502 name:ZooKeeperConnection Watcher:127.0.0.1:34352/solr got event WatchedEvent state:SyncConnected type:None path:null path:null type:None
   [junit4]   2> 847589 T3575 oascc.ConnectionManager.waitForConnected Client is connected to ZooKeeper
   [junit4]   2> 847594 T3575 oascc.ZkStateReader.createClusterStateWatchersAndUpdate Updating cluster state from ZooKeeper... 
   [junit4]   2> 848595 T3575 oasc.ZkController.createEphemeralLiveNode Register node as live in ZooKeeper:/live_nodes/127.0.0.1:46091_
   [junit4]   2> 848597 T3575 oascc.SolrZkClient.makePath makePath: /live_nodes/127.0.0.1:46091_
   [junit4]   2> 848604 T3575 oass.SolrDispatchFilter.init user.dir=/mnt/ssd/jenkins/workspace/Lucene-Solr-trunk-Linux/solr/build/solr-core/test/J0
   [junit4]   2> 848604 T3575 oass.SolrDispatchFilter.init SolrDispatchFilter.init() done
   [junit4]   2> 848843 T3575 oasc.AbstractFullDistribZkTestBase.createJettys create jetty 2
   [junit4]   2> 848843 T3575 oejs.Server.doStart jetty-8.1.10.v20130312
   [junit4]   2> 848846 T3575 oejus.SslContextFactory.doStart Enabled Protocols [SSLv2Hello, SSLv3, TLSv1, TLSv1.1, TLSv1.2] of [SSLv2Hello, SSLv3, TLSv1, TLSv1.1, TLSv1.2]
   [junit4]   2> 848847 T3575 oejs.AbstractConnector.doStart Started SslSelectChannelConnector@127.0.0.1:32782
   [junit4]   2> 848848 T3575 oass.SolrDispatchFilter.init SolrDispatchFilter.init()
   [junit4]   2> 848849 T3575 oasc.SolrResourceLoader.locateSolrHome JNDI not configured for solr (NoInitialContextEx)
   [junit4]   2> 848849 T3575 oasc.SolrResourceLoader.locateSolrHome using system property solr.solr.home: /mnt/ssd/jenkins/workspace/Lucene-Solr-trunk-Linux/solr/build/solr-core/test/J0/./temp/solr.cloud.CollectionsAPIDistributedZkTest-BCEE7429D618ABA4-001/tempDir-004
   [junit4]   2> 848849 T3575 oasc.SolrResourceLoader.<init> new SolrResourceLoader for directory: '/mnt/ssd/jenkins/workspace/Lucene-Solr-trunk-Linux/solr/build/solr-core/test/J0/./temp/solr.cloud.CollectionsAPIDistributedZkTest-BCEE7429D618ABA4-001/tempDir-004/'
   [junit4]   2> 848859 T3575 oasc.ConfigSolr.fromFile Loading container configuration from /mnt/ssd/jenkins/workspace/Lucene-Solr-trunk-Linux/solr/build/solr-core/test/J0/./temp/solr.cloud.CollectionsAPIDistributedZkTest-BCEE7429D618ABA4-001/tempDir-004/solr.xml
   [junit4]   2> 848881 T3575 oasc.CoreContainer.<init> New CoreContainer 7533947
   [junit4]   2> 848882 T3575 oasc.CoreContainer.load Loading cores into CoreContainer [instanceDir=/mnt/ssd/jenkins/workspace/Lucene-Solr-trunk-Linux/solr/build/solr-core/test/J0/./temp/solr.cloud.CollectionsAPIDistributedZkTest-BCEE7429D618ABA4-001/tempDir-004/]
   [junit4]   2> 848882 T3575 oashc.HttpShardHandlerFactory.getParameter Setting socketTimeout to: 120000
   [junit4]   2> 848883 T3575 oashc.HttpShardHandlerFactory.getParameter Setting urlScheme to: null
   [junit4]   2> 848883 T3575 oashc.HttpShardHandlerFactory.getParameter Setting connTimeout to: 15000
   [junit4]   2> 848883 T3575 oashc.HttpShardHandlerFactory.getParameter Setting maxConnectionsPerHost to: 20
   [junit4]   2> 848883 T3575 oashc.HttpShardHandlerFactory.getParameter Setting corePoolSize to: 0
   [junit4]   2> 848884 T3575 oashc.HttpShardHandlerFactory.getParameter Setting maximumPoolSize to: 2147483647
   [junit4]   2> 848884 T3575 oashc.HttpShardHandlerFactory.getParameter Setting maxThreadIdleTime to: 5
   [junit4]   2> 848884 T3575 oashc.HttpShardHandlerFactory.getParameter Setting sizeOfQueue to: -1
   [junit4]   2> 848884 T3575 oashc.HttpShardHandlerFactory.getParameter Setting fairnessPolicy to: false
   [junit4]   2> 848886 T3575 oasl.LogWatcher.createWatcher SLF4J impl is org.slf4j.impl.Log4jLoggerFactory
   [junit4]   2> 848887 T3575 oasl.LogWatcher.newRegisteredLogWatcher Registering Log Listener [Log4j (org.slf4j.impl.Log4jLoggerFactory)]
   [junit4]   2> 848887 T3575 oasc.CoreContainer.load Host Name: 127.0.0.1
   [junit4]   2> 848887 T3575 oasc.ZkContainer.initZooKeeper Zookeeper client=127.0.0.1:34352/solr
   [junit4]   2> 848888 T3575 oasc.ZkController.checkChrootPath zkHost includes chroot
   [junit4]   2> 848888 T3575 oascc.ConnectionManager.waitForConnected Waiting for client to connect to ZooKeeper
   [junit4]   2> 848890 T3633 oascc.ConnectionManager.process Watcher org.apache.solr.common.cloud.ConnectionManager@c10944 name:ZooKeeperConnection Watcher:127.0.0.1:34352 got event WatchedEvent state:SyncConnected type:None path:null path:null type:None
   [junit4]   2> 848890 T3575 oascc.ConnectionManager.waitForConnected Client is connected to ZooKeeper
   [junit4]   2> 848892 T3575 oascc.ConnectionManager.waitForConnected Waiting for client to connect to ZooKeeper
   [junit4]   2> 848893 T3635 oascc.ConnectionManager.process Watcher org.apache.solr.common.cloud.ConnectionManager@91d36e name:ZooKeeperConnection Watcher:127.0.0.1:34352/solr got event WatchedEvent state:SyncConnected type:None path:null path:null type:None
   [junit4]   2> 848893 T3575 oascc.ConnectionManager.waitForConnected Client is connected to ZooKeeper
   [junit4]   2> 848898 T3575 oascc.ZkStateReader.createClusterStateWatchersAndUpdate Updating cluster state from ZooKeeper... 
   [junit4]   2> 849900 T3575 oasc.ZkController.createEphemeralLiveNode Register node as live in ZooKeeper:/live_nodes/127.0.0.1:32782_
   [junit4]   2> 849902 T3575 oascc.SolrZkClient.makePath makePath: /live_nodes/127.0.0.1:32782_
   [junit4]   2> 849908 T3575 oass.SolrDispatchFilter.init user.dir=/mnt/ssd/jenkins/workspace/Lucene-Solr-trunk-Linux/solr/build/solr-core/test/J0
   [junit4]   2> 849908 T3575 oass.SolrDispatchFilter.init SolrDispatchFilter.init() done
   [junit4]   2> 850137 T3575 oasc.AbstractFullDistribZkTestBase.createJettys create jetty 3
   [junit4]   2> 850138 T3575 oejs.Server.doStart jetty-8.1.10.v20130312
   [junit4]   2> 850141 T3575 oejus.SslContextFactory.doStart Enabled Protocols [SSLv2Hello, SSLv3, TLSv1, TLSv1.1, TLSv1.2] of [SSLv2Hello, SSLv3, TLSv1, TLSv1.1, TLSv1.2]
   [junit4]   2> 850141 T3575 oejs.AbstractConnector.doStart Started SslSelectChannelConnector@127.0.0.1:56822
   [junit4]   2> 850143 T3575 oass.SolrDispatchFilter.init SolrDispatchFilter.init()
   [junit4]   2> 850144 T3575 oasc.SolrResourceLoader.locateSolrHome JNDI not configured for solr (NoInitialContextEx)
   [junit4]   2> 850144 T3575 oasc.SolrResourceLoader.locateSolrHome using system property solr.solr.home: /mnt/ssd/jenkins/workspace/Lucene-Solr-trunk-Linux/solr/build/solr-core/test/J0/./temp/solr.cloud.CollectionsAPIDistributedZkTest-BCEE7429D618ABA4-001/tempDir-005
   [junit4]   2> 850144 T3575 oasc.SolrResourceLoader.<init> new SolrResourceLoader for directory: '/mnt/ssd/jenkins/workspace/Lucene-Solr-trunk-Linux/solr/build/solr-core/test/J0/./temp/solr.cloud.CollectionsAPIDistributedZkTest-BCEE7429D618ABA4-001/tempDir-005/'
   [junit4]   2> 850154 T3575 oasc.ConfigSolr.fromFile Loading container configuration from /mnt/ssd/jenkins/workspace/Lucene-Solr-trunk-Linux/solr/build/solr-core/test/J0/./temp/solr.cloud.CollectionsAPIDistributedZkTest-BCEE7429D618ABA4-001/tempDir-005/solr.xml
   [junit4]   2> 850187 T3575 oasc.CoreContainer.<init> New CoreContainer 30108095
   [junit4]   2> 850187 T3575 oasc.CoreContainer.load Loading cores into CoreContainer [instanceDir=/mnt/ssd/jenkins/workspace/Lucene-Solr-trunk-Linux/solr/build/solr-core/test/J0/./temp/solr.cloud.CollectionsAPIDistributedZkTest-BCEE7429D618ABA4-001/tempDir-005/]
   [junit4]   2> 850188 T3575 oashc.HttpShardHandlerFactory.getParameter Setting socketTimeout to: 120000
   [junit4]   2> 850188 T3575 oashc.HttpShardHandlerFactory.getParameter Setting urlScheme to: null
   [junit4]   2> 850188 T3575 oashc.HttpShardHandlerFactory.getParameter Setting connTimeout to: 15000
   [junit4]   2> 850189 T3575 oashc.HttpShardHandlerFactory.getParameter Setting maxConnectionsPerHost to: 20
   [junit4]   2> 850189 T3575 oashc.HttpShardHandlerFactory.getParameter Setting corePoolSize to: 0
   [junit4]   2> 850189 T3575 oashc.HttpShardHandlerFactory.getParameter Setting maximumPoolSize to: 2147483647
   [junit4]   2> 850189 T3575 oashc.HttpShardHandlerFactory.getParameter Setting maxThreadIdleTime to: 5
   [junit4]   2> 850190 T3575 oashc.HttpShardHandlerFactory.getParameter Setting sizeOfQueue to: -1
   [junit4]   2> 850190 T3575 oashc.HttpShardHandlerFactory.getParameter Setting fairnessPolicy to: false
   [junit4]   2> 850192 T3575 oasl.LogWatcher.createWatcher SLF4J impl is org.slf4j.impl.Log4jLoggerFactory
   [junit4]   2> 850192 T3575 oasl.LogWatcher.newRegisteredLogWatcher Registering Log Listener [Log4j (org.slf4j.impl.Log4jLoggerFactory)]
   [junit4]   2> 850192 T3575 oasc.CoreContainer.load Host Name: 127.0.0.1
   [junit4]   2> 850193 T3575 oasc.ZkContainer.initZooKeeper Zookeeper client=127.0.0.1:34352/solr
   [junit4]   2> 850193 T3575 oasc.ZkController.checkChrootPath zkHost includes chroot
   [junit4]   2> 850194 T3575 oascc.ConnectionManager.waitForConnected Waiting for client to connect to ZooKeeper
   [junit4]   2> 850195 T3647 oascc.ConnectionManager.process Watcher org.apache.solr.common.cloud.ConnectionManager@59f3a4 name:ZooKeeperConnection Watcher:127.0.0.1:34352 got event WatchedEvent state:SyncConnected type:None path:null path:null type:None
   [junit4]   2> 850196 T3575 oascc.ConnectionManager.waitForConnected Client is connected to ZooKeeper
   [junit4]   2> 850197 T3575 oascc.ConnectionManager.waitForConnected Waiting for client to connect to ZooKeeper
   [junit4]   2> 850198 T3649 oascc.ConnectionManager.process Watcher org.apache.solr.common.cloud.ConnectionManager@ca2c3d name:ZooKeeperConnection Watcher:127.0.0.1:34352/solr got event WatchedEvent state:SyncConnected type:None path:null path:null type:None
   [junit4]   2> 850198 T3575 oascc.ConnectionManager.waitForConnected Client is connected to ZooKeeper
   [junit4]   2> 850204 T3575 oascc.ZkStateReader.createClusterStateWatchersAndUpdate Updating cluster state from ZooKeeper... 
   [junit4]   2> 851206 T3575 oasc.ZkController.createEphemeralLiveNode Register node as live in ZooKeeper:/live_nodes/127.0.0.1:56822_
   [junit4]   2> 851207 T3575 oascc.SolrZkClient.makePath makePath: /live_nodes/127.0.0.1:56822_
   [junit4]   2> 851213 T3575 oass.SolrDispatchFilter.init user.dir=/mnt/ssd/jenkins/workspace/Lucene-Solr-trunk-Linux/solr/build/solr-core/test/J0
   [junit4]   2> 851213 T3575 oass.SolrDispatchFilter.init SolrDispatchFilter.init() done
   [junit4]   2> 851465 T3575 oasc.AbstractFullDistribZkTestBase.createJettys create jetty 4
   [junit4]   2> 851466 T3575 oejs.Server.doStart jetty-8.1.10.v20130312
   [junit4]   2> 851468 T3575 oejus.SslContextFactory.doStart Enabled Protocols [SSLv2Hello, SSLv3, TLSv1, TLSv1.1, TLSv1.2] of [SSLv2Hello, SSLv3, TLSv1, TLSv1.1, TLSv1.2]
   [junit4]   2> 851469 T3575 oejs.AbstractConnector.doStart Started SslSelectChannelConnector@127.0.0.1:42475
   [junit4]   2> 851471 T3575 oass.SolrDispatchFilter.init SolrDispatchFilter.init()
   [junit4]   2> 851471 T3575 oasc.SolrResourceLoader.locateSolrHome JNDI not configured for solr (NoInitialContextEx)
   [junit4]   2> 851472 T3575 oasc.SolrResourceLoader.locateSolrHome using system property solr.solr.home: /mnt/ssd/jenkins/workspace/Lucene-Solr-trunk-Linux/solr/build/solr-core/test/J0/./temp/solr.cloud.CollectionsAPIDistributedZkTest-BCEE7429D618ABA4-001/tempDir-006
   [junit4]   2> 851472 T3575 oasc.SolrResourceLoader.<init> new SolrResourceLoader for directory: '/mnt/ssd/jenkins/workspace/Lucene-Solr-trunk-Linux/solr/build/solr-core/test/J0/./temp/solr.cloud.CollectionsAPIDistributedZkTest-BCEE7429D618ABA4-001/tempDir-006/'
   [junit4]   2> 851483 T3575 oasc.ConfigSolr.fromFile Loading container configuration from /mnt/ssd/jenkins/workspace/Lucene-Solr-trunk-Linux/solr/build/solr-core/test/J0/./temp/solr.cloud.CollectionsAPIDistributedZkTest-BCEE7429D618ABA4-001/tempDir-006/solr.xml
   [junit4]   2> 851511 T3575 oasc.CoreContainer.<init> New CoreContainer 30081760
   [junit4]   2> 851512 T3575 oasc.CoreContainer.load Loading cores into CoreContainer [instanceDir=/mnt/ssd/jenkins/workspace/Lucene-Solr-trunk-Linux/solr/build/solr-core/test/J0/./temp/solr.cloud.CollectionsAPIDistributedZkTest-BCEE7429D618ABA4-001/tempDir-006/]
   [junit4]   2> 851513 T3575 oashc.HttpShardHandlerFactory.getParameter Setting socketTimeout to: 120000
   [junit4]   2> 851513 T3575 oashc.HttpShardHandlerFactory.getParameter Setting urlScheme to: null
   [junit4]   2> 851514 T3575 oashc.HttpShardHandlerFactory.getParameter Setting connTimeout to: 15000
   [junit4]   2> 851514 T3575 oashc.HttpShardHandlerFactory.getParameter Setting maxConnectionsPerHost to: 20
   [junit4]   2> 851515 T3575 oashc.HttpShardHandlerFactory.getParameter Setting corePoolSize to: 0
   [junit4]   2> 851515 T3575 oashc.HttpShardHandlerFactory.getParameter Setting maximumPoolSize to: 2147483647
   [junit4]   2> 851515 T3575 oashc.HttpShardHandlerFactory.getParameter Setting maxThreadIdleTime to: 5
   [junit4]   2> 851516 T3575 oashc.HttpShardHandlerFactory.getParameter Setting sizeOfQueue to: -1
   [junit4]   2> 851516 T3575 oashc.HttpShardHandlerFactory.getParameter Setting fairnessPolicy to: false
   [junit4]   2> 851519 T3575 oasl.LogWatcher.createWatcher SLF4J impl is org.slf4j.impl.Log4jLoggerFactory
   [junit4]   2> 851519 T3575 oasl.LogWatcher.newRegisteredLogWatcher Registering Log Listener [Log4j (org.slf4j.impl.Log4jLoggerFactory)]
   [junit4]   2> 851520 T3575 oasc.CoreContainer.load Host Name: 127.0.0.1
   [junit4]   2> 851520 T3575 oasc.ZkContainer.initZooKeeper Zookeeper client=127.0.0.1:34352/solr
   [junit4]   2> 851521 T3575 oasc.ZkController.checkChrootPath zkHost includes chroot
   [junit4]   2> 851522 T3575 oascc.ConnectionManager.waitForConnected Waiting for client to connect to ZooKeeper
   [junit4]   2> 851525 T3661 oascc.ConnectionManager.process Watcher org.apache.solr.common.cloud.ConnectionManager@805880 name:ZooKeeperConnection Watcher:127.0.0.1:34352 got event WatchedEvent state:SyncConnected type:None path:null path:null type:None
   [junit4]   2> 851525 T3575 oascc.ConnectionManager.waitForConnected Client is connected to ZooKeeper
   [junit4]   2> 851527 T3575 oascc.ConnectionManager.waitForConnected Waiting for client to connect to ZooKeeper
   [junit4]   2> 851528 T3663 oascc.ConnectionManager.process Watcher org.apache.solr.common.cloud.ConnectionManager@1cba3b2 name:ZooKeeperConnection Watcher:127.0.0.1:34352/solr got event WatchedEvent state:SyncConnected type:None path:null path:null type:None
   [junit4]   2> 851529 T3575 oascc.ConnectionManager.waitForConnected Client is connected to ZooKeeper
   [junit4]   2> 851535 T3575 oascc.ZkStateReader.createClusterStateWatchersAndUpdate Updating cluster state from ZooKeeper... 
   [junit4]   2> 852538 T3575 oasc.ZkController.createEphemeralLiveNode Register node as live in ZooKeeper:/live_nodes/127.0.0.1:42475_
   [junit4]   2> 852539 T3575 oascc.SolrZkClient.makePath makePath: /live_nodes/127.0.0.1:42475_
   [junit4]   2> 852545 T3575 oass.SolrDispatchFilter.init user.dir=/mnt/ssd/jenkins/workspace/Lucene-Solr-trunk-Linux/solr/build/solr-core/test/J0
   [junit4]   2> 852546 T3575 oass.SolrDispatchFilter.init SolrDispatchFilter.init() done
   [junit4]   2> 852635 T3614 oasha.CollectionsHandler.handleCreateAction Creating Collection : action=CREATE&collection.configName=conf1&wt=javabin&replicationFactor=2&router.field=myOwnField&version=2&router.name=compositeId&numShards=2&name=solrj_collection
   [junit4]   2> 852637 T3603 oasc.DistributedQueue$LatchChildWatcher.process LatchChildWatcher fired on path: /overseer/collection-queue-work state: SyncConnected type NodeChildrenChanged
   [junit4]   2> 852637 T3603 oasc.DistributedQueue$LatchChildWatcher.process LatchChildWatcher fired on path: /overseer/collection-queue-work state: SyncConnected type NodeChildrenChanged
   [junit4]   2> 852637 T3603 oasc.DistributedQueue$LatchChildWatcher.process LatchChildWatcher fired on path: /overseer/collection-queue-work state: SyncConnected type NodeChildrenChanged
   [junit4]   2> 852637 T3603 oasc.DistributedQueue$LatchChildWatcher.process LatchChildWatcher fired on path: /overseer/collection-queue-work state: SyncConnected type NodeChildrenChanged
   [junit4]   2> 852637 T3603 oasc.DistributedQueue$LatchChildWatcher.process LatchChildWatcher fired on path: /overseer/collection-queue-work state: SyncConnected type NodeChildrenChanged
   [junit4]   2> 852638 T3605 oasc.OverseerCollectionProcessor.run Overseer Collection Processor: Get the message id:/overseer/collection-queue-work/qn-0000000000 message:{
   [junit4]   2> 	  "operation":"createcollection",
   [junit4]   2> 	  "fromApi":"true",
   [junit4]   2> 	  "name":"solrj_collection",
   [junit4]   2> 	  "replicationFactor":"2",
   [junit4]   2> 	  "collection.configName":"conf1",
   [junit4]   2> 	  "numShards":"2",
   [junit4]   2> 	  "router.field":"myOwnField",
   [junit4]   2> 	  "router.name":"compositeId"}
   [junit4]   2> 852638 T3665 oasc.OverseerCollectionProcessor.processMessage WARN OverseerCollectionProcessor.processMessage : createcollection , {
   [junit4]   2> 	  "operation":"createcollection",
   [junit4]   2> 	  "fromApi":"true",
   [junit4]   2> 	  "name":"solrj_collection",
   [junit4]   2> 	  "replicationFactor":"2",
   [junit4]   2> 	  "collection.configName":"conf1",
   [junit4]   2> 	  "numShards":"2",
   [junit4]   2> 	  "router.field":"myOwnField",
   [junit4]   2> 	  "router.name":"compositeId"}
   [junit4]   2> 852639 T3665 oasc.OverseerCollectionProcessor.createConfNode creating collections conf node /collections/solrj_collection 
   [junit4]   2> 852639 T3665 oascc.SolrZkClient.makePath makePath: /collections/solrj_collection
   [junit4]   2> 852643 T3603 oasc.DistributedQueue$LatchChildWatcher.process LatchChildWatcher fired on path: /overseer/queue state: SyncConnected type NodeChildrenChanged
   [junit4]   2> 852644 T3604 oascc.ZkStateReader.updateClusterState Updating cloud state from ZooKeeper... 
   [junit4]   2> 852645 T3604 oasc.Overseer$ClusterStateUpdater.buildCollection building a new collection: solrj_collection
   [junit4]   2> 852645 T3604 oasc.Overseer$ClusterStateUpdater.createCollection Create collection solrj_collection with shards [shard1, shard2]
   [junit4]   2> 852646 T3603 oasc.DistributedQueue$LatchChildWatcher.process LatchChildWatcher fired on path: /overseer/queue state: SyncConnected type NodeChildrenChanged
   [junit4]   2> 852647 T3663 oascc.ZkStateReader$2.process A cluster state change: WatchedEvent state:SyncConnected type:NodeDataChanged path:/clusterstate.json, has occurred - updating... (live nodes size: 5)
   [junit4]   2> 852647 T3649 oascc.ZkStateReader$2.process A cluster state change: WatchedEvent state:SyncConnected type:NodeDataChanged path:/clusterstate.json, has occurred - updating... (live nodes size: 5)
   [junit4]   2> 852647 T3608 oascc.ZkStateReader$2.process A cluster state change: WatchedEvent state:SyncConnected type:NodeDataChanged path:/clusterstate.json, has occurred - updating... (live nodes size: 5)
   [junit4]   2> 852647 T3621 oascc.ZkStateReader$2.process A cluster state change: WatchedEvent state:SyncConnected type:NodeDataChanged path:/clusterstate.json, has occurred - updating... (live nodes size: 5)
   [junit4]   2> 852647 T3603 oascc.ZkStateReader$2.process A cluster state change: WatchedEvent state:SyncConnected type:NodeDataChanged path:/clusterstate.json, has occurred - updating... (live nodes size: 5)
   [junit4]   2> 852647 T3635 oascc.ZkStateReader$2.process A cluster state change: WatchedEvent state:SyncConnected type:NodeDataChanged path:/clusterstate.json, has occurred - updating... (live nodes size: 5)
   [junit4]   2> 852744 T3665 oasc.OverseerCollectionProcessor.createCollection Creating SolrCores for new collection solrj_collection, shardNames [shard1, shard2] , replicationFactor : 2
   [junit4]   2> 852744 T3665 oasc.OverseerCollectionProcessor.createCollection Creating shard solrj_collection_shard1_replica1 as part of slice shard1 of collection solrj_collection on 127.0.0.1:40216_
   [junit4]   2> 852746 T3665 oasc.OverseerCollectionProcessor.createCollection Creating shard solrj_collection_shard1_replica2 as part of slice shard1 of collection solrj_collection on 127.0.0.1:56822_
   [junit4]   2> 852750 T3665 oasc.OverseerCollectionProcessor.createCollection Creating shard solrj_collection_shard2_replica1 as part of slice shard2 of collection solrj_collection on 127.0.0.1:46091_
   [junit4]   2> 852753 T3665 oasc.OverseerCollectionProcessor.createCollection Creating shard solrj_collection_shard2_replica2 as part of slice shard2 of collection solrj_collection on 127.0.0.1:42475_
   [junit4]   2> 852840 T3617 oasha.CoreAdminHandler.handleCreateAction core create command action=CREATE&collection.configName=conf1&wt=javabin&collection=solrj_collection&qt=/admin/cores&version=2&numShards=2&name=solrj_collection_shard2_replica1&shard=shard2
   [junit4]   2> 852842 T3617 oasc.ZkController.publish publishing core=solrj_collection_shard2_replica1 state=down collection=solrj_collection
   [junit4]   2> 852843 T3617 oasc.ZkController.waitForCoreNodeName look for our core node name
   [junit4]   2> 852843 T3603 oasc.DistributedQueue$LatchChildWatcher.process LatchChildWatcher fired on path: /overseer/queue state: SyncConnected type NodeChildrenChanged
   [junit4]   2> 852845 T3644 oasha.CoreAdminHandler.handleCreateAction core create command action=CREATE&collection.configName=conf1&wt=javabin&collection=solrj_collection&qt=/admin/cores&version=2&numShards=2&name=solrj_collection_shard1_replica2&shard=shard1
   [junit4]   2> 852845 T3604 oascc.ZkStateReader.updateClusterState Updating cloud state from ZooKeeper... 
   [junit4]   2> 852846 T3604 oasc.Overseer$ClusterStateUpdater.updateState Update state numShards=2 message={
   [junit4]   2> 	  "operation":"state",
   [junit4]   2> 	  "state":"down",
   [junit4]   2> 	  "base_url":"https://127.0.0.1:46091",
   [junit4]   2> 	  "core":"solrj_collection_shard2_replica1",
   [junit4]   2> 	  "roles":null,
   [junit4]   2> 	  "node_name":"127.0.0.1:46091_",
   [junit4]   2> 	  "shard":"shard2",
   [junit4]   2> 	  "collection":"solrj_collection",
   [junit4]   2> 	  "numShards":"2",
   [junit4]   2> 	  "core_node_name":null}
   [junit4]   2> 852846 T3644 oasc.ZkController.publish publishing core=solrj_collection_shard1_replica2 state=down collection=solrj_collection
   [junit4]   2> 852847 T3603 oasc.DistributedQueue$LatchChildWatcher.process LatchChildWatcher fired on path: /overseer/queue state: SyncConnected type NodeChildrenChanged
   [junit4]   2> 852847 T3644 oasc.ZkController.waitForCoreNodeName look for our core node name
   [junit4]   2> 852848 T3604 oasc.Overseer$ClusterStateUpdater.updateState Update state numShards=2 message={
   [junit4]   2> 	  "operation":"state",
   [junit4]   2> 	  "state":"down",
   [junit4]   2> 	  "base_url":"https://127.0.0.1:56822",
   [junit4]   2> 	  "core":"solrj_collection_shard1_replica2",
   [junit4]   2> 	  "roles":null,
   [junit4]   2> 	  "node_name":"127.0.0.1:56822_",
   [junit4]   2> 	  "shard":"shard1",
   [junit4]   2> 	  "collection":"solrj_collection",
   [junit4]   2> 	  "numShards":"2",
   [junit4]   2> 	  "core_node_name":null}
   [junit4]   2> 852849 T3603 oasc.DistributedQueue$LatchChildWatcher.process LatchChildWatcher fired on path: /overseer/queue state: SyncConnected type NodeChildrenChanged
   [junit4]   2> 852857 T3596 oasha.CoreAdminHandler.handleCreateAction core create command action=CREATE&collection.configName=conf1&wt=javabin&collection=solrj_collection&qt=/admin/cores&version=2&numShards=2&name=solrj_collection_shard1_replica1&shard=shard1
   [junit4]   2> 852859 T3596 oasc.ZkController.publish publishing core=solrj_collection_shard1_replica1 state=down collection=solrj_collection
   [junit4]   2> 852859 T3603 oasc.DistributedQueue$LatchChildWatcher.process LatchChildWatcher fired on path: /overseer/queue state: SyncConnected type NodeChildrenChanged
   [junit4]   2> 852860 T3596 oasc.ZkController.waitForCoreNodeName look for our core node name
   [junit4]   2> 852861 T3604 oasc.Overseer$ClusterStateUpdater.updateState Update state numShards=2 message={
   [junit4]   2> 	  "operation":"state",
   [junit4]   2> 	  "state":"down",
   [junit4]   2> 	  "base_url":"https://127.0.0.1:40216",
   [junit4]   2> 	  "core":"solrj_collection_shard1_replica1",
   [junit4]   2> 	  "roles":null,
   [junit4]   2> 	  "node_name":"127.0.0.1:40216_",
   [junit4]   2> 	  "shard":"shard1",
   [junit4]   2> 	  "collection":"solrj_collection",
   [junit4]   2> 	  "numShards":"2",
   [junit4]   2> 	  "core_node_name":null}
   [junit4]   2> 852863 T3659 oasha.CoreAdminHandler.handleCreateAction core create command action=CREATE&collection.configName=conf1&wt=javabin&collection=solrj_collection&qt=/admin/cores&version=2&numShards=2&name=solrj_collection_shard2_replica2&shard=shard2
   [junit4]   2> 852864 T3603 oasc.DistributedQueue$LatchChildWatcher.process LatchChildWatcher fired on path: /overseer/queue state: SyncConnected type NodeChildrenChanged
   [junit4]   2> 852866 T3659 oasc.ZkController.publish publishing core=solrj_collection_shard2_replica2 state=down collection=solrj_collection
   [junit4]   2> 852867 T3603 oasc.DistributedQueue$LatchChildWatcher.process LatchChildWatcher fired on path: /overseer/queue state: SyncConnected type NodeChildrenChanged
   [junit4]   2> 852867 T3659 oasc.ZkController.waitForCoreNodeName look for our core node name
   [junit4]   2> 852869 T3604 oasc.Overseer$ClusterStateUpdater.updateState Update state numShards=2 message={
   [junit4]   2> 	  "operation":"state",
   [junit4]   2> 	  "state":"down",
   [junit4]   2> 	  "base_url":"https://127.0.0.1:42475",
   [junit4]   2> 	  "core":"solrj_collection_shard2_replica2",
   [junit4]   2> 	  "roles":null,
   [junit4]   2> 	  "node_name":"127.0.0.1:42475_",
   [junit4]   2> 	  "shard":"shard2",
   [junit4]   2> 	  "collection":"solrj_collection",
   [junit4]   2> 	  "numShards":"2",
   [junit4]   2> 	  "core_node_name":null}
   [junit4]   2> 852872 T3603 oasc.DistributedQueue$LatchChildWatcher.process LatchChildWatcher fired on path: /overseer/queue state: SyncConnected type NodeChildrenChanged
   [junit4]   2> 852975 T3635 oascc.ZkStateReader$2.process A cluster state change: WatchedEvent state:SyncConnected type:NodeDataChanged path:/clusterstate.json, has occurred - updating... (live nodes size: 5)
   [junit4]   2> 852975 T3603 oascc.ZkStateReader$2.process A cluster state change: WatchedEvent state:SyncConnected type:NodeDataChanged path:/clusterstate.json, has occurred - updating... (live nodes size: 5)
   [junit4]   2> 852975 T3663 oascc.ZkStateReader$2.process A cluster state change: WatchedEvent state:SyncConnected type:NodeDataChanged path:/clusterstate.json, has occurred - updating... (live nodes size: 5)
   [junit4]   2> 852975 T3608 oascc.ZkStateReader$2.process A cluster state change: WatchedEvent state:SyncConnected type:NodeDataChanged path:/clusterstate.json, has occurred - updating... (live nodes size: 5)
   [junit4]   2> 852975 T3621 oascc.ZkStateReader$2.process A cluster state change: WatchedEvent state:SyncConnected type:NodeDataChanged path:/clusterstate.json, has occurred - updating... (live nodes size: 5)
   [junit4]   2> 852975 T3649 oascc.ZkStateReader$2.process A cluster state change: WatchedEvent state:SyncConnected type:NodeDataChanged path:/clusterstate.json, has occurred - updating... (live nodes size: 5)
   [junit4]   2> 853844 T3617 oasc.ZkController.waitForShardId waiting to find shard id in clusterstate for solrj_collection_shard2_replica1
   [junit4]   2> 853845 T3617 oasc.SolrXMLCoresLocator.doPersist Persisted core descriptions to /mnt/ssd/jenkins/workspace/Lucene-Solr-trunk-Linux/solr/build/solr-core/test/J0/./temp/solr.cloud.CollectionsAPIDistributedZkTest-BCEE7429D618ABA4-001/tempDir-003/solr.xml
   [junit4]   2> 853845 T3617 oasc.ZkController.createCollectionZkNode Check for collection zkNode:solrj_collection
   [junit4]   2> 853846 T3617 oasc.ZkController.createCollectionZkNode Collection zkNode exists
   [junit4]   2> 853846 T3617 oascc.ZkStateReader.readConfigName Load collection config from:/collections/solrj_collection
   [junit4]   2> 853847 T3617 oascc.ZkStateReader.readConfigName path=/collections/solrj_collection configName=conf1 specified config exists in ZooKeeper
   [junit4]   2> 853847 T3617 oasc.SolrResourceLoader.<init> new SolrResourceLoader for directory: '/mnt/ssd/jenkins/workspace/Lucene-Solr-trunk-Linux/solr/build/solr-core/test/J0/./temp/solr.cloud.CollectionsAPIDistributedZkTest-BCEE7429D618ABA4-001/tempDir-003/solrj_collection_shard2_replica1/'
   [junit4]   2> 853847 T3644 oasc.ZkController.waitForShardId waiting to find shard id in clusterstate for solrj_collection_shard1_replica2
   [junit4]   2> 853848 T3644 oasc.SolrXMLCoresLocator.doPersist Persisted core descriptions to /mnt/ssd/jenkins/workspace/Lucene-Solr-trunk-Linux/solr/build/solr-core/test/J0/./temp/solr.cloud.CollectionsAPIDistributedZkTest-BCEE7429D618ABA4-001/tempDir-005/solr.xml
   [junit4]   2> 853848 T3644 oasc.ZkController.createCollectionZkNode Check for collection zkNode:solrj_collection
   [junit4]   2> 853849 T3644 oasc.ZkController.createCollectionZkNode Collection zkNode exists
   [junit4]   2> 853849 T3644 oascc.ZkStateReader.readConfigName Load collection config from:/collections/solrj_collection
   [junit4]   2> 853850 T3644 oascc.ZkStateReader.readConfigName path=/collections/solrj_collection configName=conf1 specified config exists in ZooKeeper
   [junit4]   2> 853850 T3644 oasc.SolrResourceLoader.<init> new SolrResourceLoader for directory: '/mnt/ssd/jenkins/workspace/Lucene-Solr-trunk-Linux/solr/build/solr-core/test/J0/./temp/solr.cloud.CollectionsAPIDistributedZkTest-BCEE7429D618ABA4-001/tempDir-005/solrj_collection_shard1_replica2/'
   [junit4]   2> 853861 T3596 oasc.ZkController.waitForShardId waiting to find shard id in clusterstate for solrj_collection_shard1_replica1
   [junit4]   2> 853862 T3596 oasc.SolrXMLCoresLocator.doPersist Persisted core descriptions to /mnt/ssd/jenkins/workspace/Lucene-Solr-trunk-Linux/solr/build/solr-core/test/J0/../../../../../../../../../../mnt/ssd/jenkins/workspace/Lucene-Solr-trunk-Linux/solr/build/solr-core/test/J0/./temp/solr.cloud.CollectionsAPIDistributedZkTest-BCEE7429D618ABA4-001/tempDir-002/solr.xml
   [junit4]   2> 853862 T3596 oasc.ZkController.createCollectionZkNode Check for collection zkNode:solrj_collection
   [junit4]   2> 853863 T3596 oasc.ZkController.createCollectionZkNode Collection zkNode exists
   [junit4]   2> 853863 T3596 oascc.ZkStateReader.readConfigName Load collection config from:/collections/solrj_collection
   [junit4]   2> 853864 T3596 oascc.ZkStateReader.readConfigName path=/collections/solrj_collection configName=conf1 specified config exists in ZooKeeper
   [junit4]   2> 853864 T3596 oasc.SolrResourceLoader.<init> new SolrResourceLoader for directory: '../../../../../../../../../../mnt/ssd/jenkins/workspace/Lucene-Solr-trunk-Linux/solr/build/solr-core/test/J0/./temp/solr.cloud.CollectionsAPIDistributedZkTest-BCEE7429D618ABA4-001/tempDir-002/solrj_collection_shard1_replica1/'
   [junit4]   2> 853868 T3659 oasc.ZkController.waitForShardId waiting to find shard id in clusterstate for solrj_collection_shard2_replica2
   [junit4]   2> 853869 T3659 oasc.SolrXMLCoresLocator.doPersist Persisted core descriptions to /mnt/ssd/jenkins/workspace/Lucene-Solr-trunk-Linux/solr/build/solr-core/test/J0/./temp/solr.cloud.CollectionsAPIDistributedZkTest-BCEE7429D618ABA4-001/tempDir-006/solr.xml
   [junit4]   2> 853869 T3659 oasc.ZkController.createCollectionZkNode Check for collection zkNode:solrj_collection
   [junit4]   2> 853870 T3659 oasc.ZkController.createCollectionZkNode Collection zkNode exists
   [junit4]   2> 853870 T3659 oascc.ZkStateReader.readConfigName Load collection config from:/collections/solrj_collection
   [junit4]   2> 853871 T3659 oascc.ZkStateReader.readConfigName path=/collections/solrj_collection configName=conf1 specified config exists in ZooKeeper
   [junit4]   2> 853871 T3659 oasc.SolrResourceLoader.<init> new SolrResourceLoader for directory: '/mnt/ssd/jenkins/workspace/Lucene-Solr-trunk-Linux/solr/build/solr-core/test/J0/./temp/solr.cloud.CollectionsAPIDistributedZkTest-BCEE7429D618ABA4-001/tempDir-006/solrj_collection_shard2_replica2/'
   [junit4]   2> 853890 T3596 oasc.SolrConfig.<init> Using Lucene MatchVersion: LUCENE_5_0
   [junit4]   2> 853893 T3617 oasc.SolrConfig.<init> Using Lucene MatchVersion: LUCENE_5_0
   [junit4]   2> 853899 T3644 oasc.SolrConfig.<init> Using Lucene MatchVersion: LUCENE_5_0
   [junit4]   2> 853926 T3596 oasc.SolrConfig.<init> Loaded SolrConfig: solrconfig.xml
   [junit4]   2> 853927 T3596 oass.IndexSchema.readSchema Reading Solr Schema from schema.xml
   [junit4]   2> 853931 T3659 oasc.SolrConfig.<init> Using Lucene MatchVersion: LUCENE_5_0
   [junit4]   2> 853933 T3596 oass.IndexSchema.readSchema [solrj_collection_shard1_replica1] Schema name=test
   [junit4]   2> 853942 T3617 oasc.SolrConfig.<init> Loaded SolrConfig: solrconfig.xml
   [junit4]   2> 853946 T3617 oass.IndexSchema.readSchema Reading Solr Schema from schema.xml
   [junit4]   2> 853951 T3644 oasc.SolrConfig.<init> Loaded SolrConfig: solrconfig.xml
   [junit4]   2> 853952 T3644 oass.IndexSchema.readSchema Reading Solr Schema from schema.xml
   [junit4]   2> 853956 T3617 oass.IndexSchema.readSchema [solrj_collection_shard2_replica1] Schema name=test
   [junit4]   2> 853960 T3644 oass.IndexSchema.readSchema [solrj_collection_shard1_replica2] Schema name=test
   [junit4]   2> 853968 T3659 oasc.SolrConfig.<init> Loaded SolrConfig: solrconfig.xml
   [junit4]   2> 853969 T3659 oass.IndexSchema.readSchema Reading Solr Schema from schema.xml
   [junit4]   2> 853977 T3659 oass.IndexSchema.readSchema [solrj_collection_shard2_replica2] Schema name=test
   [junit4]   2> 854233 T3596 oass.OpenExchangeRatesOrgProvider.init Initialized with rates=open-exchange-rates.json, refreshInterval=1440.
   [junit4]   2> 854238 T3596 oass.IndexSchema.readSchema default search field in schema is text
   [junit4]   2> 854240 T3596 oass.IndexSchema.readSchema unique key field: id
   [junit4]   2> 854252 T3644 oass.OpenExchangeRatesOrgProvider.init Initialized with rates=open-exchange-rates.json, refreshInterval=1440.
   [junit4]   2> 854253 T3596 oass.FileExchangeRateProvider.reload Reloading exchange rates from file currency.xml
   [junit4]   2> 854256 T3596 oass.FileExchangeRateProvider.reload Reloading exchange rates from file currency.xml
   [junit4]   2> 854256 T3644 oass.IndexSchema.readSchema default search field in schema is text
   [junit4]   2> 854259 T3644 oass.IndexSchema.readSchema unique key field: id
   [junit4]   2> 854259 T3596 oass.OpenExchangeRatesOrgProvider.reload Reloading exchange rates from open-exchange-rates.json
   [junit4]   2> 854260 T3596 oass.OpenExchangeRatesOrgProvider$OpenExchangeRates.<init> WARN Unknown key IMPORTANT NOTE
   [junit4]   2> 854262 T3596 oass.OpenExchangeRatesOrgProvider$OpenExchangeRates.<init> WARN Expected key, got STRING
   [junit4]   2> 854262 T3596 oass.OpenExchangeRatesOrgProvider.reload Reloading exchange rates from open-exchange-rates.json
   [junit4]   2> 854263 T3596 oass.OpenExchangeRatesOrgProvider$OpenExchangeRates.<init> WARN Unknown key IMPORTANT NOTE
   [junit4]   2> 854263 T3596 oass.OpenExchangeRatesOrgProvider$OpenExchangeRates.<init> WARN Expected key, got STRING
   [junit4]   2> 854263 T3596 oasc.CoreContainer.create Creating SolrCore 'solrj_collection_shard1_replica1' using configuration from collection solrj_collection
   [junit4]   2> 854264 T3596 oasc.SolrCore.initDirectoryFactory org.apache.solr.core.MockDirectoryFactory
   [junit4]   2> 854264 T3596 oasc.SolrCore.<init> [solrj_collection_shard1_replica1] Opening new SolrCore at ../../../../../../../../../../mnt/ssd/jenkins/workspace/Lucene-Solr-trunk-Linux/solr/build/solr-core/test/J0/./temp/solr.cloud.CollectionsAPIDistributedZkTest-BCEE7429D618ABA4-001/tempDir-002/solrj_collection_shard1_replica1/, dataDir=/mnt/ssd/jenkins/workspace/Lucene-Solr-trunk-Linux/solr/build/solr-core/test/J0/../../../../../../../../../../mnt/ssd/jenkins/workspace/Lucene-Solr-trunk-Linux/solr/build/solr-core/test/J0/./temp/solr.cloud.CollectionsAPIDistributedZkTest-BCEE7429D618ABA4-001/tempDir-002/solrj_collection_shard1_replica1/data/
   [junit4]   2> 854265 T3596 oasc.JmxMonitoredMap.<init> JMX monitoring is enabled. Adding Solr mbeans to JMX Server: com.sun.jmx.mbeanserver.JmxMBeanServer@1e52930
   [junit4]   2> 854266 T3596 oasc.CachingDirectoryFactory.get return new directory for /mnt/ssd/jenkins/workspace/Lucene-Solr-trunk-Linux/solr/build/solr-core/test/J0/../../../../../../../../../../mnt/ssd/jenkins/workspace/Lucene-Solr-trunk-Linux/solr/build/solr-core/test/J0/./temp/solr.cloud.CollectionsAPIDistributedZkTest-BCEE7429D618ABA4-001/tempDir-002/solrj_collection_shard1_replica1/data
   [junit4]   2> 854266 T3596 oasc.SolrCore.getNewIndexDir New index directory detected: old=null new=/mnt/ssd/jenkins/workspace/Lucene-Solr-trunk-Linux/solr/build/solr-core/test/J0/../../../../../../../../../../mnt/ssd/jenkins/workspace/Lucene-Solr-trunk-Linux/solr/build/solr-core/test/J0/./temp/solr.cloud.CollectionsAPIDistributedZkTest-BCEE7429D618ABA4-001/tempDir-002/solrj_collection_shard1_replica1/data/index/
   [junit4]   2> 854267 T3596 oasc.SolrCore.initIndex WARN [solrj_collection_shard1_replica1] Solr index directory '/mnt/ssd/jenkins/workspace/Lucene-Solr-trunk-Linux/solr/build/solr-core/test/J0/../../../../../../../../../../mnt/ssd/jenkins/workspace/Lucene-Solr-trunk-Linux/solr/build/solr-core/test/J0/./temp/solr.cloud.CollectionsAPIDistributedZkTest-BCEE7429D618ABA4-001/tempDir-002/solrj_collection_shard1_replica1/data/index' doesn't exist. Creating new index...
   [junit4]   2> 854267 T3596 oasc.CachingDirectoryFactory.get return new directory for /mnt/ssd/jenkins/workspace/Lucene-Solr-trunk-Linux/solr/build/solr-core/test/J0/../../../../../../../../../../mnt/ssd/jenkins/workspace/Lucene-Solr-trunk-Linux/solr/build/solr-core/test/J0/./temp/solr.cloud.CollectionsAPIDistributedZkTest-BCEE7429D618ABA4-001/tempDir-002/solrj_collection_shard1_replica1/data/index
   [junit4]   2> 854268 T3596 oasu.RandomMergePolicy.<init> RandomMergePolicy wrapping class org.apache.lucene.index.LogByteSizeMergePolicy: [LogByteSizeMergePolicy: minMergeSize=1677721, mergeFactor=33, maxMergeSize=2147483648, maxMergeSizeForForcedMerge=9223372036854775807, calibrateSizeByDeletes=false, maxMergeDocs=2147483647, maxCFSSegmentSizeMB=8.796093022207999E12, noCFSRatio=1.0]
   [junit4]   2> 854269 T3596 oasc.SolrDeletionPolicy.onCommit SolrDeletionPolicy.onCommit: commits: num=1
   [junit4]   2> 		commit{dir=MockDirectoryWrapper(RAMDirectory@36fcf8 lockFactory=org.apache.lucene.store.SingleInstanceLockFactory@1c0df91),segFN=segments_1,generation=1}
   [junit4]   2> 854269 T3596 oasc.SolrDeletionPolicy.updateCommits newest commit generation = 1
   [junit4]   2> 854270 T3644 oass.FileExchangeRateProvider.reload Reloading exchange rates from file currency.xml
   [junit4]   2> 854273 T3644 oass.FileExchangeRateProvider.reload Reloading exchange rates from file currency.xml
   [junit4]   2> 854274 T3596 oasup.UpdateRequestProcessorChain.init creating updateRequestProcessorChain "nodistrib"
   [junit4]   2> 854274 T3596 oasup.UpdateRequestProcessorChain.init creating updateRequestProcessorChain "dedupe"
   [junit4]   2> 854275 T3596 oasup.UpdateRequestProcessorChain.init inserting DistributedUpdateProcessorFactory into updateRequestProcessorChain "dedupe"
   [junit4]   2> 854275 T3596 oasup.UpdateRequestProcessorChain.init creating updateRequestProcessorChain "stored_sig"
   [junit4]   2> 854276 T3596 oasup.UpdateRequestProcessorChain.init inserting DistributedUpdateProcessorFactory into updateRequestProcessorChain "stored_sig"
   [junit4]   2> 854276 T3596 oasup.UpdateRequestProcessorChain.init creating updateRequestProcessorChain "distrib-dup-test-chain-explicit"
   [junit4]   2> 854276 T3644 oass.OpenExchangeRatesOrgProvider.reload Reloading exchange rates from open-exchange-rates.json
   [junit4]   2> 854277 T3596 oasup.UpdateRequestProcessorChain.init creating updateRequestProcessorChain "distrib-dup-test-chain-implicit"
   [junit4]   2> 854277 T3596 oasup.UpdateRequestProcessorChain.init inserting DistributedUpdateProcessorFactory into updateRequestProcessorChain "distrib-dup-test-chain-implicit"
   [junit4]   2> 854277 T3644 oass.OpenExchangeRatesOrgProvider$OpenExchangeRates.<init> WARN Unknown key IMPORTANT NOTE
   [junit4]   2> 854278 T3644 oass.OpenExchangeRatesOrgProvider$OpenExchangeRates.<init> WARN Expected key, got STRING
   [junit4]   2> 854277 T3596 oasc.SolrCore.loadUpdateProcessorChains no updateRequestProcessorChain defined as default, creating implicit default
   [junit4]   2> 854278 T3644 oass.OpenExchangeRatesOrgProvider.reload Reloading exchange rates from open-exchange-rates.json
   [junit4]   2> 854279 T3596 oasc.RequestHandlers.initHandlersFromConfig created standard: solr.StandardRequestHandler
   [junit4]   2> 854280 T3644 oass.OpenExchangeRatesOrgProvider$OpenExchangeRates.<init> WARN Unknown key IMPORTANT NOTE
   [junit4]   2> 854280 T3644 oass.OpenExchangeRatesOrgProvider$OpenExchangeRates.<init> WARN Expected key, got STRING
   [junit4]   2> 854280 T3596 oasc.RequestHandlers.initHandlersFromConfig created /get: solr.RealTimeGetHandler
   [junit4]   2> 854280 T3644 oasc.CoreContainer.create Creating SolrCore 'solrj_collection_shard1_replica2' using configuration from collection solrj_collection
   [junit4]   2> 854281 T3659 oass.OpenExchangeRatesOrgProvider.init Initialized with rates=open-exchange-rates.json, refreshInterval=1440.
   [junit4]   2> 854281 T3596 oasc.RequestHandlers.initHandlersFromConfig adding lazy requestHandler: solr.ReplicationHandler
   [junit4]   2> 854281 T3644 oasc.SolrCore.initDirectoryFactory org.apache.solr.core.MockDirectoryFactory
   [junit4]   2> 854282 T3596 oasc.RequestHandlers.initHandlersFromConfig created /replication: solr.ReplicationHandler
   [junit4]   2> 854282 T3644 oasc.SolrCore.<init> [solrj_collection_shard1_replica2] Opening new SolrCore at /mnt/ssd/jenkins/workspace/Lucene-Solr-trunk-Linux/solr/build/solr-core/test/J0/./temp/solr.cloud.CollectionsAPIDistributedZkTest-BCEE7429D618ABA4-001/tempDir-005/solrj_collection_shard1_replica2/, dataDir=/mnt/ssd/jenkins/workspace/Lucene-Solr-trunk-Linux/solr/build/solr-core/test/J0/./temp/solr.cloud.CollectionsAPIDistributedZkTest-BCEE7429D618ABA4-001/tempDir-005/solrj_collection_shard1_replica2/data/
   [junit4]   2> 854282 T3596 oasc.RequestHandlers.initHandlersFromConfig created /update: solr.UpdateRequestHandler
   [junit4]   2> 854282 T3644 oasc.JmxMonitoredMap.<init> JMX monitoring is enabled. Adding Solr mbeans to JMX Server: com.sun.jmx.mbeanserver.JmxMBeanServer@1e52930
   [junit4]   2> 854283 T3596 oasc.RequestHandlers.initHandlersFromConfig created /admin/: org.apache.solr.handler.admin.AdminHandlers
   [junit4]   2> 854284 T3596 oasc.RequestHandlers.initHandlersFromConfig created /admin/file: solr.admin.ShowFileRequestHandler
   [junit4]   2> 854284 T3644 oasc.CachingDirectoryFactory.get return new directory for /mnt/ssd/jenkins/workspace/Lucene-Solr-trunk-Linux/solr/build/solr-core/test/J0/./temp/solr.cloud.CollectionsAPIDistributedZkTest-BCEE7429D618ABA4-001/tempDir-005/solrj_collection_shard1_replica2/data
   [junit4]   2> 854284 T3596 oasc.RequestHandlers.initHandlersFromConfig created /admin/fileedit: solr.admin.EditFileRequestHandler
   [junit4]   2> 854284 T3644 oasc.SolrCore.getNewIndexDir New index directory detected: old=null new=/mnt/ssd/jenkins/workspace/Lucene-Solr-trunk-Linux/solr/build/solr-core/test/J0/./temp/solr.cloud.CollectionsAPIDistributedZkTest-BCEE7429D618ABA4-001/tempDir-005/solrj_collection_shard1_replica2/data/index/
   [junit4]   2> 854285 T3644 oasc.SolrCore.initIndex WARN [solrj_collection_shard1_replica2] Solr index directory '/mnt/ssd/jenkins/workspace/Lucene-Solr-trunk-Linux/solr/build/solr-core/test/J0/./temp/solr.cloud.CollectionsAPIDistributedZkTest-BCEE7429D618ABA4-001/tempDir-005/solrj_collection_shard1_replica2/data/index' doesn't exist. Creating new index...
   [junit4]   2> 854286 T3644 oasc.CachingDirectoryFactory.get return new directory for /mnt/ssd/jenkins/workspace/Lucene-Solr-trunk-Linux/solr/build/solr-core/test/J0/./temp/solr.cloud.CollectionsAPIDistributedZkTest-BCEE7429D618ABA4-001/tempDir-005/solrj_collection_shard1_replica2/data/index
   [junit4]   2> 854286 T3644 oasu.RandomMergePolicy.<init> RandomMergePolicy wrapping class org.apache.lucene.index.LogByteSizeMergePolicy: [LogByteSizeMergePolicy: minMergeSize=1677721, mergeFactor=33, maxMergeSize=2147483648, maxMergeSizeForForcedMerge=9223372036854775807, calibrateSizeByDeletes=false, maxMergeDocs=2147483647, maxCFSSegmentSizeMB=8.796093022207999E12, noCFSRatio=1.0]
   [junit4]   2> 854287 T3659 oass.IndexSchema.readSchema default search field in schema is text
   [junit4]   2> 854287 T3644 oasc.SolrDeletionPolicy.onCommit SolrDeletionPolicy.onCommit: commits: num=1
   [junit4]   2> 		commit{dir=MockDirectoryWrapper(RAMDirectory@54f62f lockFactory=org.apache.lucene.store.SingleInstanceLockFactory@f4d02f),segFN=segments_1,generation=1}
   [junit4]   2> 854287 T3644 oasc.SolrDeletionPolicy.updateCommits newest commit generation = 1
   [junit4]   2> 854288 T3596 oashl.XMLLoader.init xsltCacheLifetimeSeconds=60
   [junit4]   2> 854289 T3659 oass.IndexSchema.readSchema unique key field: id
   [junit4]   2> 854290 T3617 oass.OpenExchangeRatesOrgProvider.init Initialized with rates=open-exchange-rates.json, refreshInterval=1440.
   [junit4]   2> 854291 T3644 oasup.UpdateRequestProcessorChain.init creating updateRequestProcessorChain "nodistrib"
   [junit4]   2> 854291 T3596 oasu.CommitTracker.<init> Hard AutoCommit: disabled
   [junit4]   2> 854291 T3644 oasup.UpdateRequestProcessorChain.init creating updateRequestProcessorChain "dedupe"
   [junit4]   2> 854292 T3596 oasu.CommitTracker.<init> Soft AutoCommit: disabled
   [junit4]   2> 854292 T3644 oasup.UpdateRequestProcessorChain.init inserting DistributedUpdateProcessorFactory into updateRequestProcessorChain "dedupe"
   [junit4]   2> 854293 T3644 oasup.UpdateRequestProcessorChain.init creating updateRequestProcessorChain "stored_sig"
   [junit4]   2> 854293 T3596 oasu.RandomMergePolicy.<init> RandomMergePolicy wrapping class org.apache.lucene.index.TieredMergePolicy: [TieredMergePolicy: maxMergeAtOnce=48, maxMergeAtOnceExplicit=36, maxMergedSegmentMB=15.5078125, floorSegmentMB=1.22265625, forceMergeDeletesPctAllowed=29.590677505325264, segmentsPerTier=21.0, maxCFSSegmentSizeMB=8.796093022207999E12, noCFSRatio=1.0
   [junit4]   2> 854293 T3644 oasup.UpdateRequestProcessorChain.init inserting DistributedUpdateProcessorFactory into updateRequestProcessorChain "stored_sig"
   [junit4]   2> 854294 T3596 oasc.SolrDeletionPolicy.onInit SolrDeletionPolicy.onInit: commits: num=1
   [junit4]   2> 		commit{dir=MockDirectoryWrapper(RAMDirectory@36fcf8 lockFactory=org.apache.lucene.store.SingleInstanceLockFactory@1c0df91),segFN=segments_1,generation=1}
   [junit4]   2> 854294 T3596 oasc.SolrDeletionPolicy.updateCommits newest commit generation = 1
   [junit4]   2> 854294 T3644 oasup.UpdateRequestProcessorChain.init creating updateRequestProcessorChain "distrib-dup-test-chain-explicit"
   [junit4]   2> 854295 T3596 oass.SolrIndexSearcher.<init> Opening Searcher@167d034[solrj_collection_shard1_replica1] main
   [junit4]   2> 854295 T3644 oasup.UpdateRequestProcessorChain.init creating updateRequestProcessorChain "distrib-dup-test-chain-implicit"
   [junit4]   2> 854295 T3617 oass.IndexSchema.readSchema default search field in schema is text
   [junit4]   2> 854296 T3644 oasup.UpdateRequestProcessorChain.init inserting DistributedUpdateProcessorFactory into updateRequestProcessorChain "distrib-dup-test-chain-implicit"
   [junit4]   2> 854295 T3596 oascc.ZkStateReader.readConfigName Load collection config from:/collections/solrj_collection
   [junit4]   2> 854296 T3644 oasc.SolrCore.loadUpdateProcessorChains no updateRequestProcessorChain defined as default, creating implicit default
   [junit4]   2> 854297 T3644 oasc.RequestHandlers.initHandlersFromConfig created standard: solr.StandardRequestHandler
   [junit4]   2> 854298 T3644 oasc.RequestHandlers.initHandlersFromConfig created /get: solr.RealTimeGetHandler
   [junit4]   2> 854298 T3644 oasc.RequestHandlers.initHandlersFromConfig adding lazy requestHandler: solr.ReplicationHandler
   [junit4]   2> 854298 T3596 oascc.ZkStateReader.readConfigName path=/collections/solrj_collection configName=conf1 specified config exists in ZooKeeper
   [junit4]   2> 854299 T3596 oasr.ManagedResourceStorage.newStorageIO Setting up ZooKeeper-based storage for the RestManager with znodeBase: /configs/conf1
   [junit4]   2> 854298 T3617 oass.IndexSchema.readSchema unique key field: id
   [junit4]   2> 854299 T3644 oasc.RequestHandlers.initHandlersFromConfig created /replication: solr.ReplicationHandler
   [junit4]   2> 854300 T3644 oasc.RequestHandlers.initHandlersFromConfig created /update: solr.UpdateRequestHandler
   [junit4]   2> 854300 T3644 oasc.RequestHandlers.initHandlersFromConfig created /admin/: org.apache.solr.handler.admin.AdminHandlers
   [junit4]   2> 854301 T3659 oass.FileExchangeRateProvider.reload Reloading exchange rates from file currency.xml
   [junit4]   2> 854301 T3644 oasc.RequestHandlers.initHandlersFromConfig created /admin/file: solr.admin.ShowFileRequestHandler
   [junit4]   2> 854301 T3596 oasr.ManagedResourceStorage$ZooKeeperStorageIO.configure Configured ZooKeeperStorageIO with znodeBase: /configs/conf1
   [junit4]   2> 854302 T3644 oasc.RequestHandlers.initHandlersFromConfig created /admin/fileedit: solr.admin.EditFileRequestHandler
   [junit4]   2> 854302 T3596 oasr.RestManager.init Initializing RestManager with initArgs: {}
   [junit4]   2> 854303 T3596 oasr.ManagedResourceStorage.load Reading _rest_managed.json using ZooKeeperStorageIO:path=/configs/conf1
   [junit4]   2> 854304 T3596 oasr.ManagedResourceStorage$ZooKeeperStorageIO.openInputStream No data found for znode /configs/conf1/_rest_managed.json
   [junit4]   2> 854304 T3644 oashl.XMLLoader.init xsltCacheLifetimeSeconds=60
   [junit4]   2> 854304 T3596 oasr.ManagedResourceStorage.load Loaded null at path _rest_managed.json using ZooKeeperStorageIO:path=/configs/conf1
   [junit4]   2> 854305 T3596 oasr.ManagedResource.notifyObserversDuringInit WARN No registered observers for /rest/managed
   [junit4]   2> 854305 T3659 oass.FileExchangeRateProvider.reload Reloading exchange rates from file currency.xml
   [junit4]   2> 854305 T3596 oasr.RestManager.init Initializing 0 registered ManagedResources
   [junit4]   2> 854307 T3644 oasu.CommitTracker.<init> Hard AutoCommit: disabled
   [junit4]   2> 854308 T3644 oasu.CommitTracker.<init> Soft AutoCommit: disabled
   [junit4]   2> 854308 T3670 oasc.SolrCore.registerSearcher [solrj_collection_shard1_replica1] Registered new searcher Searcher@167d034[solrj_collection_shard1_replica1] main{UninvertingDirectoryReader()}
   [junit4]   2> 854313 T3644 oasu.RandomMergePolicy.<init> RandomMergePolicy wrapping class org.apache.lucene.index.TieredMergePolicy: [TieredMergePolicy: maxMergeAtOnce=48, maxMergeAtOnceExplicit=36, maxMergedSegmentMB=15.5078125, floorSegmentMB=1.22265625, forceMergeDeletesPctAllowed=29.590677505325264, segmentsPerTier=21.0, maxCFSSegmentSizeMB=8.796093022207999E12, noCFSRatio=1.0
   [junit4]   2> 854313 T3659 oass.OpenExchangeRatesOrgProvider.reload Reloading exchange rates from open-exchange-rates.json
   [junit4]   2> 854314 T3644 oasc.SolrDeletionPolicy.onInit SolrDeletionPolicy.onInit: commits: num=1
   [junit4]   2> 		commit{dir=MockDirectoryWrapper(RAMDirectory@54f62f lockFactory=org.apache.lucene.store.SingleInstanceLockFactory@f4d02f),segFN=segments_1,generation=1}
   [junit4]   2> 854314 T3644 oasc.SolrDeletionPolicy.updateCommits newest commit generation = 1
   [junit4]   2> 854314 T3596 oasc.CoreContainer.registerCore registering core: solrj_collection_shard1_replica1
   [junit4]   2> 854315 T3644 oass.SolrIndexSearcher.<init> Opening Searcher@176114a[solrj_collection_shard1_replica2] main
   [junit4]   2> 854315 T3659 oass.OpenExchangeRatesOrgProvider$OpenExchangeRates.<init> WARN Unknown key IMPORTANT NOTE
   [junit4]   2> 854317 T3644 oascc.ZkStateReader.readConfigName Load collection config from:/collections/solrj_collection
   [junit4]   2> 854316 T3617 oass.FileExchangeRateProvider.reload Reloading exchange rates from file currency.xml
   [junit4]   2> 854315 T3596 oasc.ZkController.register Register replica - core:solrj_collection_shard1_replica1 address:https://127.0.0.1:40216 collection:solrj_collection shard:shard1
   [junit4]   2> 854318 T3644 oascc.ZkStateReader.readConfigName path=/collections/solrj_collection configName=conf1 specified config exists in ZooKeeper
   [junit4]   2> 854318 T3644 oasr.ManagedResourceStorage.newStorageIO Setting up ZooKeeper-based storage for the RestManager with znodeBase: /configs/conf1
   [junit4]   2> 854317 T3659 oass.OpenExchangeRatesOrgProvider$OpenExchangeRates.<init> WARN Expected key, got STRING
   [junit4]   2> 854319 T3644 oasr.ManagedResourceStorage$ZooKeeperStorageIO.configure Configured ZooKeeperStorageIO with znodeBase: /configs/conf1
   [junit4]   2> 854319 T3596 oascc.SolrZkClient.makePath makePath: /collections/solrj_collection/leader_elect/shard1/election
   [junit4]   2> 854319 T3659 oass.OpenExchangeRatesOrgProvider.reload Reloading exchange rates from open-exchange-rates.json
   [junit4]   2> 854320 T3617 oass.FileExchangeRateProvider.reload Reloading exchange rates from file currency.xml
   [junit4]   2> 854320 T3644 oasr.RestManager.init Initializing RestManager with initArgs: {}
   [junit4]   2> 854321 T3644 oasr.ManagedResourceStorage.load Reading _rest_managed.json using ZooKeeperStorageIO:path=/configs/conf1
   [junit4]   2> 854321 T3659 oass.OpenExchangeRatesOrgProvider$OpenExchangeRates.<init> WARN Unknown key IMPORTANT NOTE
   [junit4]   2> 854322 T3659 oass.OpenExchangeRatesOrgProvider$OpenExchangeRates.<init> WARN Expected key, got STRING
   [junit4]   2> 854322 T3659 oasc.CoreContainer.create Creating SolrCore 'solrj_collection_shard2_replica2' using configuration from collection solrj_collection
   [junit4]   2> 854323 T3659 oasc.SolrCore.initDirectoryFactory org.apache.solr.core.MockDirectoryFactory
   [junit4]   2> 854323 T3659 oasc.SolrCore.<init> [solrj_collection_shard2_replica2] Opening new SolrCore at /mnt/ssd/jenkins/workspace/Lucene-Solr-trunk-Linux/solr/build/solr-core/test/J0/./temp/solr.cloud.CollectionsAPIDistributedZkTest-BCEE7429D618ABA4-001/tempDir-006/solrj_collection_shard2_replica2/, dataDir=/mnt/ssd/jenkins/workspace/Lucene-Solr-trunk-Linux/solr/build/solr-core/test/J0/./temp/solr.cloud.CollectionsAPIDistributedZkTest-BCEE7429D618ABA4-001/tempDir-006/solrj_collection_shard2_replica2/data/
   [junit4]   2> 854323 T3659 oasc.JmxMonitoredMap.<init> JMX monitoring is enabled. Adding Solr mbeans to JMX Server: com.sun.jmx.mbeanserver.JmxMBeanServer@1e52930
   [junit4]   2> 854324 T3617 oass.OpenExchangeRatesOrgProvider.reload Reloading exchange rates from open-exchange-rates.json
   [junit4]   2> 854324 T3659 oasc.CachingDirectoryFactory.get ret

[...truncated too long message...]

rupted
   [junit4]   2> 	at java.lang.Thread.sleep(Native Method)
   [junit4]   2> 	at org.apache.zookeeper.client.StaticHostProvider.next(StaticHostProvider.java:101)
   [junit4]   2> 	at org.apache.zookeeper.ClientCnxn$SendThread.startConnect(ClientCnxn.java:940)
   [junit4]   2> 	at org.apache.zookeeper.ClientCnxn$SendThread.run(ClientCnxn.java:1003)
   [junit4]   2> 
   [junit4]   2> 938354 T3736 oaz.ClientCnxn$SendThread.run WARN Session 0x146a21678780011 for server null, unexpected error, closing socket connection and attempting reconnect java.net.ConnectException: Connection refused
   [junit4]   2> 	at sun.nio.ch.SocketChannelImpl.checkConnect(Native Method)
   [junit4]   2> 	at sun.nio.ch.SocketChannelImpl.finishConnect(SocketChannelImpl.java:739)
   [junit4]   2> 	at org.apache.zookeeper.ClientCnxnSocketNIO.doTransport(ClientCnxnSocketNIO.java:361)
   [junit4]   2> 	at org.apache.zookeeper.ClientCnxn$SendThread.run(ClientCnxn.java:1081)
   [junit4]   2> 
   [junit4]   2> 938854 T3736 oazc.StaticHostProvider.next WARN Unexpected exception java.lang.InterruptedException: sleep interrupted
   [junit4]   2> 	at java.lang.Thread.sleep(Native Method)
   [junit4]   2> 	at org.apache.zookeeper.client.StaticHostProvider.next(StaticHostProvider.java:101)
   [junit4]   2> 	at org.apache.zookeeper.ClientCnxn$SendThread.startConnect(ClientCnxn.java:940)
   [junit4]   2> 	at org.apache.zookeeper.ClientCnxn$SendThread.run(ClientCnxn.java:1003)
   [junit4]   2> 
   [junit4]   2> 938854 T3736 oaz.ClientCnxn$SendThread.run WARN Session 0x146a21678780011 for server null, unexpected error, closing socket connection and attempting reconnect java.net.ConnectException: Connection refused
   [junit4]   2> 	at sun.nio.ch.SocketChannelImpl.checkConnect(Native Method)
   [junit4]   2> 	at sun.nio.ch.SocketChannelImpl.finishConnect(SocketChannelImpl.java:739)
   [junit4]   2> 	at org.apache.zookeeper.ClientCnxnSocketNIO.doTransport(ClientCnxnSocketNIO.java:361)
   [junit4]   2> 	at org.apache.zookeeper.ClientCnxn$SendThread.run(ClientCnxn.java:1081)
   [junit4]   2> 
   [junit4]   2> 939354 T3736 oaz.ClientCnxn$SendThread.run WARN Unexpected exception java.lang.InterruptedException: sleep interrupted
   [junit4]   2> 	at java.lang.Thread.sleep(Native Method)
   [junit4]   2> 	at org.apache.zookeeper.ClientCnxn$SendThread.run(ClientCnxn.java:994)
   [junit4]   2> 
   [junit4]   2> 102415 T3574 ccr.ThreadLeakControl.tryToInterruptAll SEVERE There are still zombie threads that couldn't be terminated:
   [junit4]   2> 	   1) Thread[id=3736, name=TEST-CollectionsAPIDistributedZkTest.testDistribSearch-seed#[BCEE7429D618ABA4]-SendThread(127.0.0.1:34352), state=TIMED_WAITING, group=TGRP-CollectionsAPIDistributedZkTest]
   [junit4]   2> 	        at java.lang.Thread.sleep(Native Method)
   [junit4]   2> 	        at org.apache.zookeeper.client.StaticHostProvider.next(StaticHostProvider.java:101)
   [junit4]   2> 	        at org.apache.zookeeper.ClientCnxn$SendThread.startConnect(ClientCnxn.java:940)
   [junit4]   2> 	        at org.apache.zookeeper.ClientCnxn$SendThread.run(ClientCnxn.java:1003)
   [junit4]   2> NOTE: test params are: codec=Asserting(Lucene49), sim=DefaultSimilarity, locale=sk, timezone=GB
   [junit4]   2> NOTE: Linux 3.8.0-41-generic i386/Oracle Corporation 1.7.0_60 (32-bit)/cpus=8,threads=2,free=127030720,total=238997504
   [junit4]   2> NOTE: All tests run in this JVM: [TestExtendedDismaxParser, TestStandardQParsers, QueryElevationComponentTest, TestSimpleQParserPlugin, TestPostingsSolrHighlighter, TestCoreContainer, AutoCommitTest, TestFaceting, TestReversedWildcardFilterFactory, TestSolrXmlPersistence, TestTrie, ShardRoutingTest, SSLMigrationTest, SolrCoreTest, CopyFieldTest, TestSchemaSimilarityResource, CoreMergeIndexesAdminHandlerTest, TestManagedSchemaFieldResource, TestShardHandlerFactory, FastVectorHighlighterTest, QueryResultKeyTest, CircularListTest, ReplicationFactorTest, TestManagedSynonymFilterFactory, TestSolrDeletionPolicy1, UUIDFieldTest, DocValuesTest, FunctionTest, TermVectorComponentTest, TestRealTimeGet, TestDocBasedVersionConstraints, JsonLoaderTest, DocValuesMissingTest, SpellingQueryConverterTest, ClusterStateUpdateTest, TestStressVersions, TestCharFilters, ShowFileRequestHandlerTest, ResponseLogComponentTest, BasicDistributedZkTest, DistribDocExpirationUpdateProcessorTest, PrimitiveFieldTypeTest, StatelessScriptUpdateProcessorFactoryTest, SuggesterTest, SearchHandlerTest, TestUtils, HdfsSyncSliceTest, CursorPagingTest, CachingDirectoryFactoryTest, TestGroupingSearch, TestFunctionQuery, TestFieldTypeResource, HighlighterMaxOffsetTest, CoreAdminHandlerTest, RecoveryZkTest, ChangedSchemaMergeTest, TestModifyConfFiles, SampleTest, RegexBoostProcessorTest, TestSurroundQueryParser, AbstractAnalyticsStatsTest, FileBasedSpellCheckerTest, TestLFUCache, DistributedQueryElevationComponentTest, QueryFacetTest, SchemaVersionSpecificBehaviorTest, TestValueSourceCache, RAMDirectoryFactoryTest, OverseerTest, AddSchemaFieldsUpdateProcessorFactoryTest, ClusterStateTest, QueryParsingTest, URLClassifyProcessorTest, NoFacetTest, TestFastLRUCache, PeerSyncTest, SliceStateUpdateTest, SuggesterFSTTest, SuggestComponentTest, HttpPartitionTest, HdfsLockFactoryTest, TestCopyFieldCollectionResource, WordBreakSolrSpellCheckerTest, ParsingFieldUpdateProcessorsTest, SynonymTokenizerTest, TestSolrQueryParser, PolyFieldTest, TestCollapseQParserPlugin, TestSolrXml, LeaderElectionTest, TestCloudInspectUtil, ExternalFileFieldSortTest, TestReRankQParserPlugin, TestOverriddenPrefixQueryForCustomFieldType, SpatialFilterTest, TestWriterPerf, TestJoin, FieldFacetExtrasTest, CollectionsAPIDistributedZkTest]
   [junit4]   2> NOTE: reproduce with: ant test  -Dtestcase=CollectionsAPIDistributedZkTest -Dtests.seed=BCEE7429D618ABA4 -Dtests.multiplier=3 -Dtests.slow=true -Dtests.locale=sk -Dtests.timezone=GB -Dtests.file.encoding=UTF-8
   [junit4] ERROR   0.00s J0 | CollectionsAPIDistributedZkTest (suite) <<<
   [junit4]    > Throwable #1: java.lang.AssertionError: ERROR: SolrZkClient opens=19 closes=18
   [junit4]    > 	at __randomizedtesting.SeedInfo.seed([BCEE7429D618ABA4]:0)
   [junit4]    > 	at org.apache.solr.SolrTestCaseJ4.endTrackingZkClients(SolrTestCaseJ4.java:451)
   [junit4]    > 	at org.apache.solr.SolrTestCaseJ4.afterClass(SolrTestCaseJ4.java:185)
   [junit4]    > 	at java.lang.Thread.run(Thread.java:745)Throwable #2: com.carrotsearch.randomizedtesting.ThreadLeakError: 2 threads leaked from SUITE scope at org.apache.solr.cloud.CollectionsAPIDistributedZkTest: 
   [junit4]    >    1) Thread[id=3737, name=TEST-CollectionsAPIDistributedZkTest.testDistribSearch-seed#[BCEE7429D618ABA4]-EventThread, state=WAITING, group=TGRP-CollectionsAPIDistributedZkTest]
   [junit4]    >         at sun.misc.Unsafe.park(Native Method)
   [junit4]    >         at java.util.concurrent.locks.LockSupport.park(LockSupport.java:186)
   [junit4]    >         at java.util.concurrent.locks.AbstractQueuedSynchronizer$ConditionObject.await(AbstractQueuedSynchronizer.java:2043)
   [junit4]    >         at java.util.concurrent.LinkedBlockingQueue.take(LinkedBlockingQueue.java:442)
   [junit4]    >         at org.apache.zookeeper.ClientCnxn$EventThread.run(ClientCnxn.java:494)
   [junit4]    >    2) Thread[id=3736, name=TEST-CollectionsAPIDistributedZkTest.testDistribSearch-seed#[BCEE7429D618ABA4]-SendThread(127.0.0.1:34352), state=TIMED_WAITING, group=TGRP-CollectionsAPIDistributedZkTest]
   [junit4]    >         at java.lang.Thread.sleep(Native Method)
   [junit4]    >         at org.apache.zookeeper.ClientCnxn$SendThread.run(ClientCnxn.java:994)
   [junit4]    > 	at __randomizedtesting.SeedInfo.seed([BCEE7429D618ABA4]:0)Throwable #3: com.carrotsearch.randomizedtesting.ThreadLeakError: There are still zombie threads that couldn't be terminated:
   [junit4]    >    1) Thread[id=3736, name=TEST-CollectionsAPIDistributedZkTest.testDistribSearch-seed#[BCEE7429D618ABA4]-SendThread(127.0.0.1:34352), state=TIMED_WAITING, group=TGRP-CollectionsAPIDistributedZkTest]
   [junit4]    >         at java.lang.Thread.sleep(Native Method)
   [junit4]    >         at org.apache.zookeeper.client.StaticHostProvider.next(StaticHostProvider.java:101)
   [junit4]    >         at org.apache.zookeeper.ClientCnxn$SendThread.startConnect(ClientCnxn.java:940)
   [junit4]    >         at org.apache.zookeeper.ClientCnxn$SendThread.run(ClientCnxn.java:1003)
   [junit4]    > 	at __randomizedtesting.SeedInfo.seed([BCEE7429D618ABA4]:0)
   [junit4] Completed on J0 in 102.45s, 1 test, 1 failure, 3 errors <<< FAILURES!

[...truncated 618 lines...]
BUILD FAILED
/mnt/ssd/jenkins/workspace/Lucene-Solr-trunk-Linux/build.xml:467: The following error occurred while executing this line:
/mnt/ssd/jenkins/workspace/Lucene-Solr-trunk-Linux/build.xml:447: The following error occurred while executing this line:
/mnt/ssd/jenkins/workspace/Lucene-Solr-trunk-Linux/build.xml:45: The following error occurred while executing this line:
/mnt/ssd/jenkins/workspace/Lucene-Solr-trunk-Linux/extra-targets.xml:37: The following error occurred while executing this line:
/mnt/ssd/jenkins/workspace/Lucene-Solr-trunk-Linux/solr/build.xml:189: The following error occurred while executing this line:
/mnt/ssd/jenkins/workspace/Lucene-Solr-trunk-Linux/solr/common-build.xml:496: The following error occurred while executing this line:
/mnt/ssd/jenkins/workspace/Lucene-Solr-trunk-Linux/lucene/common-build.xml:1296: The following error occurred while executing this line:
/mnt/ssd/jenkins/workspace/Lucene-Solr-trunk-Linux/lucene/common-build.xml:920: There were test failures: 416 suites, 1703 tests, 3 suite-level errors, 1 error, 786 ignored (15 assumptions)

Total time: 52 minutes 19 seconds
Build step 'Invoke Ant' marked build as failure
Description set: Java: 32bit/jdk1.7.0_60 -server -XX:+UseConcMarkSweepGC
Archiving artifacts
Recording test results
Email was triggered for: Failure - Any
Sending email for trigger: Failure - Any



Mime
View raw message