lucene-dev mailing list archives

Site index · List index
Message view « Date » · « Thread »
Top « Date » · « Thread »
From Policeman Jenkins Server <jenk...@thetaphi.de>
Subject [JENKINS] Lucene-Solr-4.x-Linux (32bit/jdk1.7.0_60-ea-b15) - Build # 10322 - Still Failing!
Date Sun, 01 Jun 2014 06:42:34 GMT
Build: http://jenkins.thetaphi.de/job/Lucene-Solr-4.x-Linux/10322/
Java: 32bit/jdk1.7.0_60-ea-b15 -client -XX:+UseParallelGC

3 tests failed.
FAILED:  junit.framework.TestSuite.org.apache.solr.rest.TestManagedResourceStorage

Error Message:
SolrCore.getOpenCount()==2

Stack Trace:
java.lang.RuntimeException: SolrCore.getOpenCount()==2
	at __randomizedtesting.SeedInfo.seed([7148FCF4A7E92BFC]:0)
	at org.apache.solr.util.TestHarness.close(TestHarness.java:332)
	at org.apache.solr.SolrTestCaseJ4.deleteCore(SolrTestCaseJ4.java:615)
	at org.apache.solr.SolrTestCaseJ4.afterClass(SolrTestCaseJ4.java:179)
	at sun.reflect.GeneratedMethodAccessor27.invoke(Unknown Source)
	at sun.reflect.DelegatingMethodAccessorImpl.invoke(DelegatingMethodAccessorImpl.java:43)
	at java.lang.reflect.Method.invoke(Method.java:606)
	at com.carrotsearch.randomizedtesting.RandomizedRunner.invoke(RandomizedRunner.java:1618)
	at com.carrotsearch.randomizedtesting.RandomizedRunner$5.evaluate(RandomizedRunner.java:790)
	at com.carrotsearch.randomizedtesting.rules.StatementAdapter.evaluate(StatementAdapter.java:36)
	at com.carrotsearch.randomizedtesting.rules.SystemPropertiesRestoreRule$1.evaluate(SystemPropertiesRestoreRule.java:53)
	at org.apache.lucene.util.AbstractBeforeAfterRule$1.evaluate(AbstractBeforeAfterRule.java:46)
	at org.apache.lucene.util.TestRuleStoreClassName$1.evaluate(TestRuleStoreClassName.java:42)
	at com.carrotsearch.randomizedtesting.rules.SystemPropertiesInvariantRule$1.evaluate(SystemPropertiesInvariantRule.java:55)
	at com.carrotsearch.randomizedtesting.rules.NoShadowingOrOverridesOnMethodsRule$1.evaluate(NoShadowingOrOverridesOnMethodsRule.java:39)
	at com.carrotsearch.randomizedtesting.rules.NoShadowingOrOverridesOnMethodsRule$1.evaluate(NoShadowingOrOverridesOnMethodsRule.java:39)
	at com.carrotsearch.randomizedtesting.rules.StatementAdapter.evaluate(StatementAdapter.java:36)
	at com.carrotsearch.randomizedtesting.rules.StatementAdapter.evaluate(StatementAdapter.java:36)
	at com.carrotsearch.randomizedtesting.rules.StatementAdapter.evaluate(StatementAdapter.java:36)
	at org.apache.lucene.util.TestRuleAssertionsRequired$1.evaluate(TestRuleAssertionsRequired.java:43)
	at org.apache.lucene.util.TestRuleMarkFailure$1.evaluate(TestRuleMarkFailure.java:48)
	at org.apache.lucene.util.TestRuleIgnoreAfterMaxFailures$1.evaluate(TestRuleIgnoreAfterMaxFailures.java:65)
	at org.apache.lucene.util.TestRuleIgnoreTestSuites$1.evaluate(TestRuleIgnoreTestSuites.java:55)
	at com.carrotsearch.randomizedtesting.rules.StatementAdapter.evaluate(StatementAdapter.java:36)
	at com.carrotsearch.randomizedtesting.ThreadLeakControl$StatementRunner.run(ThreadLeakControl.java:360)
	at java.lang.Thread.run(Thread.java:745)


FAILED:  junit.framework.TestSuite.org.apache.solr.rest.TestManagedResourceStorage

Error Message:
4 threads leaked from SUITE scope at org.apache.solr.rest.TestManagedResourceStorage:     1) Thread[id=2263, name=searcherExecutor-1250-thread-1, state=WAITING, group=TGRP-TestManagedResourceStorage]         at sun.misc.Unsafe.park(Native Method)         at java.util.concurrent.locks.LockSupport.park(LockSupport.java:186)         at java.util.concurrent.locks.AbstractQueuedSynchronizer$ConditionObject.await(AbstractQueuedSynchronizer.java:2043)         at java.util.concurrent.LinkedBlockingQueue.take(LinkedBlockingQueue.java:442)         at java.util.concurrent.ThreadPoolExecutor.getTask(ThreadPoolExecutor.java:1068)         at java.util.concurrent.ThreadPoolExecutor.runWorker(ThreadPoolExecutor.java:1130)         at java.util.concurrent.ThreadPoolExecutor$Worker.run(ThreadPoolExecutor.java:615)         at java.lang.Thread.run(Thread.java:745)    2) Thread[id=2266, name=coreZkRegister-1245-thread-1, state=WAITING, group=TGRP-TestManagedResourceStorage]         at sun.misc.Unsafe.park(Native Method)         at java.util.concurrent.locks.LockSupport.park(LockSupport.java:186)         at java.util.concurrent.locks.AbstractQueuedSynchronizer$ConditionObject.await(AbstractQueuedSynchronizer.java:2043)         at java.util.concurrent.LinkedBlockingQueue.take(LinkedBlockingQueue.java:442)         at java.util.concurrent.ThreadPoolExecutor.getTask(ThreadPoolExecutor.java:1068)         at java.util.concurrent.ThreadPoolExecutor.runWorker(ThreadPoolExecutor.java:1130)         at java.util.concurrent.ThreadPoolExecutor$Worker.run(ThreadPoolExecutor.java:615)         at java.lang.Thread.run(Thread.java:745)    3) Thread[id=2260, name=Thread-1080, state=TIMED_WAITING, group=Overseer state updater.]         at java.lang.Object.wait(Native Method)         at org.apache.solr.cloud.DistributedQueue$LatchChildWatcher.await(DistributedQueue.java:240)         at org.apache.solr.cloud.DistributedQueue.peek(DistributedQueue.java:563)         at org.apache.solr.cloud.DistributedQueue.peek(DistributedQueue.java:527)         at org.apache.solr.cloud.Overseer$ClusterStateUpdater.run(Overseer.java:216)         at java.lang.Thread.run(Thread.java:745)    4) Thread[id=2264, name=Thread-1081, state=WAITING, group=TGRP-TestManagedResourceStorage]         at java.lang.Object.wait(Native Method)         at java.lang.Object.wait(Object.java:503)         at org.apache.solr.core.CloserThread.run(CoreContainer.java:944)

Stack Trace:
com.carrotsearch.randomizedtesting.ThreadLeakError: 4 threads leaked from SUITE scope at org.apache.solr.rest.TestManagedResourceStorage: 
   1) Thread[id=2263, name=searcherExecutor-1250-thread-1, state=WAITING, group=TGRP-TestManagedResourceStorage]
        at sun.misc.Unsafe.park(Native Method)
        at java.util.concurrent.locks.LockSupport.park(LockSupport.java:186)
        at java.util.concurrent.locks.AbstractQueuedSynchronizer$ConditionObject.await(AbstractQueuedSynchronizer.java:2043)
        at java.util.concurrent.LinkedBlockingQueue.take(LinkedBlockingQueue.java:442)
        at java.util.concurrent.ThreadPoolExecutor.getTask(ThreadPoolExecutor.java:1068)
        at java.util.concurrent.ThreadPoolExecutor.runWorker(ThreadPoolExecutor.java:1130)
        at java.util.concurrent.ThreadPoolExecutor$Worker.run(ThreadPoolExecutor.java:615)
        at java.lang.Thread.run(Thread.java:745)
   2) Thread[id=2266, name=coreZkRegister-1245-thread-1, state=WAITING, group=TGRP-TestManagedResourceStorage]
        at sun.misc.Unsafe.park(Native Method)
        at java.util.concurrent.locks.LockSupport.park(LockSupport.java:186)
        at java.util.concurrent.locks.AbstractQueuedSynchronizer$ConditionObject.await(AbstractQueuedSynchronizer.java:2043)
        at java.util.concurrent.LinkedBlockingQueue.take(LinkedBlockingQueue.java:442)
        at java.util.concurrent.ThreadPoolExecutor.getTask(ThreadPoolExecutor.java:1068)
        at java.util.concurrent.ThreadPoolExecutor.runWorker(ThreadPoolExecutor.java:1130)
        at java.util.concurrent.ThreadPoolExecutor$Worker.run(ThreadPoolExecutor.java:615)
        at java.lang.Thread.run(Thread.java:745)
   3) Thread[id=2260, name=Thread-1080, state=TIMED_WAITING, group=Overseer state updater.]
        at java.lang.Object.wait(Native Method)
        at org.apache.solr.cloud.DistributedQueue$LatchChildWatcher.await(DistributedQueue.java:240)
        at org.apache.solr.cloud.DistributedQueue.peek(DistributedQueue.java:563)
        at org.apache.solr.cloud.DistributedQueue.peek(DistributedQueue.java:527)
        at org.apache.solr.cloud.Overseer$ClusterStateUpdater.run(Overseer.java:216)
        at java.lang.Thread.run(Thread.java:745)
   4) Thread[id=2264, name=Thread-1081, state=WAITING, group=TGRP-TestManagedResourceStorage]
        at java.lang.Object.wait(Native Method)
        at java.lang.Object.wait(Object.java:503)
        at org.apache.solr.core.CloserThread.run(CoreContainer.java:944)
	at __randomizedtesting.SeedInfo.seed([7148FCF4A7E92BFC]:0)


FAILED:  junit.framework.TestSuite.org.apache.solr.rest.TestManagedResourceStorage

Error Message:
There are still zombie threads that couldn't be terminated:    1) Thread[id=2266, name=coreZkRegister-1245-thread-1, state=WAITING, group=TGRP-TestManagedResourceStorage]         at sun.misc.Unsafe.park(Native Method)         at java.util.concurrent.locks.LockSupport.park(LockSupport.java:186)         at java.util.concurrent.locks.AbstractQueuedSynchronizer$ConditionObject.await(AbstractQueuedSynchronizer.java:2043)         at java.util.concurrent.LinkedBlockingQueue.take(LinkedBlockingQueue.java:442)         at java.util.concurrent.ThreadPoolExecutor.getTask(ThreadPoolExecutor.java:1068)         at java.util.concurrent.ThreadPoolExecutor.runWorker(ThreadPoolExecutor.java:1130)         at java.util.concurrent.ThreadPoolExecutor$Worker.run(ThreadPoolExecutor.java:615)         at java.lang.Thread.run(Thread.java:745)    2) Thread[id=2263, name=searcherExecutor-1250-thread-1, state=WAITING, group=TGRP-TestManagedResourceStorage]         at sun.misc.Unsafe.park(Native Method)         at java.util.concurrent.locks.LockSupport.park(LockSupport.java:186)         at java.util.concurrent.locks.AbstractQueuedSynchronizer$ConditionObject.await(AbstractQueuedSynchronizer.java:2043)         at java.util.concurrent.LinkedBlockingQueue.take(LinkedBlockingQueue.java:442)         at java.util.concurrent.ThreadPoolExecutor.getTask(ThreadPoolExecutor.java:1068)         at java.util.concurrent.ThreadPoolExecutor.runWorker(ThreadPoolExecutor.java:1130)         at java.util.concurrent.ThreadPoolExecutor$Worker.run(ThreadPoolExecutor.java:615)         at java.lang.Thread.run(Thread.java:745)    3) Thread[id=2264, name=Thread-1081, state=WAITING, group=TGRP-TestManagedResourceStorage]         at java.lang.Object.wait(Native Method)         at java.lang.Object.wait(Object.java:503)         at org.apache.solr.core.CloserThread.run(CoreContainer.java:944)

Stack Trace:
com.carrotsearch.randomizedtesting.ThreadLeakError: There are still zombie threads that couldn't be terminated:
   1) Thread[id=2266, name=coreZkRegister-1245-thread-1, state=WAITING, group=TGRP-TestManagedResourceStorage]
        at sun.misc.Unsafe.park(Native Method)
        at java.util.concurrent.locks.LockSupport.park(LockSupport.java:186)
        at java.util.concurrent.locks.AbstractQueuedSynchronizer$ConditionObject.await(AbstractQueuedSynchronizer.java:2043)
        at java.util.concurrent.LinkedBlockingQueue.take(LinkedBlockingQueue.java:442)
        at java.util.concurrent.ThreadPoolExecutor.getTask(ThreadPoolExecutor.java:1068)
        at java.util.concurrent.ThreadPoolExecutor.runWorker(ThreadPoolExecutor.java:1130)
        at java.util.concurrent.ThreadPoolExecutor$Worker.run(ThreadPoolExecutor.java:615)
        at java.lang.Thread.run(Thread.java:745)
   2) Thread[id=2263, name=searcherExecutor-1250-thread-1, state=WAITING, group=TGRP-TestManagedResourceStorage]
        at sun.misc.Unsafe.park(Native Method)
        at java.util.concurrent.locks.LockSupport.park(LockSupport.java:186)
        at java.util.concurrent.locks.AbstractQueuedSynchronizer$ConditionObject.await(AbstractQueuedSynchronizer.java:2043)
        at java.util.concurrent.LinkedBlockingQueue.take(LinkedBlockingQueue.java:442)
        at java.util.concurrent.ThreadPoolExecutor.getTask(ThreadPoolExecutor.java:1068)
        at java.util.concurrent.ThreadPoolExecutor.runWorker(ThreadPoolExecutor.java:1130)
        at java.util.concurrent.ThreadPoolExecutor$Worker.run(ThreadPoolExecutor.java:615)
        at java.lang.Thread.run(Thread.java:745)
   3) Thread[id=2264, name=Thread-1081, state=WAITING, group=TGRP-TestManagedResourceStorage]
        at java.lang.Object.wait(Native Method)
        at java.lang.Object.wait(Object.java:503)
        at org.apache.solr.core.CloserThread.run(CoreContainer.java:944)
	at __randomizedtesting.SeedInfo.seed([7148FCF4A7E92BFC]:0)




Build Log:
[...truncated 11088 lines...]
   [junit4] Suite: org.apache.solr.rest.TestManagedResourceStorage
   [junit4]   2> Creating dataDir: /mnt/ssd/jenkins/workspace/Lucene-Solr-4.x-Linux/solr/build/solr-core/test/J1/./solr.rest.TestManagedResourceStorage-7148FCF4A7E92BFC-001/init-core-data-001
   [junit4]   2> 733457 T2246 oas.SolrTestCaseJ4.buildSSLConfig Randomized ssl (true) and clientAuth (false)
   [junit4]   2> 733458 T2246 oasc.ZkTestServer.run STARTING ZK TEST SERVER
   [junit4]   1> client port:0.0.0.0/0.0.0.0:0
   [junit4]   2> 733459 T2247 oasc.ZkTestServer$ZKServerMain.runFromConfig Starting server
   [junit4]   2> 733559 T2246 oasc.ZkTestServer.run start zk server on port:33722
   [junit4]   2> 733560 T2246 oascc.ConnectionManager.waitForConnected Waiting for client to connect to ZooKeeper
   [junit4]   2> 733621 T2253 oascc.ConnectionManager.process Watcher org.apache.solr.common.cloud.ConnectionManager@18c930 name:ZooKeeperConnection Watcher:127.0.0.1:33722 got event WatchedEvent state:SyncConnected type:None path:null path:null type:None
   [junit4]   2> 733622 T2246 oascc.ConnectionManager.waitForConnected Client is connected to ZooKeeper
   [junit4]   2> 733622 T2246 oascc.SolrZkClient.makePath makePath: /solr
   [junit4]   2> 733629 T2246 oascc.ConnectionManager.waitForConnected Waiting for client to connect to ZooKeeper
   [junit4]   2> 733631 T2255 oascc.ConnectionManager.process Watcher org.apache.solr.common.cloud.ConnectionManager@74f5ae name:ZooKeeperConnection Watcher:127.0.0.1:33722/solr got event WatchedEvent state:SyncConnected type:None path:null path:null type:None
   [junit4]   2> 733631 T2246 oascc.ConnectionManager.waitForConnected Client is connected to ZooKeeper
   [junit4]   2> 733632 T2246 oascc.SolrZkClient.makePath makePath: /collections/collection1
   [junit4]   2> 733637 T2246 oascc.SolrZkClient.makePath makePath: /collections/collection1/shards
   [junit4]   2> 733640 T2246 oascc.SolrZkClient.makePath makePath: /collections/control_collection
   [junit4]   2> 733643 T2246 oascc.SolrZkClient.makePath makePath: /collections/control_collection/shards
   [junit4]   2> 733647 T2246 oasc.AbstractZkTestCase.putConfig put /mnt/ssd/jenkins/workspace/Lucene-Solr-4.x-Linux/solr/core/src/test-files/solr/collection1/conf/solrconfig.xml to /configs/conf1/solrconfig.xml
   [junit4]   2> 733648 T2246 oascc.SolrZkClient.makePath makePath: /configs/conf1/solrconfig.xml
   [junit4]   2> 733654 T2246 oasc.AbstractZkTestCase.putConfig put /mnt/ssd/jenkins/workspace/Lucene-Solr-4.x-Linux/solr/core/src/test-files/solr/collection1/conf/schema.xml to /configs/conf1/schema.xml
   [junit4]   2> 733655 T2246 oascc.SolrZkClient.makePath makePath: /configs/conf1/schema.xml
   [junit4]   2> 733659 T2246 oasc.AbstractZkTestCase.putConfig put /mnt/ssd/jenkins/workspace/Lucene-Solr-4.x-Linux/solr/core/src/test-files/solr/collection1/conf/solrconfig.snippet.randomindexconfig.xml to /configs/conf1/solrconfig.snippet.randomindexconfig.xml
   [junit4]   2> 733660 T2246 oascc.SolrZkClient.makePath makePath: /configs/conf1/solrconfig.snippet.randomindexconfig.xml
   [junit4]   2> 733664 T2246 oasc.AbstractZkTestCase.putConfig put /mnt/ssd/jenkins/workspace/Lucene-Solr-4.x-Linux/solr/core/src/test-files/solr/collection1/conf/stopwords.txt to /configs/conf1/stopwords.txt
   [junit4]   2> 733665 T2246 oascc.SolrZkClient.makePath makePath: /configs/conf1/stopwords.txt
   [junit4]   2> 733668 T2246 oasc.AbstractZkTestCase.putConfig put /mnt/ssd/jenkins/workspace/Lucene-Solr-4.x-Linux/solr/core/src/test-files/solr/collection1/conf/protwords.txt to /configs/conf1/protwords.txt
   [junit4]   2> 733669 T2246 oascc.SolrZkClient.makePath makePath: /configs/conf1/protwords.txt
   [junit4]   2> 733672 T2246 oasc.AbstractZkTestCase.putConfig put /mnt/ssd/jenkins/workspace/Lucene-Solr-4.x-Linux/solr/core/src/test-files/solr/collection1/conf/currency.xml to /configs/conf1/currency.xml
   [junit4]   2> 733673 T2246 oascc.SolrZkClient.makePath makePath: /configs/conf1/currency.xml
   [junit4]   2> 733676 T2246 oasc.AbstractZkTestCase.putConfig put /mnt/ssd/jenkins/workspace/Lucene-Solr-4.x-Linux/solr/core/src/test-files/solr/collection1/conf/enumsConfig.xml to /configs/conf1/enumsConfig.xml
   [junit4]   2> 733677 T2246 oascc.SolrZkClient.makePath makePath: /configs/conf1/enumsConfig.xml
   [junit4]   2> 733682 T2246 oasc.AbstractZkTestCase.putConfig put /mnt/ssd/jenkins/workspace/Lucene-Solr-4.x-Linux/solr/core/src/test-files/solr/collection1/conf/open-exchange-rates.json to /configs/conf1/open-exchange-rates.json
   [junit4]   2> 733682 T2246 oascc.SolrZkClient.makePath makePath: /configs/conf1/open-exchange-rates.json
   [junit4]   2> 733686 T2246 oasc.AbstractZkTestCase.putConfig put /mnt/ssd/jenkins/workspace/Lucene-Solr-4.x-Linux/solr/core/src/test-files/solr/collection1/conf/mapping-ISOLatin1Accent.txt to /configs/conf1/mapping-ISOLatin1Accent.txt
   [junit4]   2> 733687 T2246 oascc.SolrZkClient.makePath makePath: /configs/conf1/mapping-ISOLatin1Accent.txt
   [junit4]   2> 733691 T2246 oasc.AbstractZkTestCase.putConfig put /mnt/ssd/jenkins/workspace/Lucene-Solr-4.x-Linux/solr/core/src/test-files/solr/collection1/conf/old_synonyms.txt to /configs/conf1/old_synonyms.txt
   [junit4]   2> 733692 T2246 oascc.SolrZkClient.makePath makePath: /configs/conf1/old_synonyms.txt
   [junit4]   2> 733696 T2246 oasc.AbstractZkTestCase.putConfig put /mnt/ssd/jenkins/workspace/Lucene-Solr-4.x-Linux/solr/core/src/test-files/solr/collection1/conf/synonyms.txt to /configs/conf1/synonyms.txt
   [junit4]   2> 733697 T2246 oascc.SolrZkClient.makePath makePath: /configs/conf1/synonyms.txt
   [junit4]   2> 733702 T2246 oas.SolrTestCaseJ4.initCore ####initCore
   [junit4]   2> 733702 T2246 oasc.SolrResourceLoader.<init> new SolrResourceLoader for directory: '/mnt/ssd/jenkins/workspace/Lucene-Solr-4.x-Linux/solr/core/src/test-files/solr/collection1/'
   [junit4]   2> 733704 T2246 oasc.SolrResourceLoader.replaceClassLoader Adding 'file:/mnt/ssd/jenkins/workspace/Lucene-Solr-4.x-Linux/solr/core/src/test-files/solr/collection1/lib/.svn/' to classloader
   [junit4]   2> 733704 T2246 oasc.SolrResourceLoader.replaceClassLoader Adding 'file:/mnt/ssd/jenkins/workspace/Lucene-Solr-4.x-Linux/solr/core/src/test-files/solr/collection1/lib/classes/' to classloader
   [junit4]   2> 733705 T2246 oasc.SolrResourceLoader.replaceClassLoader Adding 'file:/mnt/ssd/jenkins/workspace/Lucene-Solr-4.x-Linux/solr/core/src/test-files/solr/collection1/lib/README' to classloader
   [junit4]   2> 733769 T2246 oasc.SolrConfig.<init> Using Lucene MatchVersion: LUCENE_4_9
   [junit4]   2> 733812 T2246 oasc.SolrConfig.<init> Loaded SolrConfig: solrconfig.xml
   [junit4]   2> 733813 T2246 oass.IndexSchema.readSchema Reading Solr Schema from schema.xml
   [junit4]   2> 733820 T2246 oass.IndexSchema.readSchema [null] Schema name=test
   [junit4]   2> 734091 T2246 oass.ByteField.init WARN ByteField is deprecated and will be removed in 5.0. You should use TrieIntField instead.
   [junit4]   2> 734092 T2246 oass.ShortField.init WARN ShortField is deprecated and will be removed in 5.0. You should use TrieIntField instead.
   [junit4]   2> 734092 T2246 oass.OpenExchangeRatesOrgProvider.init Initialized with rates=open-exchange-rates.json, refreshInterval=1440.
   [junit4]   2> 734098 T2246 oass.IndexSchema.readSchema default search field in schema is text
   [junit4]   2> 734100 T2246 oass.IndexSchema.readSchema unique key field: id
   [junit4]   2> 734105 T2246 oass.FileExchangeRateProvider.reload Reloading exchange rates from file currency.xml
   [junit4]   2> 734107 T2246 oass.FileExchangeRateProvider.reload Reloading exchange rates from file currency.xml
   [junit4]   2> 734109 T2246 oass.OpenExchangeRatesOrgProvider.reload Reloading exchange rates from open-exchange-rates.json
   [junit4]   2> 734110 T2246 oass.OpenExchangeRatesOrgProvider$OpenExchangeRates.<init> WARN Unknown key IMPORTANT NOTE
   [junit4]   2> 734110 T2246 oass.OpenExchangeRatesOrgProvider$OpenExchangeRates.<init> WARN Expected key, got STRING
   [junit4]   2> 734110 T2246 oass.OpenExchangeRatesOrgProvider.reload Reloading exchange rates from open-exchange-rates.json
   [junit4]   2> 734110 T2246 oass.OpenExchangeRatesOrgProvider$OpenExchangeRates.<init> WARN Unknown key IMPORTANT NOTE
   [junit4]   2> 734111 T2246 oass.OpenExchangeRatesOrgProvider$OpenExchangeRates.<init> WARN Expected key, got STRING
   [junit4]   2> 734111 T2246 oasc.SolrResourceLoader.locateSolrHome JNDI not configured for solr (NoInitialContextEx)
   [junit4]   2> 734111 T2246 oasc.SolrResourceLoader.locateSolrHome using system property solr.solr.home: /mnt/ssd/jenkins/workspace/Lucene-Solr-4.x-Linux/solr/core/src/test-files/solr
   [junit4]   2> 734111 T2246 oasc.SolrResourceLoader.<init> new SolrResourceLoader for directory: '/mnt/ssd/jenkins/workspace/Lucene-Solr-4.x-Linux/solr/core/src/test-files/solr/'
   [junit4]   2> 734155 T2246 oasc.CoreContainer.<init> New CoreContainer 19697682
   [junit4]   2> 734155 T2246 oasc.CoreContainer.load Loading cores into CoreContainer [instanceDir=/mnt/ssd/jenkins/workspace/Lucene-Solr-4.x-Linux/solr/core/src/test-files/solr/]
   [junit4]   2> 734156 T2246 oashc.HttpShardHandlerFactory.getParameter Setting socketTimeout to: 0
   [junit4]   2> 734156 T2246 oashc.HttpShardHandlerFactory.getParameter Setting urlScheme to: null
   [junit4]   2> 734156 T2246 oashc.HttpShardHandlerFactory.getParameter Setting connTimeout to: 0
   [junit4]   2> 734156 T2246 oashc.HttpShardHandlerFactory.getParameter Setting maxConnectionsPerHost to: 20
   [junit4]   2> 734157 T2246 oashc.HttpShardHandlerFactory.getParameter Setting corePoolSize to: 0
   [junit4]   2> 734157 T2246 oashc.HttpShardHandlerFactory.getParameter Setting maximumPoolSize to: 2147483647
   [junit4]   2> 734157 T2246 oashc.HttpShardHandlerFactory.getParameter Setting maxThreadIdleTime to: 5
   [junit4]   2> 734157 T2246 oashc.HttpShardHandlerFactory.getParameter Setting sizeOfQueue to: -1
   [junit4]   2> 734157 T2246 oashc.HttpShardHandlerFactory.getParameter Setting fairnessPolicy to: false
   [junit4]   2> 734159 T2246 oasl.LogWatcher.createWatcher SLF4J impl is org.slf4j.impl.Log4jLoggerFactory
   [junit4]   2> 734160 T2246 oasl.LogWatcher.newRegisteredLogWatcher Registering Log Listener [Log4j (org.slf4j.impl.Log4jLoggerFactory)]
   [junit4]   2> 734160 T2246 oasc.CoreContainer.load Host Name: 
   [junit4]   2> 734160 T2246 oasc.ZkContainer.initZooKeeper Zookeeper client=127.0.0.1:33722/solr
   [junit4]   2> 734160 T2246 oasc.ZkController.checkChrootPath zkHost includes chroot
   [junit4]   2> 734161 T2246 oascc.ConnectionManager.waitForConnected Waiting for client to connect to ZooKeeper
   [junit4]   2> 734163 T2257 oascc.ConnectionManager.process Watcher org.apache.solr.common.cloud.ConnectionManager@53941a name:ZooKeeperConnection Watcher:127.0.0.1:33722 got event WatchedEvent state:SyncConnected type:None path:null path:null type:None
   [junit4]   2> 734164 T2246 oascc.ConnectionManager.waitForConnected Client is connected to ZooKeeper
   [junit4]   2> 734168 T2246 oascc.ConnectionManager.waitForConnected Waiting for client to connect to ZooKeeper
   [junit4]   2> 734169 T2259 oascc.ConnectionManager.process Watcher org.apache.solr.common.cloud.ConnectionManager@1d531df name:ZooKeeperConnection Watcher:127.0.0.1:33722/solr got event WatchedEvent state:SyncConnected type:None path:null path:null type:None
   [junit4]   2> 734169 T2246 oascc.ConnectionManager.waitForConnected Client is connected to ZooKeeper
   [junit4]   2> 734172 T2246 oascc.SolrZkClient.makePath makePath: /overseer/queue
   [junit4]   2> 734176 T2246 oascc.SolrZkClient.makePath makePath: /overseer/collection-queue-work
   [junit4]   2> 734180 T2246 oascc.SolrZkClient.makePath makePath: /overseer/collection-map-running
   [junit4]   2> 734184 T2246 oascc.SolrZkClient.makePath makePath: /overseer/collection-map-completed
   [junit4]   2> 734188 T2246 oascc.SolrZkClient.makePath makePath: /overseer/collection-map-failure
   [junit4]   2> 734194 T2246 oascc.SolrZkClient.makePath makePath: /live_nodes
   [junit4]   2> 734196 T2246 oasc.ZkController.createEphemeralLiveNode Register node as live in ZooKeeper:/live_nodes/188.138.97.18:_
   [junit4]   2> 734198 T2246 oascc.SolrZkClient.makePath makePath: /live_nodes/188.138.97.18:_
   [junit4]   2> 734202 T2246 oascc.SolrZkClient.makePath makePath: /overseer_elect
   [junit4]   2> 734205 T2246 oascc.SolrZkClient.makePath makePath: /overseer_elect/election
   [junit4]   2> 734210 T2246 oasc.OverseerElectionContext.runLeaderProcess I am going to be the leader 188.138.97.18:_
   [junit4]   2> 734211 T2246 oascc.SolrZkClient.makePath makePath: /overseer_elect/leader
   [junit4]   2> 734214 T2246 oasc.Overseer.start Overseer (id=91855558968999939-188.138.97.18:_-n_0000000000) starting
   [junit4]   2> 734218 T2246 oascc.SolrZkClient.makePath makePath: /overseer/queue-work
   [junit4]   2> 734232 T2261 oasc.OverseerCollectionProcessor.run Process current queue of collection creations
   [junit4]   2> 734233 T2246 oascc.SolrZkClient.makePath makePath: /clusterstate.json
   [junit4]   2> 734236 T2246 oascc.SolrZkClient.makePath makePath: /aliases.json
   [junit4]   2> 734240 T2246 oascc.ZkStateReader.createClusterStateWatchersAndUpdate Updating cluster state from ZooKeeper... 
   [junit4]   2> 734244 T2260 oasc.Overseer$ClusterStateUpdater.run Starting to work on the main queue
   [junit4]   2> 734249 T2262 oasc.ZkController.publish publishing core=collection1 state=down collection=collection1
   [junit4]   2> 734249 T2262 oasc.ZkController.publish numShards not found on descriptor - reading it from system property
   [junit4]   2> 734251 T2259 oasc.DistributedQueue$LatchChildWatcher.process LatchChildWatcher fired on path: /overseer/queue state: SyncConnected type NodeChildrenChanged
   [junit4]   2> 734251 T2262 oasc.ZkController.waitForShardId waiting to find shard id in clusterstate for collection1
   [junit4]   2> 734253 T2260 oascc.ZkStateReader.updateClusterState Updating cloud state from ZooKeeper... 
   [junit4]   2> 734254 T2260 oasc.Overseer$ClusterStateUpdater.updateState Update state numShards=null message={
   [junit4]   2> 	  "operation":"state",
   [junit4]   2> 	  "state":"down",
   [junit4]   2> 	  "base_url":"http://188.138.97.18:",
   [junit4]   2> 	  "core":"collection1",
   [junit4]   2> 	  "roles":null,
   [junit4]   2> 	  "node_name":"188.138.97.18:_",
   [junit4]   2> 	  "shard":"shard1",
   [junit4]   2> 	  "collection":"collection1",
   [junit4]   2> 	  "numShards":null,
   [junit4]   2> 	  "core_node_name":"188.138.97.18:__collection1"}
   [junit4]   2> 734258 T2259 oasc.DistributedQueue$LatchChildWatcher.process LatchChildWatcher fired on path: /overseer/queue state: SyncConnected type NodeChildrenChanged
   [junit4]   2> 734259 T2259 oascc.ZkStateReader$2.process A cluster state change: WatchedEvent state:SyncConnected type:NodeDataChanged path:/clusterstate.json, has occurred - updating... (live nodes size: 1)
   [junit4]   2> 735252 T2262 oasc.ZkController.createCollectionZkNode Check for collection zkNode:collection1
   [junit4]   2> 735253 T2262 oasc.ZkController.createCollectionZkNode Collection zkNode exists
   [junit4]   2> 735254 T2262 oascc.ZkStateReader.readConfigName Load collection config from:/collections/collection1
   [junit4]   2> 735255 T2262 oascc.ZkStateReader.readConfigName path=/collections/collection1 configName=conf1 specified config exists in ZooKeeper
   [junit4]   2> 735256 T2262 oasc.SolrResourceLoader.<init> new SolrResourceLoader for directory: '/mnt/ssd/jenkins/workspace/Lucene-Solr-4.x-Linux/solr/core/src/test-files/solr/collection1/'
   [junit4]   2> 735257 T2262 oasc.SolrResourceLoader.replaceClassLoader Adding 'file:/mnt/ssd/jenkins/workspace/Lucene-Solr-4.x-Linux/solr/core/src/test-files/solr/collection1/lib/.svn/' to classloader
   [junit4]   2> 735257 T2262 oasc.SolrResourceLoader.replaceClassLoader Adding 'file:/mnt/ssd/jenkins/workspace/Lucene-Solr-4.x-Linux/solr/core/src/test-files/solr/collection1/lib/classes/' to classloader
   [junit4]   2> 735258 T2262 oasc.SolrResourceLoader.replaceClassLoader Adding 'file:/mnt/ssd/jenkins/workspace/Lucene-Solr-4.x-Linux/solr/core/src/test-files/solr/collection1/lib/README' to classloader
   [junit4]   2> 735322 T2262 oasc.SolrConfig.<init> Using Lucene MatchVersion: LUCENE_4_9
   [junit4]   2> 735365 T2262 oasc.SolrConfig.<init> Loaded SolrConfig: solrconfig.xml
   [junit4]   2> 735367 T2262 oass.IndexSchema.readSchema Reading Solr Schema from schema.xml
   [junit4]   2> 735375 T2262 oass.IndexSchema.readSchema [collection1] Schema name=test
   [junit4]   2> 735659 T2262 oass.ByteField.init WARN ByteField is deprecated and will be removed in 5.0. You should use TrieIntField instead.
   [junit4]   2> 735660 T2262 oass.ShortField.init WARN ShortField is deprecated and will be removed in 5.0. You should use TrieIntField instead.
   [junit4]   2> 735660 T2262 oass.OpenExchangeRatesOrgProvider.init Initialized with rates=open-exchange-rates.json, refreshInterval=1440.
   [junit4]   2> 735665 T2262 oass.IndexSchema.readSchema default search field in schema is text
   [junit4]   2> 735668 T2262 oass.IndexSchema.readSchema unique key field: id
   [junit4]   2> 735676 T2262 oass.FileExchangeRateProvider.reload Reloading exchange rates from file currency.xml
   [junit4]   2> 735679 T2262 oass.FileExchangeRateProvider.reload Reloading exchange rates from file currency.xml
   [junit4]   2> 735681 T2262 oass.OpenExchangeRatesOrgProvider.reload Reloading exchange rates from open-exchange-rates.json
   [junit4]   2> 735682 T2262 oass.OpenExchangeRatesOrgProvider$OpenExchangeRates.<init> WARN Unknown key IMPORTANT NOTE
   [junit4]   2> 735682 T2262 oass.OpenExchangeRatesOrgProvider$OpenExchangeRates.<init> WARN Expected key, got STRING
   [junit4]   2> 735683 T2262 oass.OpenExchangeRatesOrgProvider.reload Reloading exchange rates from open-exchange-rates.json
   [junit4]   2> 735683 T2262 oass.OpenExchangeRatesOrgProvider$OpenExchangeRates.<init> WARN Unknown key IMPORTANT NOTE
   [junit4]   2> 735683 T2262 oass.OpenExchangeRatesOrgProvider$OpenExchangeRates.<init> WARN Expected key, got STRING
   [junit4]   2> 735683 T2262 oasc.CoreContainer.create Creating SolrCore 'collection1' using configuration from collection collection1
   [junit4]   2> 735684 T2262 oasc.SolrCore.initDirectoryFactory org.apache.solr.core.MockDirectoryFactory
   [junit4]   2> 735684 T2262 oasc.SolrCore.<init> [collection1] Opening new SolrCore at /mnt/ssd/jenkins/workspace/Lucene-Solr-4.x-Linux/solr/core/src/test-files/solr/collection1/, dataDir=/mnt/ssd/jenkins/workspace/Lucene-Solr-4.x-Linux/solr/build/solr-core/test/J1/./solr.rest.TestManagedResourceStorage-7148FCF4A7E92BFC-001/init-core-data-001/
   [junit4]   2> 735684 T2262 oasc.JmxMonitoredMap.<init> JMX monitoring is enabled. Adding Solr mbeans to JMX Server: com.sun.jmx.mbeanserver.JmxMBeanServer@fbe8e4
   [junit4]   2> 735685 T2262 oasc.CachingDirectoryFactory.get return new directory for /mnt/ssd/jenkins/workspace/Lucene-Solr-4.x-Linux/solr/build/solr-core/test/J1/./solr.rest.TestManagedResourceStorage-7148FCF4A7E92BFC-001/init-core-data-001
   [junit4]   2> 735685 T2262 oasc.SolrCore.getNewIndexDir New index directory detected: old=null new=/mnt/ssd/jenkins/workspace/Lucene-Solr-4.x-Linux/solr/build/solr-core/test/J1/./solr.rest.TestManagedResourceStorage-7148FCF4A7E92BFC-001/init-core-data-001/index/
   [junit4]   2> 735685 T2262 oasc.SolrCore.initIndex WARN [collection1] Solr index directory '/mnt/ssd/jenkins/workspace/Lucene-Solr-4.x-Linux/solr/build/solr-core/test/J1/./solr.rest.TestManagedResourceStorage-7148FCF4A7E92BFC-001/init-core-data-001/index' doesn't exist. Creating new index...
   [junit4]   2> 735686 T2262 oasc.CachingDirectoryFactory.get return new directory for /mnt/ssd/jenkins/workspace/Lucene-Solr-4.x-Linux/solr/build/solr-core/test/J1/./solr.rest.TestManagedResourceStorage-7148FCF4A7E92BFC-001/init-core-data-001/index
   [junit4]   2> 735686 T2262 oasu.RandomMergePolicy.<init> RandomMergePolicy wrapping class org.apache.lucene.index.TieredMergePolicy: [TieredMergePolicy: maxMergeAtOnce=48, maxMergeAtOnceExplicit=25, maxMergedSegmentMB=20.216796875, floorSegmentMB=2.0888671875, forceMergeDeletesPctAllowed=19.116084609859787, segmentsPerTier=13.0, maxCFSSegmentSizeMB=8.796093022207999E12, noCFSRatio=0.0
   [junit4]   2> 735687 T2262 oasc.SolrDeletionPolicy.onCommit SolrDeletionPolicy.onCommit: commits: num=1
   [junit4]   2> 		commit{dir=RateLimitedDirectoryWrapper(MockDirectoryWrapper(RAMDirectory@41c730 lockFactory=org.apache.lucene.store.SingleInstanceLockFactory@1b75d2d)),segFN=segments_1,generation=1}
   [junit4]   2> 735687 T2262 oasc.SolrDeletionPolicy.updateCommits newest commit generation = 1
   [junit4]   2> 735687 T2262 oasc.SolrCore.initWriters created xml: solr.XMLResponseWriter
   [junit4]   2> 735689 T2262 oasup.UpdateRequestProcessorChain.init creating updateRequestProcessorChain "dedupe"
   [junit4]   2> 735690 T2262 oasup.UpdateRequestProcessorChain.init inserting DistributedUpdateProcessorFactory into updateRequestProcessorChain "dedupe"
   [junit4]   2> 735690 T2262 oasup.UpdateRequestProcessorChain.init creating updateRequestProcessorChain "dedupe-allfields"
   [junit4]   2> 735690 T2262 oasup.UpdateRequestProcessorChain.init inserting DistributedUpdateProcessorFactory into updateRequestProcessorChain "dedupe-allfields"
   [junit4]   2> 735690 T2262 oasup.UpdateRequestProcessorChain.init creating updateRequestProcessorChain "stored_sig"
   [junit4]   2> 735691 T2262 oasup.UpdateRequestProcessorChain.init inserting DistributedUpdateProcessorFactory into updateRequestProcessorChain "stored_sig"
   [junit4]   2> 735691 T2262 oasup.UpdateRequestProcessorChain.init creating updateRequestProcessorChain "uniq-fields"
   [junit4]   2> 735691 T2262 oasup.UniqFieldsUpdateProcessorFactory.init WARN Use of the 'fields' init param in UniqFieldsUpdateProcessorFactory is deprecated, please use 'fieldName' (or another FieldMutatingUpdateProcessorFactory selector option) instead
   [junit4]   2> 735691 T2262 oasup.UniqFieldsUpdateProcessorFactory.init Replacing 'fields' init param with (individual) 'fieldName' params
   [junit4]   2> 735692 T2262 oasup.UpdateRequestProcessorChain.init inserting DistributedUpdateProcessorFactory into updateRequestProcessorChain "uniq-fields"
   [junit4]   2> 735692 T2262 oasup.UpdateRequestProcessorChain.init creating updateRequestProcessorChain "distrib-dup-test-chain-explicit"
   [junit4]   2> 735693 T2262 oasup.UpdateRequestProcessorChain.init creating updateRequestProcessorChain "distrib-dup-test-chain-implicit"
   [junit4]   2> 735693 T2262 oasup.UpdateRequestProcessorChain.init inserting DistributedUpdateProcessorFactory into updateRequestProcessorChain "distrib-dup-test-chain-implicit"
   [junit4]   2> 735693 T2262 oasc.SolrCore.loadUpdateProcessorChains no updateRequestProcessorChain defined as default, creating implicit default
   [junit4]   2> 735693 T2262 oasc.RequestHandlers.initHandlersFromConfig adding lazy requestHandler: solr.ReplicationHandler
   [junit4]   2> 735693 T2262 oasc.RequestHandlers.initHandlersFromConfig created /replication: solr.ReplicationHandler
   [junit4]   2> 735694 T2262 oasc.RequestHandlers.initHandlersFromConfig created standard: solr.StandardRequestHandler
   [junit4]   2> 735694 T2262 oasc.RequestHandlers.initHandlersFromConfig created /get: solr.RealTimeGetHandler
   [junit4]   2> 735695 T2262 oasc.RequestHandlers.initHandlersFromConfig created dismax: solr.SearchHandler
   [junit4]   2> 735695 T2262 oasc.RequestHandlers.initHandlersFromConfig created mock: org.apache.solr.core.MockQuerySenderListenerReqHandler
   [junit4]   2> 735695 T2262 oasc.RequestHandlers.initHandlersFromConfig created /admin/: org.apache.solr.handler.admin.AdminHandlers
   [junit4]   2> 735696 T2262 oasc.RequestHandlers.initHandlersFromConfig created /admin/file: solr.admin.ShowFileRequestHandler
   [junit4]   2> 735696 T2262 oasc.RequestHandlers.initHandlersFromConfig created defaults: solr.StandardRequestHandler
   [junit4]   2> 735696 T2262 oasc.RequestHandlers.initHandlersFromConfig adding lazy requestHandler: solr.StandardRequestHandler
   [junit4]   2> 735697 T2262 oasc.RequestHandlers.initHandlersFromConfig created lazy: solr.StandardRequestHandler
   [junit4]   2> 735697 T2262 oasc.RequestHandlers.initHandlersFromConfig created /update: solr.UpdateRequestHandler
   [junit4]   2> 735697 T2262 oasc.RequestHandlers.initHandlersFromConfig created /terms: org.apache.solr.handler.component.SearchHandler
   [junit4]   2> 735698 T2262 oasc.RequestHandlers.initHandlersFromConfig created spellCheckCompRH: org.apache.solr.handler.component.SearchHandler
   [junit4]   2> 735698 T2262 oasc.RequestHandlers.initHandlersFromConfig created spellCheckCompRH_Direct: org.apache.solr.handler.component.SearchHandler
   [junit4]   2> 735699 T2262 oasc.RequestHandlers.initHandlersFromConfig created spellCheckWithWordbreak: org.apache.solr.handler.component.SearchHandler
   [junit4]   2> 735699 T2262 oasc.RequestHandlers.initHandlersFromConfig created spellCheckWithWordbreak_Direct: org.apache.solr.handler.component.SearchHandler
   [junit4]   2> 735699 T2262 oasc.RequestHandlers.initHandlersFromConfig created spellCheckCompRH1: org.apache.solr.handler.component.SearchHandler
   [junit4]   2> 735700 T2262 oasc.RequestHandlers.initHandlersFromConfig created mltrh: org.apache.solr.handler.component.SearchHandler
   [junit4]   2> 735700 T2262 oasc.RequestHandlers.initHandlersFromConfig created tvrh: org.apache.solr.handler.component.SearchHandler
   [junit4]   2> 735700 T2262 oasc.RequestHandlers.initHandlersFromConfig created /mlt: solr.MoreLikeThisHandler
   [junit4]   2> 735701 T2262 oasc.RequestHandlers.initHandlersFromConfig created /debug/dump: solr.DumpRequestHandler
   [junit4]   2> 735703 T2262 oashl.XMLLoader.init xsltCacheLifetimeSeconds=60
   [junit4]   2> 735704 T2262 oasc.SolrCore.initDeprecatedSupport WARN solrconfig.xml uses deprecated <admin/gettableFiles>, Please update your config to use the ShowFileRequestHandler.
   [junit4]   2> 735706 T2262 oasu.CommitTracker.<init> Hard AutoCommit: disabled
   [junit4]   2> 735706 T2262 oasu.CommitTracker.<init> Soft AutoCommit: disabled
   [junit4]   2> 735706 T2262 oasu.RandomMergePolicy.<init> RandomMergePolicy wrapping class org.apache.lucene.index.TieredMergePolicy: [TieredMergePolicy: maxMergeAtOnce=13, maxMergeAtOnceExplicit=19, maxMergedSegmentMB=77.83984375, floorSegmentMB=1.9462890625, forceMergeDeletesPctAllowed=18.554851877373753, segmentsPerTier=13.0, maxCFSSegmentSizeMB=8.796093022207999E12, noCFSRatio=0.8504385150702517
   [junit4]   2> 735707 T2262 oasc.SolrDeletionPolicy.onInit SolrDeletionPolicy.onInit: commits: num=1
   [junit4]   2> 		commit{dir=RateLimitedDirectoryWrapper(MockDirectoryWrapper(RAMDirectory@41c730 lockFactory=org.apache.lucene.store.SingleInstanceLockFactory@1b75d2d)),segFN=segments_1,generation=1}
   [junit4]   2> 735707 T2262 oasc.SolrDeletionPolicy.updateCommits newest commit generation = 1
   [junit4]   2> 735707 T2262 oass.SolrIndexSearcher.<init> Opening Searcher@b987dd[collection1] main
   [junit4]   2> 735708 T2262 oascc.ZkStateReader.readConfigName Load collection config from:/collections/collection1
   [junit4]   2> 735708 T2262 oascc.ZkStateReader.readConfigName path=/collections/collection1 configName=conf1 specified config exists in ZooKeeper
   [junit4]   2> 735709 T2262 oasr.RestManager.init Initializing RestManager with initArgs: {storageIO=org.apache.solr.rest.ManagedResourceStorage$InMemoryStorageIO}
   [junit4]   2> 735709 T2262 oasr.ManagedResourceStorage.load Reading _rest_managed.json using InMemoryStorage
   [junit4]   2> 735709 T2262 oasr.ManagedResource.reloadFromStorage WARN No stored data found for /rest/managed
   [junit4]   2> 735709 T2262 oasr.ManagedResource.notifyObserversDuringInit WARN No registered observers for /rest/managed
   [junit4]   2> 735709 T2262 oasr.RestManager.init Initializing 0 registered ManagedResources
   [junit4]   2> 735709 T2262 oashc.SpellCheckComponent.inform Initializing spell checkers
   [junit4]   2> 735713 T2262 oass.DirectSolrSpellChecker.init init: {name=direct,classname=DirectSolrSpellChecker,field=lowerfilt,minQueryLength=3}
   [junit4]   2> 735736 T2263 oasc.SolrCore.registerSearcher [collection1] Registered new searcher Searcher@b987dd[collection1] main{StandardDirectoryReader(segments_1:1:nrt)}
   [junit4]   2> 735740 T2262 oasc.CoreContainer.registerCore registering core: collection1
   [junit4]   2> 735740 T2266 oasc.ZkController.register Register replica - core:collection1 address:http://188.138.97.18: collection:collection1 shard:shard1
   [junit4]   2> 735742 T2246 oas.SolrTestCaseJ4.initCore ####initCore end
   [junit4]   2> 735743 T2266 oascc.SolrZkClient.makePath makePath: /collections/collection1/leader_elect/shard1/election
   [junit4]   2> 735748 T2246 oas.SolrTestCaseJ4.setUp ###Starting testZkBasedJsonStorage
   [junit4]   2> 735748 T2246 oasc.SolrResourceLoader.<init> new SolrResourceLoader for directory: './'
   [junit4]   2> 735750 T2266 oasc.ShardLeaderElectionContext.runLeaderProcess Running the leader process for shard shard1
   [junit4]   2> 735751 T2259 oasc.DistributedQueue$LatchChildWatcher.process LatchChildWatcher fired on path: /overseer/queue state: SyncConnected type NodeChildrenChanged
   [junit4]   2> 735752 T2266 oasc.ShardLeaderElectionContext.waitForReplicasToComeUp Enough replicas found to continue.
   [junit4]   2> 735752 T2266 oasc.ShardLeaderElectionContext.runLeaderProcess I may be the new leader - try and sync
   [junit4]   2> 735752 T2260 oascc.ZkStateReader.updateClusterState Updating cloud state from ZooKeeper... 
   [junit4]   2> 735752 T2266 oasc.ShardLeaderElectionContext.runLeaderProcess I am the new leader: http://188.138.97.18:/collection1/ shard1
   [junit4]   2> 735753 T2266 oascc.SolrZkClient.makePath makePath: /collections/collection1/leaders/shard1
   [junit4]   2> 735754 T2259 oasc.DistributedQueue$LatchChildWatcher.process LatchChildWatcher fired on path: /overseer/queue state: SyncConnected type NodeChildrenChanged
   [junit4]   2> 735757 T2259 oasc.DistributedQueue$LatchChildWatcher.process LatchChildWatcher fired on path: /overseer/queue state: SyncConnected type NodeChildrenChanged
   [junit4]   2> 735761 T2259 oasc.DistributedQueue$LatchChildWatcher.process LatchChildWatcher fired on path: /overseer/queue state: SyncConnected type NodeChildrenChanged
   [junit4]   2> 735761 T2259 oascc.ZkStateReader$2.process A cluster state change: WatchedEvent state:SyncConnected type:NodeDataChanged path:/clusterstate.json, has occurred - updating... (live nodes size: 1)
   [junit4]   2> 735767 T2246 oascc.SolrZkClient.makePath makePath: /test
   [junit4]   2> 735769 T2246 oasr.ManagedResourceStorage$ZooKeeperStorageIO.configure Configured ZooKeeperStorageIO with znodeBase: /test
   [junit4]   2> 735770 T2246 oascc.SolrZkClient.makePath makePath: /test/_test_foo.json
   [junit4]   2> 735771 T2246 oasr.ManagedResourceStorage$ZooKeeperStorageIO$1.close Wrote 136 bytes to new znode /test/_test_foo.json
   [junit4]   2> 735771 T2246 oasr.ManagedResourceStorage$JsonStorage.store Saved JSON object to path _test_foo.json using ZooKeeperStorageIO:path=/test
   [junit4]   2> 735772 T2246 oasr.ManagedResourceStorage.load Reading _test_foo.json using ZooKeeperStorageIO:path=/test
   [junit4]   2> 735773 T2246 oasr.ManagedResourceStorage$ZooKeeperStorageIO.openInputStream Read 136 bytes from znode /test/_test_foo.json
   [junit4]   2> 735773 T2246 oasr.ManagedResourceStorage.load Loaded LinkedHashMap at path _test_foo.json using ZooKeeperStorageIO:path=/test
   [junit4]   2> 735774 T2246 oasr.ManagedResourceStorage$ZooKeeperStorageIO$1.close Wrote 175 bytes to existing znode /test/_test_foo.json
   [junit4]   2> 735774 T2246 oasr.ManagedResourceStorage$JsonStorage.store Saved JSON object to path _test_foo.json using ZooKeeperStorageIO:path=/test
   [junit4]   2> 735775 T2246 oasr.ManagedResourceStorage.load Reading _test_foo.json using ZooKeeperStorageIO:path=/test
   [junit4]   2> 735775 T2246 oasr.ManagedResourceStorage$ZooKeeperStorageIO.openInputStream Read 175 bytes from znode /test/_test_foo.json
   [junit4]   2> 735776 T2246 oasr.ManagedResourceStorage.load Loaded LinkedHashMap at path _test_foo.json using ZooKeeperStorageIO:path=/test
   [junit4]   2> 735776 T2246 oas.SolrTestCaseJ4.tearDown ###Ending testZkBasedJsonStorage
   [junit4]   2> 735782 T2246 oas.SolrTestCaseJ4.setUp ###Starting testFileBasedJsonStorage
   [junit4]   2> 735782 T2246 oasc.SolrResourceLoader.<init> new SolrResourceLoader for directory: './'
   [junit4]   2> 735793 T2246 oasr.ManagedResourceStorage$FileStorageIO.configure File-based storage initialized to use dir: /mnt/ssd/jenkins/workspace/Lucene-Solr-4.x-Linux/solr/build/solr-core/test/J1/./managed
   [junit4]   2> 735794 T2246 oasr.ManagedResourceStorage$JsonStorage.store Saved JSON object to path _test_foo.json using file:dir=/mnt/ssd/jenkins/workspace/Lucene-Solr-4.x-Linux/solr/build/solr-core/test/J1/./managed
   [junit4]   2> 735794 T2246 oasr.ManagedResourceStorage.load Reading _test_foo.json using file:dir=/mnt/ssd/jenkins/workspace/Lucene-Solr-4.x-Linux/solr/build/solr-core/test/J1/./managed
   [junit4]   2> 735794 T2246 oasr.ManagedResourceStorage.load Loaded LinkedHashMap at path _test_foo.json using file:dir=/mnt/ssd/jenkins/workspace/Lucene-Solr-4.x-Linux/solr/build/solr-core/test/J1/./managed
   [junit4]   2> 735795 T2246 oasr.ManagedResourceStorage$JsonStorage.store Saved JSON object to path _test_foo.json using file:dir=/mnt/ssd/jenkins/workspace/Lucene-Solr-4.x-Linux/solr/build/solr-core/test/J1/./managed
   [junit4]   2> 735795 T2246 oasr.ManagedResourceStorage.load Reading _test_foo.json using file:dir=/mnt/ssd/jenkins/workspace/Lucene-Solr-4.x-Linux/solr/build/solr-core/test/J1/./managed
   [junit4]   2> 735796 T2246 oasr.ManagedResourceStorage.load Loaded LinkedHashMap at path _test_foo.json using file:dir=/mnt/ssd/jenkins/workspace/Lucene-Solr-4.x-Linux/solr/build/solr-core/test/J1/./managed
   [junit4]   2> 735796 T2246 oas.SolrTestCaseJ4.tearDown ###Ending testFileBasedJsonStorage
   [junit4]   2> 735797 T2246 oasc.ZkTestServer.send4LetterWord connecting to 127.0.0.1:33722 33722
   [junit4]   2> 735808 T2266 oasc.ZkController.register We are http://188.138.97.18:/collection1/ and leader is http://188.138.97.18:/collection1/
   [junit4]   2> 737277 T2259 oascc.ZkStateReader$3.process WARN ZooKeeper watch triggered, but Solr cannot talk to ZK
   [junit4]   2> 736236 T2261 oasc.OverseerCollectionProcessor.run WARN Overseer cannot talk to ZK
   [junit4]   2> 746217 T2247 oasc.ZkTestServer.send4LetterWord connecting to 127.0.0.1:33722 33722
   [junit4]   2> 746216 T2266 oasc.ZkController.register No LogReplay needed for core=collection1 baseURL=http://188.138.97.18:
   [junit4]   2> 746220 T2266 oasc.ZkController.checkRecovery WARN Skipping recovery according to sys prop solrcloud.skip.autorecovery
   [junit4]   2> 746220 T2246 oas.SolrTestCaseJ4.deleteCore ###deleteCore
   [junit4]   2> 746220 T2266 oasc.ZkController.publish publishing core=collection1 state=active collection=collection1
   [junit4]   2> 746221 T2266 oasc.ZkController.publish numShards not found on descriptor - reading it from system property
   [junit4]   2> 746221 T2266 oasc.ZkController.getLeaderInitiatedRecoveryState WARN Unable to read /collections/collection1/leader_initiated_recovery/shard1/collection1 due to: org.apache.zookeeper.KeeperException$SessionExpiredException: KeeperErrorCode = Session expired for /collections/collection1/leader_initiated_recovery/shard1/collection1
   [junit4]   2> 746222 T2266 oasc.ZkController.publish publishing core=collection1 state=down collection=collection1
   [junit4]   2> 746222 T2266 oasc.ZkController.publish numShards not found on descriptor - reading it from system property
   [junit4]   2> 746223 T2266 oasc.ZkContainer$2.run ERROR  org.apache.zookeeper.KeeperException$SessionExpiredException: KeeperErrorCode = Session expired for /overseer/queue/qn-
   [junit4]   2> 	at org.apache.zookeeper.KeeperException.create(KeeperException.java:127)
   [junit4]   2> 	at org.apache.zookeeper.KeeperException.create(KeeperException.java:51)
   [junit4]   2> 	at org.apache.zookeeper.ZooKeeper.create(ZooKeeper.java:783)
   [junit4]   2> 	at org.apache.solr.common.cloud.SolrZkClient$5.execute(SolrZkClient.java:243)
   [junit4]   2> 	at org.apache.solr.common.cloud.SolrZkClient$5.execute(SolrZkClient.java:240)
   [junit4]   2> 	at org.apache.solr.common.cloud.ZkCmdExecutor.retryOperation(ZkCmdExecutor.java:73)
   [junit4]   2> 	at org.apache.solr.common.cloud.SolrZkClient.create(SolrZkClient.java:240)
   [junit4]   2> 	at org.apache.solr.cloud.DistributedQueue.createData(DistributedQueue.java:313)
   [junit4]   2> 	at org.apache.solr.cloud.DistributedQueue.offer(DistributedQueue.java:297)
   [junit4]   2> 	at org.apache.solr.cloud.ZkController.publish(ZkController.java:1077)
   [junit4]   2> 	at org.apache.solr.cloud.ZkController.publish(ZkController.java:1014)
   [junit4]   2> 	at org.apache.solr.cloud.ZkController.publish(ZkController.java:1010)
   [junit4]   2> 	at org.apache.solr.core.ZkContainer$2.run(ZkContainer.java:228)
   [junit4]   2> 	at java.util.concurrent.ThreadPoolExecutor.runWorker(ThreadPoolExecutor.java:1145)
   [junit4]   2> 	at java.util.concurrent.ThreadPoolExecutor$Worker.run(ThreadPoolExecutor.java:615)
   [junit4]   2> 	at java.lang.Thread.run(Thread.java:745)
   [junit4]   2> 
   [junit4]   2> 746224 T2266 oasc.SolrException.log ERROR :org.apache.zookeeper.KeeperException$SessionExpiredException: KeeperErrorCode = Session expired for /overseer/queue/qn-
   [junit4]   2> 		at org.apache.zookeeper.KeeperException.create(KeeperException.java:127)
   [junit4]   2> 		at org.apache.zookeeper.KeeperException.create(KeeperException.java:51)
   [junit4]   2> 		at org.apache.zookeeper.ZooKeeper.create(ZooKeeper.java:783)
   [junit4]   2> 		at org.apache.solr.common.cloud.SolrZkClient$5.execute(SolrZkClient.java:243)
   [junit4]   2> 		at org.apache.solr.common.cloud.SolrZkClient$5.execute(SolrZkClient.java:240)
   [junit4]   2> 		at org.apache.solr.common.cloud.ZkCmdExecutor.retryOperation(ZkCmdExecutor.java:73)
   [junit4]   2> 		at org.apache.solr.common.cloud.SolrZkClient.create(SolrZkClient.java:240)
   [junit4]   2> 		at org.apache.solr.cloud.DistributedQueue.createData(DistributedQueue.java:313)
   [junit4]   2> 		at org.apache.solr.cloud.DistributedQueue.offer(DistributedQueue.java:297)
   [junit4]   2> 		at org.apache.solr.cloud.ZkController.publish(ZkController.java:1077)
   [junit4]   2> 		at org.apache.solr.cloud.ZkController.publish(ZkController.java:1014)
   [junit4]   2> 		at org.apache.solr.cloud.ZkController.publish(ZkController.java:1010)
   [junit4]   2> 		at org.apache.solr.cloud.ZkController.register(ZkController.java:826)
   [junit4]   2> 		at org.apache.solr.cloud.ZkController.register(ZkController.java:740)
   [junit4]   2> 		at org.apache.solr.core.ZkContainer$2.run(ZkContainer.java:221)
   [junit4]   2> 		at java.util.concurrent.ThreadPoolExecutor.runWorker(ThreadPoolExecutor.java:1145)
   [junit4]   2> 		at java.util.concurrent.ThreadPoolExecutor$Worker.run(ThreadPoolExecutor.java:615)
   [junit4]   2> 		at java.lang.Thread.run(Thread.java:745)
   [junit4]   2> 	
   [junit4]   2> 13103 T2245 ccr.ThreadLeakControl.checkThreadLeaks WARNING Will linger awaiting termination of 4 leaked thread(s).
   [junit4]   2> 33284 T2245 ccr.ThreadLeakControl.checkThreadLeaks SEVERE 4 threads leaked from SUITE scope at org.apache.solr.rest.TestManagedResourceStorage: 
   [junit4]   2> 	   1) Thread[id=2263, name=searcherExecutor-1250-thread-1, state=WAITING, group=TGRP-TestManagedResourceStorage]
   [junit4]   2> 	        at sun.misc.Unsafe.park(Native Method)
   [junit4]   2> 	        at java.util.concurrent.locks.LockSupport.park(LockSupport.java:186)
   [junit4]   2> 	        at java.util.concurrent.locks.AbstractQueuedSynchronizer$ConditionObject.await(AbstractQueuedSynchronizer.java:2043)
   [junit4]   2> 	        at java.util.concurrent.LinkedBlockingQueue.take(LinkedBlockingQueue.java:442)
   [junit4]   2> 	        at java.util.concurrent.ThreadPoolExecutor.getTask(ThreadPoolExecutor.java:1068)
   [junit4]   2> 	        at java.util.concurrent.ThreadPoolExecutor.runWorker(ThreadPoolExecutor.java:1130)
   [junit4]   2> 	        at java.util.concurrent.ThreadPoolExecutor$Worker.run(ThreadPoolExecutor.java:615)
   [junit4]   2> 	        at java.lang.Thread.run(Thread.java:745)
   [junit4]   2> 	   2) Thread[id=2266, name=coreZkRegister-1245-thread-1, state=WAITING, group=TGRP-TestManagedResourceStorage]
   [junit4]   2> 	        at sun.misc.Unsafe.park(Native Method)
   [junit4]   2> 	        at java.util.concurrent.locks.LockSupport.park(LockSupport.java:186)
   [junit4]   2> 	        at java.util.concurrent.locks.AbstractQueuedSynchronizer$ConditionObject.await(AbstractQueuedSynchronizer.java:2043)
   [junit4]   2> 	        at java.util.concurrent.LinkedBlockingQueue.take(LinkedBlockingQueue.java:442)
   [junit4]   2> 	        at java.util.concurrent.ThreadPoolExecutor.getTask(ThreadPoolExecutor.java:1068)
   [junit4]   2> 	        at java.util.concurrent.ThreadPoolExecutor.runWorker(ThreadPoolExecutor.java:1130)
   [junit4]   2> 	        at java.util.concurrent.ThreadPoolExecutor$Worker.run(ThreadPoolExecutor.java:615)
   [junit4]   2> 	        at java.lang.Thread.run(Thread.java:745)
   [junit4]   2> 	   3) Thread[id=2260, name=Thread-1080, state=TIMED_WAITING, group=Overseer state updater.]
   [junit4]   2> 	        at java.lang.Object.wait(Native Method)
   [junit4]   2> 	        at org.apache.solr.cloud.DistributedQueue$LatchChildWatcher.await(DistributedQueue.java:240)
   [junit4]   2> 	        at org.apache.solr.cloud.DistributedQueue.peek(DistributedQueue.java:563)
   [junit4]   2> 	        at org.apache.solr.cloud.DistributedQueue.peek(DistributedQueue.java:527)
   [junit4]   2> 	        at org.apache.solr.cloud.Overseer$ClusterStateUpdater.run(Overseer.java:216)
   [junit4]   2> 	        at java.lang.Thread.run(Thread.java:745)
   [junit4]   2> 	   4) Thread[id=2264, name=Thread-1081, state=WAITING, group=TGRP-TestManagedResourceStorage]
   [junit4]   2> 	        at java.lang.Object.wait(Native Method)
   [junit4]   2> 	        at java.lang.Object.wait(Object.java:503)
   [junit4]   2> 	        at org.apache.solr.core.CloserThread.run(CoreContainer.java:944)
   [junit4]   2> 33286 T2245 ccr.ThreadLeakControl.tryToInterruptAll Starting to interrupt leaked threads:
   [junit4]   2> 	   1) Thread[id=2263, name=searcherExecutor-1250-thread-1, state=WAITING, group=TGRP-TestManagedResourceStorage]
   [junit4]   2> 	   2) Thread[id=2266, name=coreZkRegister-1245-thread-1, state=WAITING, group=TGRP-TestManagedResourceStorage]
   [junit4]   2> 	   3) Thread[id=2260, name=Thread-1080, state=TIMED_WAITING, group=Overseer state updater.]
   [junit4]   2> 	   4) Thread[id=2264, name=Thread-1081, state=WAITING, group=TGRP-TestManagedResourceStorage]
   [junit4]   2> 766744 T2260 oasc.Overseer$ClusterStateUpdater.run Overseer Loop exiting : 188.138.97.18:_
   [junit4]   2> 766745 T2267 oasc.Overseer$ClusterStateUpdater.checkIfIamStillLeader ERROR could not read the data org.apache.zookeeper.KeeperException$SessionExpiredException: KeeperErrorCode = Session expired for /overseer_elect/leader
   [junit4]   2> 	at org.apache.zookeeper.KeeperException.create(KeeperException.java:127)
   [junit4]   2> 	at org.apache.zookeeper.KeeperException.create(KeeperException.java:51)
   [junit4]   2> 	at org.apache.zookeeper.ZooKeeper.getData(ZooKeeper.java:1155)
   [junit4]   2> 	at org.apache.solr.common.cloud.SolrZkClient$7.execute(SolrZkClient.java:277)
   [junit4]   2> 	at org.apache.solr.common.cloud.SolrZkClient$7.execute(SolrZkClient.java:274)
   [junit4]   2> 	at org.apache.solr.common.cloud.ZkCmdExecutor.retryOperation(ZkCmdExecutor.java:73)
   [junit4]   2> 	at org.apache.solr.common.cloud.SolrZkClient.getData(SolrZkClient.java:274)
   [junit4]   2> 	at org.apache.solr.cloud.Overseer$ClusterStateUpdater.checkIfIamStillLeader(Overseer.java:302)
   [junit4]   2> 	at org.apache.solr.cloud.Overseer$ClusterStateUpdater.access$300(Overseer.java:85)
   [junit4]   2> 	at org.apache.solr.cloud.Overseer$ClusterStateUpdater$1.run(Overseer.java:291)
   [junit4]   2> 
   [junit4]   2> 36304 T2245 ccr.ThreadLeakControl.tryToInterruptAll SEVERE There are still zombie threads that couldn't be terminated:
   [junit4]   2> 	   1) Thread[id=2266, name=coreZkRegister-1245-thread-1, state=WAITING, group=TGRP-TestManagedResourceStorage]
   [junit4]   2> 	        at sun.misc.Unsafe.park(Native Method)
   [junit4]   2> 	        at java.util.concurrent.locks.LockSupport.park(LockSupport.java:186)
   [junit4]   2> 	        at java.util.concurrent.locks.AbstractQueuedSynchronizer$ConditionObject.await(AbstractQueuedSynchronizer.java:2043)
   [junit4]   2> 	        at java.util.concurrent.LinkedBlockingQueue.take(LinkedBlockingQueue.java:442)
   [junit4]   2> 	        at java.util.concurrent.ThreadPoolExecutor.getTask(ThreadPoolExecutor.java:1068)
   [junit4]   2> 	        at java.util.concurrent.ThreadPoolExecutor.runWorker(ThreadPoolExecutor.java:1130)
   [junit4]   2> 	        at java.util.concurrent.ThreadPoolExecutor$Worker.run(ThreadPoolExecutor.java:615)
   [junit4]   2> 	        at java.lang.Thread.run(Thread.java:745)
   [junit4]   2> 	   2) Thread[id=2263, name=searcherExecutor-1250-thread-1, state=WAITING, group=TGRP-TestManagedResourceStorage]
   [junit4]   2> 	        at sun.misc.Unsafe.park(Native Method)
   [junit4]   2> 	        at java.util.concurrent.locks.LockSupport.park(LockSupport.java:186)
   [junit4]   2> 	        at java.util.concurrent.locks.AbstractQueuedSynchronizer$ConditionObject.await(AbstractQueuedSynchronizer.java:2043)
   [junit4]   2> 	        at java.util.concurrent.LinkedBlockingQueue.take(LinkedBlockingQueue.java:442)
   [junit4]   2> 	        at java.util.concurrent.ThreadPoolExecutor.getTask(ThreadPoolExecutor.java:1068)
   [junit4]   2> 	        at java.util.concurrent.ThreadPoolExecutor.runWorker(ThreadPoolExecutor.java:1130)
   [junit4]   2> 	        at java.util.concurrent.ThreadPoolExecutor$Worker.run(ThreadPoolExecutor.java:615)
   [junit4]   2> 	        at java.lang.Thread.run(Thread.java:745)
   [junit4]   2> 	   3) Thread[id=2264, name=Thread-1081, state=WAITING, group=TGRP-TestManagedResourceStorage]
   [junit4]   2> 	        at java.lang.Object.wait(Native Method)
   [junit4]   2> 	        at java.lang.Object.wait(Object.java:503)
   [junit4]   2> 	        at org.apache.solr.core.CloserThread.run(CoreContainer.java:944)
   [junit4]   2> NOTE: test params are: codec=CheapBastard, sim=RandomSimilarityProvider(queryNorm=false,coord=no): {}, locale=hu_HU, timezone=Europe/Warsaw
   [junit4]   2> NOTE: Linux 3.8.0-41-generic i386/Oracle Corporation 1.7.0_60-ea (32-bit)/cpus=8,threads=4,free=29705808,total=276037632
   [junit4]   2> NOTE: All tests run in this JVM: [StatsComponentTest, ChaosMonkeyNothingIsSafeTest, MergeStrategyTest, OpenExchangeRatesOrgProviderTest, TestFastWriter, TestShortCircuitedRequests, TestInfoStreamLogging, TestComponentsName, BadIndexSchemaTest, TestWordDelimiterFilterFactory, NumericFieldsTest, QueryResultKeyTest, TestNonDefinedSimilarityFactory, TestFoldingMultitermQuery, SpellingQueryConverterTest, HardAutoCommitTest, CurrencyFieldOpenExchangeTest, TestCoreDiscovery, HighlighterConfigTest, SpellCheckCollatorTest, DocValuesMissingTest, TestCloudManagedSchema, TestRangeQuery, TermVectorComponentDistributedTest, PathHierarchyTokenizerFactoryTest, TestSolr4Spatial, TestJmxIntegration, CurrencyFieldXmlFileTest, ConnectionManagerTest, TestSweetSpotSimilarityFactory, TestDistributedMissingSort, DistributedDebugComponentTest, TestBinaryResponseWriter, TestRandomFaceting, LeaderElectionIntegrationTest, DateFieldTest, TestUtils, HighlighterTest, TestUpdate, TestHashPartitioner, TestIndexSearcher, CoreAdminCreateDiscoverTest, TestAtomicUpdateErrorCases, TestCustomSort, TriLevelCompositeIdRoutingTest, TestFuzzyAnalyzedSuggestions, TestDistributedGrouping, SpellCheckComponentTest, SolrIndexConfigTest, OutputWriterTest, ShardSplitTest, TestDynamicFieldResource, SuggesterTSTTest, TestManagedResourceStorage]
   [junit4]   2> NOTE: reproduce with: ant test  -Dtestcase=TestManagedResourceStorage -Dtests.seed=7148FCF4A7E92BFC -Dtests.multiplier=3 -Dtests.slow=true -Dtests.locale=hu_HU -Dtests.timezone=Europe/Warsaw -Dtests.file.encoding=UTF-8
   [junit4] ERROR   0.00s J1 | TestManagedResourceStorage (suite) <<<
   [junit4]    > Throwable #1: java.lang.RuntimeException: SolrCore.getOpenCount()==2
   [junit4]    > 	at __randomizedtesting.SeedInfo.seed([7148FCF4A7E92BFC]:0)
   [junit4]    > 	at org.apache.solr.util.TestHarness.close(TestHarness.java:332)
   [junit4]    > 	at org.apache.solr.SolrTestCaseJ4.deleteCore(SolrTestCaseJ4.java:615)
   [junit4]    > 	at org.apache.solr.SolrTestCaseJ4.afterClass(SolrTestCaseJ4.java:179)
   [junit4]    > 	at java.lang.Thread.run(Thread.java:745)Throwable #2: com.carrotsearch.randomizedtesting.ThreadLeakError: 4 threads leaked from SUITE scope at org.apache.solr.rest.TestManagedResourceStorage: 
   [junit4]    >    1) Thread[id=2263, name=searcherExecutor-1250-thread-1, state=WAITING, group=TGRP-TestManagedResourceStorage]
   [junit4]    >         at sun.misc.Unsafe.park(Native Method)
   [junit4]    >         at java.util.concurrent.locks.LockSupport.park(LockSupport.java:186)
   [junit4]    >         at java.util.concurrent.locks.AbstractQueuedSynchronizer$ConditionObject.await(AbstractQueuedSynchronizer.java:2043)
   [junit4]    >         at java.util.concurrent.LinkedBlockingQueue.take(LinkedBlockingQueue.java:442)
   [junit4]    >         at java.util.concurrent.ThreadPoolExecutor.getTask(ThreadPoolExecutor.java:1068)
   [junit4]    >         at java.util.concurrent.ThreadPoolExecutor.runWorker(ThreadPoolExecutor.java:1130)
   [junit4]    >         at java.util.concurrent.ThreadPoolExecutor$Worker.run(ThreadPoolExecutor.java:615)
   [junit4]    >         at java.lang.Thread.run(Thread.java:745)
   [junit4]    >    2) Thread[id=2266, name=coreZkRegister-1245-thread-1, state=WAITING, group=TGRP-TestManagedResourceStorage]
   [junit4]    >         at sun.misc.Unsafe.park(Native Method)
   [junit4]    >         at java.util.concurrent.locks.LockSupport.park(LockSupport.java:186)
   [junit4]    >         at java.util.concurrent.locks.AbstractQueuedSynchronizer$ConditionObject.await(AbstractQueuedSynchronizer.java:2043)
   [junit4]    >         at java.util.concurrent.LinkedBlockingQueue.take(LinkedBlockingQueue.java:442)
   [junit4]    >         at java.util.concurrent.ThreadPoolExecutor.getTask(ThreadPoolExecutor.java:1068)
   [junit4]    >         at java.util.concurrent.ThreadPoolExecutor.runWorker(ThreadPoolExecutor.java:1130)
   [junit4]    >         at java.util.concurrent.ThreadPoolExecutor$Worker.run(ThreadPoolExecutor.java:615)
   [junit4]    >         at java.lang.Thread.run(Thread.java:745)
   [junit4]    >    3) Thread[id=2260, name=Thread-1080, state=TIMED_WAITING, group=Overseer state updater.]
   [junit4]    >         at java.lang.Object.wait(Native Method)
   [junit4]    >         at org.apache.solr.cloud.DistributedQueue$LatchChildWatcher.await(DistributedQueue.java:240)
   [junit4]    >         at org.apache.solr.cloud.DistributedQueue.peek(DistributedQueue.java:563)
   [junit4]    >         at org.apache.solr.cloud.DistributedQueue.peek(DistributedQueue.java:527)
   [junit4]    >         at org.apache.solr.cloud.Overseer$ClusterStateUpdater.run(Overseer.java:216)
   [junit4]    >         at java.lang.Thread.run(Thread.java:745)
   [junit4]    >    4) Thread[id=2264, name=Thread-1081, state=WAITING, group=TGRP-TestManagedResourceStorage]
   [junit4]    >         at java.lang.Object.wait(Native Method)
   [junit4]    >         at java.lang.Object.wait(Object.java:503)
   [junit4]    >         at org.apache.solr.core.CloserThread.run(CoreContainer.java:944)
   [junit4]    > 	at __randomizedtesting.SeedInfo.seed([7148FCF4A7E92BFC]:0)Throwable #3: com.carrotsearch.randomizedtesting.ThreadLeakError: There are still zombie threads that couldn't be terminated:
   [junit4]    >    1) Thread[id=2266, name=coreZkRegister-1245-thread-1, state=WAITING, group=TGRP-TestManagedResourceStorage]
   [junit4]    >         at sun.misc.Unsafe.park(Native Method)
   [junit4]    >         at java.util.concurrent.locks.LockSupport.park(LockSupport.java:186)
   [junit4]    >         at java.util.concurrent.locks.AbstractQueuedSynchronizer$ConditionObject.await(AbstractQueuedSynchronizer.java:2043)
   [junit4]    >         at java.util.concurrent.LinkedBlockingQueue.take(LinkedBlockingQueue.java:442)
   [junit4]    >         at java.util.concurrent.ThreadPoolExecutor.getTask(ThreadPoolExecutor.java:1068)
   [junit4]    >         at java.util.concurrent.ThreadPoolExecutor.runWorker(ThreadPoolExecutor.java:1130)
   [junit4]    >         at java.util.concurrent.ThreadPoolExecutor$Worker.run(ThreadPoolExecutor.java:615)
   [junit4]    >         at java.lang.Thread.run(Thread.java:745)
   [junit4]    >    2) Thread[id=2263, name=searcherExecutor-1250-thread-1, state=WAITING, group=TGRP-TestManagedResourceStorage]
   [junit4]    >         at sun.misc.Unsafe.park(Native Method)
   [junit4]    >         at java.util.concurrent.locks.LockSupport.park(LockSupport.java:186)
   [junit4]    >         at java.util.concurrent.locks.AbstractQueuedSynchronizer$ConditionObject.await(AbstractQueuedSynchronizer.java:2043)
   [junit4]    >         at java.util.concurrent.LinkedBlockingQueue.take(LinkedBlockingQueue.java:442)
   [junit4]    >         at java.util.concurrent.ThreadPoolExecutor.getTask(ThreadPoolExecutor.java:1068)
   [junit4]    >         at java.util.concurrent.ThreadPoolExecutor.runWorker(ThreadPoolExecutor.java:1130)
   [junit4]    >         at java.util.concurrent.ThreadPoolExecutor$Worker.run(ThreadPoolExecutor.java:615)
   [junit4]    >         at java.lang.Thread.run(Thread.java:745)
   [junit4]    >    3) Thread[id=2264, name=Thread-1081, state=WAITING, group=TGRP-TestManagedResourceStorage]
   [junit4]    >         at java.lang.Object.wait(Native Method)
   [junit4]    >         at java.lang.Object.wait(Object.java:503)
   [junit4]    >         at org.apache.solr.core.CloserThread.run(CoreContainer.java:944)
   [junit4]    > 	at __randomizedtesting.SeedInfo.seed([7148FCF4A7E92BFC]:0)
   [junit4] Completed on J1 in 36.37s, 2 tests, 3 errors <<< FAILURES!

[...truncated 796 lines...]
BUILD FAILED
/mnt/ssd/jenkins/workspace/Lucene-Solr-4.x-Linux/build.xml:467: The following error occurred while executing this line:
/mnt/ssd/jenkins/workspace/Lucene-Solr-4.x-Linux/build.xml:447: The following error occurred while executing this line:
/mnt/ssd/jenkins/workspace/Lucene-Solr-4.x-Linux/build.xml:45: The following error occurred while executing this line:
/mnt/ssd/jenkins/workspace/Lucene-Solr-4.x-Linux/extra-targets.xml:37: The following error occurred while executing this line:
/mnt/ssd/jenkins/workspace/Lucene-Solr-4.x-Linux/solr/build.xml:189: The following error occurred while executing this line:
/mnt/ssd/jenkins/workspace/Lucene-Solr-4.x-Linux/solr/common-build.xml:496: The following error occurred while executing this line:
/mnt/ssd/jenkins/workspace/Lucene-Solr-4.x-Linux/lucene/common-build.xml:1297: The following error occurred while executing this line:
/mnt/ssd/jenkins/workspace/Lucene-Solr-4.x-Linux/lucene/common-build.xml:921: There were test failures: 396 suites, 1640 tests, 3 suite-level errors, 920 ignored (10 assumptions)

Total time: 53 minutes 14 seconds
Build step 'Invoke Ant' marked build as failure
Description set: Java: 32bit/jdk1.7.0_60-ea-b15 -client -XX:+UseParallelGC
Archiving artifacts
Recording test results
Email was triggered for: Failure
Sending email for trigger: Failure



Mime
View raw message