lucene-dev mailing list archives

Site index · List index
Message view « Date » · « Thread »
Top « Date » · « Thread »
From buil...@flonkings.com
Subject [JENKINS] Lucene-4x-Linux-Java7-64-test-only - Build # 23310 - Failure!
Date Thu, 05 Jun 2014 04:19:14 GMT
Build: builds.flonkings.com/job/Lucene-4x-Linux-Java7-64-test-only/23310/

2 tests failed.
FAILED:  junit.framework.TestSuite.org.apache.lucene.search.TestControlledRealTimeReopenThread

Error Message:
1 thread leaked from SUITE scope at org.apache.lucene.search.TestControlledRealTimeReopenThread:
    1) Thread[id=143, name=Thread-71, state=TIMED_WAITING, group=TGRP-TestControlledRealTimeReopenThread]
        at sun.misc.Unsafe.park(Native Method)         at java.util.concurrent.locks.LockSupport.parkNanos(LockSupport.java:226)
        at java.util.concurrent.locks.AbstractQueuedSynchronizer$ConditionObject.awaitNanos(AbstractQueuedSynchronizer.java:2082)
        at org.apache.lucene.search.ControlledRealTimeReopenThread.run(ControlledRealTimeReopenThread.java:223)

Stack Trace:
com.carrotsearch.randomizedtesting.ThreadLeakError: 1 thread leaked from SUITE scope at org.apache.lucene.search.TestControlledRealTimeReopenThread:

   1) Thread[id=143, name=Thread-71, state=TIMED_WAITING, group=TGRP-TestControlledRealTimeReopenThread]
        at sun.misc.Unsafe.park(Native Method)
        at java.util.concurrent.locks.LockSupport.parkNanos(LockSupport.java:226)
        at java.util.concurrent.locks.AbstractQueuedSynchronizer$ConditionObject.awaitNanos(AbstractQueuedSynchronizer.java:2082)
        at org.apache.lucene.search.ControlledRealTimeReopenThread.run(ControlledRealTimeReopenThread.java:223)
	at __randomizedtesting.SeedInfo.seed([178AC51FA789A281]:0)


REGRESSION:  org.apache.lucene.search.TestControlledRealTimeReopenThread.testCRTReopen

Error Message:
waited too long for generation 20665

Stack Trace:
java.lang.AssertionError: waited too long for generation 20665
	at __randomizedtesting.SeedInfo.seed([178AC51FA789A281:45AA582B734E1AF8]:0)
	at org.junit.Assert.fail(Assert.java:93)
	at org.junit.Assert.assertTrue(Assert.java:43)
	at org.apache.lucene.search.TestControlledRealTimeReopenThread.testCRTReopen(TestControlledRealTimeReopenThread.java:519)
	at sun.reflect.NativeMethodAccessorImpl.invoke0(Native Method)
	at sun.reflect.NativeMethodAccessorImpl.invoke(NativeMethodAccessorImpl.java:57)
	at sun.reflect.DelegatingMethodAccessorImpl.invoke(DelegatingMethodAccessorImpl.java:43)
	at java.lang.reflect.Method.invoke(Method.java:606)
	at com.carrotsearch.randomizedtesting.RandomizedRunner.invoke(RandomizedRunner.java:1618)
	at com.carrotsearch.randomizedtesting.RandomizedRunner$6.evaluate(RandomizedRunner.java:827)
	at com.carrotsearch.randomizedtesting.RandomizedRunner$7.evaluate(RandomizedRunner.java:863)
	at com.carrotsearch.randomizedtesting.RandomizedRunner$8.evaluate(RandomizedRunner.java:877)
	at org.apache.lucene.util.TestRuleSetupTeardownChained$1.evaluate(TestRuleSetupTeardownChained.java:50)
	at org.apache.lucene.util.TestRuleFieldCacheSanity$1.evaluate(TestRuleFieldCacheSanity.java:51)
	at org.apache.lucene.util.AbstractBeforeAfterRule$1.evaluate(AbstractBeforeAfterRule.java:46)
	at com.carrotsearch.randomizedtesting.rules.SystemPropertiesInvariantRule$1.evaluate(SystemPropertiesInvariantRule.java:55)
	at org.apache.lucene.util.TestRuleThreadAndTestName$1.evaluate(TestRuleThreadAndTestName.java:49)
	at org.apache.lucene.util.TestRuleIgnoreAfterMaxFailures$1.evaluate(TestRuleIgnoreAfterMaxFailures.java:65)
	at org.apache.lucene.util.TestRuleMarkFailure$1.evaluate(TestRuleMarkFailure.java:48)
	at com.carrotsearch.randomizedtesting.rules.StatementAdapter.evaluate(StatementAdapter.java:36)
	at com.carrotsearch.randomizedtesting.ThreadLeakControl$StatementRunner.run(ThreadLeakControl.java:360)
	at com.carrotsearch.randomizedtesting.ThreadLeakControl.forkTimeoutingTask(ThreadLeakControl.java:793)
	at com.carrotsearch.randomizedtesting.ThreadLeakControl$3.evaluate(ThreadLeakControl.java:453)
	at com.carrotsearch.randomizedtesting.RandomizedRunner.runSingleTest(RandomizedRunner.java:836)
	at com.carrotsearch.randomizedtesting.RandomizedRunner$3.evaluate(RandomizedRunner.java:738)
	at com.carrotsearch.randomizedtesting.RandomizedRunner$4.evaluate(RandomizedRunner.java:772)
	at com.carrotsearch.randomizedtesting.RandomizedRunner$5.evaluate(RandomizedRunner.java:783)
	at org.apache.lucene.util.AbstractBeforeAfterRule$1.evaluate(AbstractBeforeAfterRule.java:46)
	at org.apache.lucene.util.TestRuleStoreClassName$1.evaluate(TestRuleStoreClassName.java:42)
	at com.carrotsearch.randomizedtesting.rules.SystemPropertiesInvariantRule$1.evaluate(SystemPropertiesInvariantRule.java:55)
	at com.carrotsearch.randomizedtesting.rules.NoShadowingOrOverridesOnMethodsRule$1.evaluate(NoShadowingOrOverridesOnMethodsRule.java:39)
	at com.carrotsearch.randomizedtesting.rules.NoShadowingOrOverridesOnMethodsRule$1.evaluate(NoShadowingOrOverridesOnMethodsRule.java:39)
	at com.carrotsearch.randomizedtesting.rules.StatementAdapter.evaluate(StatementAdapter.java:36)
	at com.carrotsearch.randomizedtesting.rules.StatementAdapter.evaluate(StatementAdapter.java:36)
	at com.carrotsearch.randomizedtesting.rules.StatementAdapter.evaluate(StatementAdapter.java:36)
	at org.apache.lucene.util.TestRuleAssertionsRequired$1.evaluate(TestRuleAssertionsRequired.java:43)
	at org.apache.lucene.util.TestRuleMarkFailure$1.evaluate(TestRuleMarkFailure.java:48)
	at org.apache.lucene.util.TestRuleIgnoreAfterMaxFailures$1.evaluate(TestRuleIgnoreAfterMaxFailures.java:65)
	at org.apache.lucene.util.TestRuleIgnoreTestSuites$1.evaluate(TestRuleIgnoreTestSuites.java:55)
	at com.carrotsearch.randomizedtesting.rules.StatementAdapter.evaluate(StatementAdapter.java:36)
	at com.carrotsearch.randomizedtesting.ThreadLeakControl$StatementRunner.run(ThreadLeakControl.java:360)
	at java.lang.Thread.run(Thread.java:745)




Build Log:
[...truncated 952 lines...]
   [junit4] Suite: org.apache.lucene.search.TestControlledRealTimeReopenThread
   [junit4]   2> NOTE: reproduce with: ant test  -Dtestcase=TestControlledRealTimeReopenThread
-Dtests.method=testCRTReopen -Dtests.seed=178AC51FA789A281 -Dtests.slow=true -Dtests.locale=ko_KR
-Dtests.timezone=America/Araguaina -Dtests.file.encoding=UTF-8
   [junit4] FAILURE 24.5s J4 | TestControlledRealTimeReopenThread.testCRTReopen <<<
   [junit4]    > Throwable #1: java.lang.AssertionError: waited too long for generation
20665
   [junit4]    > 	at __randomizedtesting.SeedInfo.seed([178AC51FA789A281:45AA582B734E1AF8]:0)
   [junit4]    > 	at org.apache.lucene.search.TestControlledRealTimeReopenThread.testCRTReopen(TestControlledRealTimeReopenThread.java:519)
   [junit4]    > 	at java.lang.Thread.run(Thread.java:745)
   [junit4]   2> NOTE: leaving temporary files on disk at: /var/lib/jenkins/workspace/Lucene-4x-Linux-Java7-64-test-only/checkout/lucene/build/core/test/J4/./lucene.search.TestControlledRealTimeReopenThread-178AC51FA789A281-001
   [junit4]   2> Jun 05, 2014 6:17:11 AM com.carrotsearch.randomizedtesting.ThreadLeakControl
checkThreadLeaks
   [junit4]   2> WARNING: Will linger awaiting termination of 1 leaked thread(s).
   [junit4]   2> Jun 05, 2014 6:17:31 AM com.carrotsearch.randomizedtesting.ThreadLeakControl
checkThreadLeaks
   [junit4]   2> SEVERE: 1 thread leaked from SUITE scope at org.apache.lucene.search.TestControlledRealTimeReopenThread:

   [junit4]   2>    1) Thread[id=143, name=Thread-71, state=TIMED_WAITING, group=TGRP-TestControlledRealTimeReopenThread]
   [junit4]   2>         at sun.misc.Unsafe.park(Native Method)
   [junit4]   2>         at java.util.concurrent.locks.LockSupport.parkNanos(LockSupport.java:226)
   [junit4]   2>         at java.util.concurrent.locks.AbstractQueuedSynchronizer$ConditionObject.awaitNanos(AbstractQueuedSynchronizer.java:2082)
   [junit4]   2>         at org.apache.lucene.search.ControlledRealTimeReopenThread.run(ControlledRealTimeReopenThread.java:223)
   [junit4]   2> Jun 05, 2014 6:17:31 AM com.carrotsearch.randomizedtesting.ThreadLeakControl
tryToInterruptAll
   [junit4]   2> INFO: Starting to interrupt leaked threads:
   [junit4]   2>    1) Thread[id=143, name=Thread-71, state=TIMED_WAITING, group=TGRP-TestControlledRealTimeReopenThread]
   [junit4]   2> Jun 05, 2014 6:17:31 AM com.carrotsearch.randomizedtesting.ThreadLeakControl
tryToInterruptAll
   [junit4]   2> INFO: All leaked threads terminated.
   [junit4]   2> NOTE: test params are: codec=Lucene41, sim=RandomSimilarityProvider(queryNorm=false,coord=no):
{titleTokenized=DFR I(n)BZ(0.3), extra16=LM Jelinek-Mercer(0.100000), test=DFR GLZ(0.3), body=DFR
I(F)3(800.0), extra13=DFR I(ne)B2}, locale=ko_KR, timezone=America/Araguaina
   [junit4]   2> NOTE: Linux 3.2.0-26-generic amd64/Oracle Corporation 1.7.0_55 (64-bit)/cpus=8,threads=1,free=117918024,total=256901120
   [junit4]   2> NOTE: All tests run in this JVM: [TestRateLimitedDirectoryWrapper, TestOmitNorms,
TestTopScoreDocCollector, TestPackedInts, TestSegmentMerger, TestDuelingCodecs, TestTwoPhaseCommitTool,
TestNoDeletionPolicy, TestStressNRT, TestIndexWriterThreadsToSegments, TestSloppyPhraseQuery,
TestToken, TestAssertions, TestBitVector, TestParallelAtomicReader, TestCheckIndex, TestOpenBitSet,
TestPrefixInBooleanQuery, TestControlledRealTimeReopenThread]
   [junit4]   2> NOTE: reproduce with: ant test  -Dtestcase=TestControlledRealTimeReopenThread
-Dtests.seed=178AC51FA789A281 -Dtests.slow=true -Dtests.locale=ko_KR -Dtests.timezone=America/Araguaina
-Dtests.file.encoding=UTF-8
   [junit4] ERROR   0.00s J4 | TestControlledRealTimeReopenThread (suite) <<<
   [junit4]    > Throwable #1: com.carrotsearch.randomizedtesting.ThreadLeakError: 1 thread
leaked from SUITE scope at org.apache.lucene.search.TestControlledRealTimeReopenThread: 
   [junit4]    >    1) Thread[id=143, name=Thread-71, state=TIMED_WAITING, group=TGRP-TestControlledRealTimeReopenThread]
   [junit4]    >         at sun.misc.Unsafe.park(Native Method)
   [junit4]    >         at java.util.concurrent.locks.LockSupport.parkNanos(LockSupport.java:226)
   [junit4]    >         at java.util.concurrent.locks.AbstractQueuedSynchronizer$ConditionObject.awaitNanos(AbstractQueuedSynchronizer.java:2082)
   [junit4]    >         at org.apache.lucene.search.ControlledRealTimeReopenThread.run(ControlledRealTimeReopenThread.java:223)
   [junit4]    > 	at __randomizedtesting.SeedInfo.seed([178AC51FA789A281]:0)
   [junit4] Completed on J4 in 52.32s, 5 tests, 1 failure, 1 error <<< FAILURES!

[...truncated 588 lines...]
BUILD FAILED
/var/lib/jenkins/workspace/Lucene-4x-Linux-Java7-64-test-only/checkout/lucene/build.xml:49:
The following error occurred while executing this line:
/var/lib/jenkins/workspace/Lucene-4x-Linux-Java7-64-test-only/checkout/lucene/common-build.xml:1297:
The following error occurred while executing this line:
/var/lib/jenkins/workspace/Lucene-4x-Linux-Java7-64-test-only/checkout/lucene/common-build.xml:921:
There were test failures: 407 suites, 3339 tests, 1 suite-level error, 1 failure, 100 ignored
(90 assumptions)

Total time: 6 minutes 18 seconds
Build step 'Invoke Ant' marked build as failure
Recording test results
Email was triggered for: Failure
Sending email for trigger: Failure



Mime
View raw message