lucene-dev mailing list archives

Site index · List index
Message view « Date » · « Thread »
Top « Date » · « Thread »
From Apache Jenkins Server <jenk...@builds.apache.org>
Subject [JENKINS-MAVEN] Lucene-Solr-Maven-4.x #639: POMs out of sync
Date Thu, 05 Jun 2014 07:22:03 GMT
Build: https://builds.apache.org/job/Lucene-Solr-Maven-4.x/639/

2 tests failed.
FAILED:  org.apache.solr.cloud.MultiThreadedOCPTest.org.apache.solr.cloud.MultiThreadedOCPTest

Error Message:
1 thread leaked from SUITE scope at org.apache.solr.cloud.MultiThreadedOCPTest: 
   1) Thread[id=18444, name=TEST-MultiThreadedOCPTest.testDistribSearch-seed#[60D21B7C6EEB3333]-EventThread,
state=RUNNABLE, group=TGRP-MultiThreadedOCPTest]
        at java.io.FileOutputStream.writeBytes(Native Method)
        at java.io.FileOutputStream.write(FileOutputStream.java:318)
        at java.io.BufferedOutputStream.flushBuffer(BufferedOutputStream.java:82)
        at java.io.BufferedOutputStream.flush(BufferedOutputStream.java:140)
        at java.io.PrintStream.write(PrintStream.java:482)
        at org.apache.maven.surefire.booter.ForkingRunListener.writeTestOutput(ForkingRunListener.java:178)
        at org.apache.maven.surefire.report.ConsoleOutputCapture$ForwardingPrintStream.write(ConsoleOutputCapture.java:64)
        at org.apache.maven.surefire.report.ConsoleOutputCapture$ForwardingPrintStream.write(ConsoleOutputCapture.java:73)
        at java.io.FilterOutputStream.write(FilterOutputStream.java:77)
        at org.apache.lucene.util.TestRuleLimitSysouts$DelegateStream.write(TestRuleLimitSysouts.java:134)
        at java.io.FilterOutputStream.write(FilterOutputStream.java:125)
        at org.apache.lucene.util.TestRuleLimitSysouts$DelegateStream.write(TestRuleLimitSysouts.java:128)
        at java.io.PrintStream.write(PrintStream.java:480)
        at sun.nio.cs.StreamEncoder.writeBytes(StreamEncoder.java:221)
        at sun.nio.cs.StreamEncoder.implFlushBuffer(StreamEncoder.java:291)
        at sun.nio.cs.StreamEncoder.implFlush(StreamEncoder.java:295)
        at sun.nio.cs.StreamEncoder.flush(StreamEncoder.java:141)
        at java.io.OutputStreamWriter.flush(OutputStreamWriter.java:229)
        at org.apache.log4j.helpers.QuietWriter.flush(QuietWriter.java:59)
        at org.apache.log4j.WriterAppender.subAppend(WriterAppender.java:324)
        at org.apache.log4j.WriterAppender.append(WriterAppender.java:162)
        at org.apache.log4j.AppenderSkeleton.doAppend(AppenderSkeleton.java:251)
        at org.apache.log4j.helpers.AppenderAttachableImpl.appendLoopOnAppenders(AppenderAttachableImpl.java:66)
        at org.apache.log4j.Category.callAppenders(Category.java:206)
        at org.apache.log4j.Category.forcedLog(Category.java:391)
        at org.apache.log4j.Category.log(Category.java:856)
        at org.slf4j.impl.Log4jLoggerAdapter.info(Log4jLoggerAdapter.java:304)
        at org.apache.solr.cloud.DistributedQueue$LatchChildWatcher.process(DistributedQueue.java:263)
        at org.apache.zookeeper.ClientCnxn$EventThread.processEvent(ClientCnxn.java:522)
        at org.apache.zookeeper.ClientCnxn$EventThread.run(ClientCnxn.java:498)

Stack Trace:
com.carrotsearch.randomizedtesting.ThreadLeakError: 1 thread leaked from SUITE scope at org.apache.solr.cloud.MultiThreadedOCPTest:

   1) Thread[id=18444, name=TEST-MultiThreadedOCPTest.testDistribSearch-seed#[60D21B7C6EEB3333]-EventThread,
state=RUNNABLE, group=TGRP-MultiThreadedOCPTest]
        at java.io.FileOutputStream.writeBytes(Native Method)
        at java.io.FileOutputStream.write(FileOutputStream.java:318)
        at java.io.BufferedOutputStream.flushBuffer(BufferedOutputStream.java:82)
        at java.io.BufferedOutputStream.flush(BufferedOutputStream.java:140)
        at java.io.PrintStream.write(PrintStream.java:482)
        at org.apache.maven.surefire.booter.ForkingRunListener.writeTestOutput(ForkingRunListener.java:178)
        at org.apache.maven.surefire.report.ConsoleOutputCapture$ForwardingPrintStream.write(ConsoleOutputCapture.java:64)
        at org.apache.maven.surefire.report.ConsoleOutputCapture$ForwardingPrintStream.write(ConsoleOutputCapture.java:73)
        at java.io.FilterOutputStream.write(FilterOutputStream.java:77)
        at org.apache.lucene.util.TestRuleLimitSysouts$DelegateStream.write(TestRuleLimitSysouts.java:134)
        at java.io.FilterOutputStream.write(FilterOutputStream.java:125)
        at org.apache.lucene.util.TestRuleLimitSysouts$DelegateStream.write(TestRuleLimitSysouts.java:128)
        at java.io.PrintStream.write(PrintStream.java:480)
        at sun.nio.cs.StreamEncoder.writeBytes(StreamEncoder.java:221)
        at sun.nio.cs.StreamEncoder.implFlushBuffer(StreamEncoder.java:291)
        at sun.nio.cs.StreamEncoder.implFlush(StreamEncoder.java:295)
        at sun.nio.cs.StreamEncoder.flush(StreamEncoder.java:141)
        at java.io.OutputStreamWriter.flush(OutputStreamWriter.java:229)
        at org.apache.log4j.helpers.QuietWriter.flush(QuietWriter.java:59)
        at org.apache.log4j.WriterAppender.subAppend(WriterAppender.java:324)
        at org.apache.log4j.WriterAppender.append(WriterAppender.java:162)
        at org.apache.log4j.AppenderSkeleton.doAppend(AppenderSkeleton.java:251)
        at org.apache.log4j.helpers.AppenderAttachableImpl.appendLoopOnAppenders(AppenderAttachableImpl.java:66)
        at org.apache.log4j.Category.callAppenders(Category.java:206)
        at org.apache.log4j.Category.forcedLog(Category.java:391)
        at org.apache.log4j.Category.log(Category.java:856)
        at org.slf4j.impl.Log4jLoggerAdapter.info(Log4jLoggerAdapter.java:304)
        at org.apache.solr.cloud.DistributedQueue$LatchChildWatcher.process(DistributedQueue.java:263)
        at org.apache.zookeeper.ClientCnxn$EventThread.processEvent(ClientCnxn.java:522)
        at org.apache.zookeeper.ClientCnxn$EventThread.run(ClientCnxn.java:498)
	at __randomizedtesting.SeedInfo.seed([60D21B7C6EEB3333]:0)


FAILED:  org.apache.solr.cloud.MultiThreadedOCPTest.testDistribSearch

Error Message:
Task 3002 did not complete, final state: running

Stack Trace:
java.lang.AssertionError: Task 3002 did not complete, final state: running
	at __randomizedtesting.SeedInfo.seed([60D21B7C6EEB3333:E134956419B4530F]:0)
	at org.junit.Assert.fail(Assert.java:93)
	at org.junit.Assert.assertTrue(Assert.java:43)
	at org.apache.solr.cloud.MultiThreadedOCPTest.testDeduplicationOfSubmittedTasks(MultiThreadedOCPTest.java:161)
	at org.apache.solr.cloud.MultiThreadedOCPTest.doTest(MultiThreadedOCPTest.java:70)




Build Log:
[...truncated 55285 lines...]
BUILD FAILED
/usr/home/hudson/hudson-slave/workspace/Lucene-Solr-Maven-4.x/build.xml:490: The following
error occurred while executing this line:
/usr/home/hudson/hudson-slave/workspace/Lucene-Solr-Maven-4.x/build.xml:182: The following
error occurred while executing this line:
/usr/home/hudson/hudson-slave/workspace/Lucene-Solr-Maven-4.x/extra-targets.xml:77: Java returned:
1

Total time: 196 minutes 51 seconds
Build step 'Invoke Ant' marked build as failure
Recording test results
Email was triggered for: Failure
Sending email for trigger: Failure



Mime
View raw message